{"text_format":"1","workbook":"xlsx","n_sheets":9,"sheets":["Form","Data","Report A","Report B","Report C","Report D","Report E","Report F","Report G"],"not_rendered":{"charts":9,"images":13,"macros":1,"external_links":0,"defined_names":8,"comments":0,"pivot_tables":0},"unopened":[{"sheet":"Form","index":0,"reason":"not_a_worksheet"}],"bounds":{"document_bytes":16777216,"sheet_cells":100000,"rows_first":2000,"rows_last":500,"rows_between":2000,"halvings":0,"cell_chars":16384,"cell_head_chars":4096},"cells_cut":0,"cells_raw":0,"read":"whole","date_system":"1900"}

{"sheet":"Data","index":1,"n_rows":82,"n_cols":159,"rows_kept":82,"cut":false,"hidden":true,"merged":[]}
[]
[]
[null,null,"MONTHLY SALES REPORTING BY OUTLET"]
[]
[]
[null,"SUBJECT","DATABASE FOR MONTHLY OUTLET SALES REPORT"]
[]
[null,"OUTLET",{"$f":"MID(CELL(\"FILENAME\",$A$1),FIND(\"[\",CELL(\"FILENAME\",$A$1))+1,3)","v":"TSU"}]
[]
[null,"MONTH / YEAR",{"$f":"INDEX($D$14:$D$25,MONTH(DATE(MID(CELL(\"FILENAME\",$A$1),FIND(\"[\",CELL(\"FILENAME\",$A$1))+4,4),MID(CELL(\"FILENAME\",$A$1),FIND(\"[\",CELL(\"FILENAME\",$A$1))+8,2),1)),1)&\" \"&MID(CELL(\"FILENAME\",$A$1),FIND(\"[\",CELL(\"FILENAME\",$A$1))+4,4)","v":"July 2014"}]
[]
[null,"FILE NAME",{"$f":"MID(CELL(\"FILENAME\",$A$1),1,FIND(\"[\",CELL(\"FILENAME\",$A$1))-1)","v":"C:\\Users\\Lion\\Desktop\\Sales Report\\ROOM OCCUPANCY\\7 JULY 2014\\01TSU\\"}]
[null,null,null,null,null,null,null,null,null,null,null,null,null,null,null,null,null,null,null,null,null,"ROOM"]
[null,"LISTS",2,"January",null,"ALL",null,"BEER EXCHANGE",null,"RECEPTION"]
[null,null,{"$f":"INDEX($C$16:$C$25,$C$14,1)","v":"REPORT B"},"February",null,"NORMAL",null,"BEER PACKAGE",null,"MV / AUDIO"]
[null,null,"REPORT A","March",null,"CHILDREN",null,"BEER SIDE ORDER",null,"F&B"]
[null,null,"REPORT B","April",null,"LADIES",null,"LIQUOR PACKAGE",null,"OVERALL EXPERIENCE"]
[null,null,"REPORT C","May",null,"SENIOR CITIZEN",null,"LIQUOR SIDE ORDER"]
[null,null,"REPORT D","June",null,"STUDENT",null,"MEAL"]
[null,null,"REPORT E","July",null,null,null,"MEMBERSHIP"]
{"$rows_left_out":63}
{"sheet":"Report A","index":2,"n_rows":62,"n_cols":17,"rows_kept":62,"cut":false,"hidden":false,"merged":[]}
[]
[]
[null,null,"MONTHLY SALES REPORTING BY OUTLET"]
[]
[]
[null,"SUBJECT","REPORT A : SALES PERFORMANCE FOR THE MONTH"]
[]
[null,"OUTLET",{"$f":"Data!$C$8","v":"TSU"}]
[]
[null,"MONTH / YEAR",{"$f":"Data!$C$10","v":"July 2014"}]
[]
[null,"MENU"]
[]
[null,"DATE","DAY","ROW",{"$f":"\"SALES FOR \"&IF(MATCH(MID($C$10,1,FIND(\" \",$C$10,1)-1),Data!$D$14:$D$25,0)=1,\"December \"&MID($C$10,FIND(\" \",$C$10,1)+1,4)-1,INDEX(Data!$D$14:$D$25,MATCH(MID($C$10,1,FIND(\" \",$C$10,1)-1),Data!$D$14:$D$25,0)-1,1)&\" \"&MID($C$10,FIND(\" \",$C$10,1)+1,4))","v":"SALES FOR June 2014"},null,null,{"$f":"\"SALES FOR \"&$C$10","v":"SALES FOR July 2014"},null,null,{"$f":"\"SALES FOR \"&MID($C$10,1,FIND(\" \",$C$10,1)-1)&\" \"&MID($C$10,FIND(\" \",$C$10,1)+1,4)-1","v":"SALES FOR July 2013"},null,null,"COMPARISON OF SALES",null,null,"CHART : COMPARISON OF SALES PERFORMANCE"]
[null,null,null,null,{"$f":"IFERROR(MID(CELL(\"FILENAME\",$A$1),1,FIND(\"Reports\",CELL(\"FILENAME\",$A$1))+7)&\"YR\"&MID($E$14,FIND(\"20\",$E$14),4)&\"\\\"&MID($E$14,11,FIND(\"20\",$E$14)-12)&\"\\\"&$C$8&\"\\\",\"\")","v":""},null,null,null,null,null,{"$f":"IFERROR(MID(CELL(\"FILENAME\",$A$1),1,FIND(\"Reports\",CELL(\"FILENAME\",$A$1))+7)&\"YR\"&MID($K$14,FIND(\"20\",$K$14),4)&\"\\\"&MID($K$14,11,FIND(\"20\",$K$14)-12)&\"\\\"&$C$8&\"\\\",\"\")","v":""}]
[null,null,null,null,{"$f":"IFERROR($C$8&MID($E$14,FIND(\"20\",$E$14),4)&TEXT(MATCH(MID($E$14,11,FIND(\"20\",$E$14)-12),Data!$D$14:$D$25,0),\"00\")&\"Sales.xlsm\",\"\")","v":"TSU201406Sales.xlsm"},null,null,null,null,null,{"$f":"IFERROR($C$8&MID($K$14,FIND(\"20\",$K$14),4)&TEXT(MATCH(MID($K$14,11,FIND(\"20\",$K$14)-12),Data!$D$14:$D$25,0),\"00\")&\"Sales.xlsm\",\"\")","v":"TSU201307Sales.xlsm"}]
[null,null,null,null,"A.M.","P.M.","TOTAL","A.M.","P.M.","TOTAL","A.M.","P.M.","TOTAL","LAST MONTH","THIS MONTH","LAST YEAR","SELECT TO VIEW"]
[null,null,null,null,null,null,null,null,null,null,null,null,null,{"$f":"IF($N$20=TRUE,\"A.M.\",IF($O$20=TRUE,\"P.M.\",\"TOTAL\"))","v":"A.M."},{"$f":"$N$18","v":"A.M."},{"$f":"$N$18","v":"A.M."}]
[null,null,null,null,"( RM )","( RM )","( RM )","( RM )","( RM )","( RM )","( RM )","( RM )","( RM )","( RM )","( RM )","( RM )"]
[null,"SUMMARY FOR MONTH",null,null,null,null,null,null,null,null,null,null,null,true,false,false,"LEGEND"]
{"$rows_left_out":43}
{"sheet":"Report B","index":3,"n_rows":61,"n_cols":24,"rows_kept":61,"cut":false,"hidden":false,"merged":[]}
[]
[]
[null,null,"MONTHLY SALES REPORTING BY OUTLET"]
[]
[]
[null,"SUBJECT","REPORT B : ROOM OCCUPANCY AND USAGE OF PARTY ROOMS"]
[]
[null,"OUTLET",{"$f":"Data!$C$8","v":"TSU"}]
[]
[null,"MONTH / YEAR",{"$f":"Data!$C$10","v":"July 2014"}]
[]
[null,"MENU"]
[]
[null,"DATE","DAY","ROW","TOTAL","OCCUPANCY OF ROOMS",null,null,null,null,"% OCCUPANCY OF ROOMS",null,null,null,"USAGE OF PARTY ROOMS",null,null,null,null,null,null,null,null,"CHART : % ROOM OCCUPANCY BY SESSION"]
[null,null,null,null,"ROOMS"]
[null,null,null,null,null,"SESSION",true,null,null,null,"SESSION",null,null,null,"ROOM","PAX","SPENDING","ROOM","PAX","SPENDING","ROOM","PAX","SPENDING"]
[null,null,null,null,null,"NOON K","HAPPY","NORMAL","MIDNIGHT","ALL","NOON K","HAPPY","NORMAL","MIDNIGHT","201",null,null,"217",null,null,"308"]
[null,null,null,null,"( ROOMS )","( rooms )","( rooms )","( rooms )","( rooms )","( rooms )","( % )","( % )","( % )","( % )",null,"( pax )","( RM )",null,"( pax )","( RM )",null,"( pax )","( RM )"]
[null,"SUMMARY FOR MONTH",null,null,null,null,null,null,null,null,null,null,null,null,null,null,null,null,null,null,null,null,null,"LEGEND"]
[null,"TOTAL ROOM OCCUPANCY",null,null,null,{"$f":"IF($G$16=TRUE,SUM(F$31:F$61),\"\")","v":814},{"$f":"IF($G$16=TRUE,SUM(G$31:G$61),\"\")","v":960},1655,278,3707,null,null,null,null,{"$f":"SUM(O$31:O$61)","v":20},375,9436.8999999999978,28,509,10186.799999999999,19,215,3832.1]
{"$rows_left_out":42}
{"sheet":"Report C","index":4,"n_rows":61,"n_cols":15,"rows_kept":61,"cut":false,"hidden":false,"merged":[]}
[]
[]
[null,null,"MONTHLY SALES REPORTING BY OUTLET"]
[]
[]
[null,"SUBJECT","REPORT C : PAX BY CATEGORY AND AVERAGE PAX PER ROOM"]
[]
[null,"OUTLET",{"$f":"Data!$C$8","v":"TSU"}]
[]
[null,"MONTH / YEAR",{"$f":"Data!$C$10","v":"July 2014"}]
[]
[null,"MENU"]
[]
[null,"DATE","DAY","ROW","TOTAL PAX PER SESSION BY CATEGORY",null,null,null,null,"AVERAGE PAX PER ROOM BY ALL CATEGORY",null,null,null,null,{"$f":"\"CHART : PAX BY \"&$G$15&\" ( CATEGORY ) AND AVERAGE PAX PER ROOM\"","v":"CHART : PAX BY STUDENT ( CATEGORY ) AND AVERAGE PAX PER ROOM"}]
[null,null,null,null,"CHOOSE CATEGORY",null,"STUDENT"]
[null,null,null,null,"NOON K","HAPPY","NORMAL","MIDNIGHT","ALL","NOON K","HAPPY","NORMAL","MIDNIGHT","ALL"]
[null,null,null,null,"( pax )","( pax )","( pax )","( pax )","( pax )","( pax )","( pax )","( pax )","( pax )","( pax )"]
[null,"SUMMARY FOR MONTH",null,null,null,null,null,null,null,null,null,null,null,null,"LEGEND"]
[]
[null,"TOTAL PAX",null,null,{"$f":"SUM(E$31:E$61)","v":0},{"$f":"SUM(F$31:F$61)","v":309},0,0,309,112.1491316125668,120.48935512947524,107.87454827141066,139.10122793872793,114.8527320573411]
{"$rows_left_out":42}
{"sheet":"Report D","index":5,"n_rows":59,"n_cols":11,"rows_kept":59,"cut":false,"hidden":false,"merged":[]}
[]
[]
[null,null,"MONTHLY SALES REPORTING BY OUTLET"]
[]
[]
[null,"SUBJECT","REPORT D : AVERAGE SALES PER ROOM AND AVERAGE SALES PER PAX"]
[]
[null,"OUTLET",{"$f":"Data!$C$8","v":"TSU"}]
[]
[null,"MONTH / YEAR",{"$f":"Data!$C$10","v":"July 2014"}]
[]
[null,"MENU"]
[]
[null,"DATE","DAY","ROW","AVERAGE SALES PER ROOM",null,null,"AVERAGE SALES PER PAX",null,null,"CHART : AVERAGE SALES PER ROOM AND AVERAGE SALES PER PAX"]
[null,null,null,null,"A.M.","P.M.","TOTAL","A.M.","P.M.","TOTAL"]
[]
[null,null,null,null,"( RM )","( RM )","( RM )","( RM )","( RM )","( RM )"]
[null,"SUMMARY FOR MONTH",null,null,null,null,null,null,null,null,"LEGEND"]
[null,"AVERAGE SALES",null,null,{"$f":"IFERROR(SUM(E$29:E$59)/COUNTIF($D$29:$D$59,\">0\"),\"\")","v":65.518780726752922},{"$f":"IFERROR(SUM(F$29:F$59)/COUNTIF($D$29:$D$59,\">0\"),\"\")","v":80.614614562196167},72.543159896623479,17.500203033620899,21.995445097096923,19.537794915026421]
[null,"HIGHEST SALES",null,null,{"$f":"IFERROR(IF(LARGE(E$29:E$59,1)>0,LARGE(E$29:E$59,1),\"NIL\"),\"NIL\")","v":104.22499999999999},{"$f":"IFERROR(IF(LARGE(F$29:F$59,1)>0,LARGE(F$29:F$59,1),\"NIL\"),\"NIL\")","v":138.51014492753623},112.02920353982302,22.557608695652174,36.47786259541985,30.069596199524945]
{"$rows_left_out":40}
{"sheet":"Report E","index":6,"n_rows":60,"n_cols":29,"rows_kept":60,"cut":false,"hidden":false,"merged":[]}
[]
[]
[null,null,"MONTHLY SALES REPORTING BY OUTLET"]
[]
[]
[null,"SUBJECT","REPORT E : PERFORMANCE OF PROMOTIONAL SALES"]
[]
[null,"OUTLET",{"$f":"Data!$C$8","v":"TSU"}]
[]
[null,"MONTH / YEAR",{"$f":"Data!$C$10","v":"July 2014"}]
[]
[null,"MENU"]
[]
[null,"DATE","DAY","ROW","TYPE 01","TYPE 02","TYPE 03","TYPE 04","TYPE 05","TYPE 06","TYPE 07","TYPE 08","TYPE 09","TYPE 10","LIST 01","LIST 02","LIST 03","LIST 04","LIST 05","LIST 06","LIST 07","LIST 08","LIST 09","CHOOSE PROMOTION",null,"Tiger (2+1) Round",null,null,{"$f":"\"CHART : PERFORMANCE OF \"&$Z$14","v":"CHART : PERFORMANCE OF Tiger (2+1) Round"}]
[null,null,null,null,null,null,null,null,null,null,null,null,null,null,"TYPE 01","TYPE 03","TYPE 05","TYPE 07","TYPE 09","LIST 01","LIST 03","LIST 05","LIST 07"]
[null,null,null,null,null,null,null,null,null,null,null,null,null,null,"TYPE 02","TYPE 04","TYPE 06","TYPE 08","TYPE 10","LIST 02","LIST 04","LIST 06","LIST 08","NOON K","HAPPY","NORMAL","MIDNIGHT","ALL"]
[null,null,null,null,"AT","AY","BD","BI","BN","BS","BX","CC","CH","CM",null,null,null,null,null,null,null,null,null,"( item )","( item )","( item )","( item )","( item )"]
[null,"SUMMARY FOR MONTH",null,null,null,null,null,null,null,null,null,null,null,null,null,null,null,null,null,null,null,null,null,null,null,null,null,null,"LEGEND"]
[null,"TOTAL SALES",null,null,null,null,null,null,null,null,null,null,null,null,null,null,null,null,null,null,null,null,null,{"$f":"SUM(X$30:X$60)","v":0},{"$f":"SUM(Y$30:Y$60)","v":0},13,0,13]
[null,"AVERAGE SALES",null,null,null,null,null,null,null,null,null,null,null,null,null,null,null,null,null,null,null,null,null,{"$f":"IFERROR(SUM(X$30:X$60)/COUNTIF($D$30:$D$60,\">0\"),\"\")","v":0},{"$f":"IFERROR(SUM(Y$30:Y$60)/COUNTIF($D$30:$D$60,\">0\"),\"\")","v":0},0.41935483870967744,0,0.41935483870967744]
{"$rows_left_out":41}
{"sheet":"Report F","index":7,"n_rows":60,"n_cols":10,"rows_kept":60,"cut":false,"hidden":false,"merged":[]}
[]
[]
[null,null,"MONTHLY SALES REPORTING BY OUTLET"]
[]
[]
[null,"SUBJECT","REPORT F : PERFORMANCE OF F&B SALES AND MEMBERSHIP SUBSCRIPTIONS"]
[]
[null,"OUTLET",{"$f":"Data!$C$8","v":"TSU"}]
[]
[null,"MONTH / YEAR",{"$f":"Data!$C$10","v":"July 2014"}]
[]
[null,"MENU"]
[]
[null,"DATE","DAY","ROW","CHOOSE CATEGORY",null,"MEAL",null,null,{"$f":"\"CHART : SALES PERFORMANCE OF \"&$G$14","v":"CHART : SALES PERFORMANCE OF MEAL"}]
[]
[null,null,null,null,"NOON K","HAPPY","NORMAL","MIDNIGHT","ALL"]
[null,null,null,null,{"$f":"IF(OR($G$14=\"BEER EXCHANGE\",$G$14=\"BEER PACKAGE\",$G$14=\"BEER SIDE ORDER\",$G$14=\"LIQUOR PACKAGE\",$G$14=\"LIQUOR SIDE ORDER\",$G$14=\"WINE\"),\"( bottle )\",IF($G$14=\"MEAL\",\"( set )\",\"( subsription )\"))","v":"( set )"},{"$f":"$E$17","v":"( set )"},{"$f":"$E$17","v":"( set )"},"( set )","( set )"]
[null,"SUMMARY FOR MONTH",null,null,null,null,null,null,null,"LEGEND"]
[null,{"$f":"\"TOTAL \"&IF($G$14=\"MEMBERSHIP\",\"SUBSCRIPTIONS\",\"SALES\")","v":"TOTAL SALES"},null,null,{"$f":"SUM(E$30:E$60)","v":0},{"$f":"SUM(F$30:F$60)","v":0},2186,0,2186]
[null,{"$f":"\"AVERAGE \"&IF($G$14=\"MEMBERSHIP\",\"SUBSCRIPTIONS\",\"SALES\")","v":"AVERAGE SALES"},null,null,{"$f":"IFERROR(SUM(E$30:E$60)/COUNTIF($D$30:$D$60,\">0\"),\"\")","v":0},{"$f":"IFERROR(SUM(F$30:F$60)/COUNTIF($D$30:$D$60,\">0\"),\"\")","v":0},70.516129032258064,0,70.516129032258064]
{"$rows_left_out":41}
{"sheet":"Report G","index":8,"n_rows":59,"n_cols":33,"rows_kept":59,"cut":false,"hidden":false,"merged":[]}
[]
[]
[null,null,"MONTHLY SERVICE REPORTING BY OUTLET"]
[]
[]
[null,"SUBJECT","REPORT G : CUSTOMER SATISFACTION FROM FEEDBACK"]
[]
[null,"OUTLET",{"$f":"Data!$C$8","v":"TSU"}]
[]
[null,"MONTH / YEAR",{"$f":"Data!$C$10","v":"July 2014"}]
[]
[null,"MENU"]
[]
[null,"DATE","DAY","ROW","RATINGS FROM FEEDBACK FORMS",null,null,null,null,null,null,null,null,null,null,null,"QUESTIONAIRE FROM FEEDBACK FORMS",null,null,null,null,null,null,"OTHER VALUABLE COMMENTS FROM CUSTOMERS",null,null,null,null,null,null,null,null,"CHART G1 : MONTHLY % RATING FROM FEEDBACK FORMS"]
[null,null,null,null,"CHOOSE AREA OF RATING",null,null,null,null,null,"F&B",null,null,null,null,null,"QUESTION 01",null,null,null,null,"QUESTION 02",null,null,null,null,null,null,null,null,null,null,"CHART G2 : MONTHLY % RESPONSE TO QUESTIONAIRE FROM FEEDBACK FORMS"]
[null,null,null,null,"TOTAL","EXCELLENT","GOOD","NORMAL","POOR","EXCELLENT","GOOD","NORMAL","POOR","TOTAL","YES","NO","YES","NO","TOTAL","YES","NO","YES","NO","TOTAL","J","L","LL","LLL","J","L","LL","LLL","CHART G3 : MONTHLY % ( UNSOLICITED ) COMMENTS FROM FEEDBACK FORMS"]
[null,null,null,null,"( rating )","( rating )","( rating )","( rating )","( rating )","( % )","( % )","( % )","( % )","( rating )","( rating )","( rating )","( % )","( % )","( rating )","( rating )","( rating )","( % )","( % )","( rating )","( rating )","( rating )","( rating )","( rating )","( % )","( % )","( % )","( % )"]
[null,"SUMMARY FOR MONTH"]
[null,"% RATING FOR MONTH",null,null,{"$f":"SUM(E$29:E$59)","v":0},{"$f":"SUM(F$29:F$59)","v":0},0,0,0,{"$f":"IFERROR($F19/$E19,\"\")","v":""},{"$f":"IFERROR($G19/$E19,\"\")","v":""},{"$f":"IFERROR($H19/$E19,\"\")","v":""},{"$f":"IFERROR($I19/$E19,\"\")","v":""},{"$f":"SUM(N$29:N$59)","v":0},{"$f":"SUM(O$29:O$59)","v":0},0,{"$f":"IFERROR($O19/$N19,\"\")","v":""},{"$f":"IFERROR($P19/$N19,\"\")","v":""},{"$f":"SUM(S$29:S$59)","v":0},{"$f":"SUM(T$29:T$59)","v":0},0,{"$f":"IFERROR($T19/$S19,\"\")","v":""},{"$f":"IFERROR($U19/$S19,\"\")","v":""},{"$f":"SUM(X$29:X$59)","v":0},{"$f":"SUM(Y$29:Y$59)","v":0},0,0,0,{"$f":"IFERROR($Y19/$X19,\"\")","v":""},{"$f":"IFERROR($Z19/$X19,\"\")","v":""},{"$f":"IFERROR($AA19/$X19,\"\")","v":""},{"$f":"IFERROR($AB19/$X19,\"\")","v":""},"CHART G1"]
[null,"HIGHEST % RATING",null,null,{"$f":"IFERROR(IF(LARGE(E$29:E$59,1)>0,LARGE(E$29:E$59,1),\"NIL\"),\"NIL\")","v":"NIL"},{"$f":"IFERROR(IF(LARGE(F$29:F$59,1)>0,LARGE(F$29:F$59,1),\"NIL\"),\"NIL\")","v":"NIL"},"NIL","NIL","NIL",{"$f":"IFERROR(IF(LARGE(J$29:J$59,1)>0,LARGE(J$29:J$59,1),\"NIL\"),\"NIL\")","v":"NIL"},"NIL","NIL","NIL",{"$f":"IFERROR(IF(LARGE(N$29:N$59,1)>0,LARGE(N$29:N$59,1),\"NIL\"),\"NIL\")","v":"NIL"},{"$f":"IFERROR(IF(LARGE(O$29:O$59,1)>0,LARGE(O$29:O$59,1),\"NIL\"),\"NIL\")","v":"NIL"},"NIL","NIL","NIL",{"$f":"IFERROR(IF(LARGE(S$29:S$59,1)>0,LARGE(S$29:S$59,1),\"NIL\"),\"NIL\")","v":"NIL"},{"$f":"IFERROR(IF(LARGE(T$29:T$59,1)>0,LARGE(T$29:T$59,1),\"NIL\"),\"NIL\")","v":"NIL"},"NIL","NIL","NIL",{"$f":"IFERROR(IF(LARGE(X$29:X$59,1)>0,LARGE(X$29:X$59,1),\"NIL\"),\"NIL\")","v":"NIL"},{"$f":"IFERROR(IF(LARGE(Y$29:Y$59,1)>0,LARGE(Y$29:Y$59,1),\"NIL\"),\"NIL\")","v":"NIL"},"NIL","NIL","NIL","NIL","NIL","NIL","NIL"]
{"$rows_left_out":39}