{"text_format":"1","workbook":"xlsx","n_sheets":9,"sheets":["Form","Data","Report A","Report B","Report C","Report D","Report E","Report F","Report G"],"not_rendered":{"charts":9,"images":13,"macros":1,"external_links":0,"defined_names":8,"comments":0,"pivot_tables":0},"unopened":[{"sheet":"Form","index":0,"reason":"not_a_worksheet"}],"bounds":{"document_bytes":16777216,"sheet_cells":100000,"rows_first":2000,"rows_last":500,"rows_between":2000,"halvings":0,"cell_chars":16384,"cell_head_chars":4096},"cells_cut":0,"cells_raw":0,"read":"whole","date_system":"1900"}

{"sheet":"Data","index":1,"n_rows":82,"n_cols":159,"rows_kept":82,"cut":false,"hidden":true,"merged":[]}
[]
[]
[null,null,"MONTHLY SALES REPORTING BY OUTLET"]
[]
[]
[null,"SUBJECT","DATABASE FOR MONTHLY OUTLET SALES REPORT"]
[]
[null,"OUTLET",{"$f":"MID(CELL(\"FILENAME\",$A$1),FIND(\"[\",CELL(\"FILENAME\",$A$1))+1,3)","v":"TSU"}]
[]
[null,"MONTH / YEAR",{"$f":"INDEX($D$14:$D$25,MONTH(DATE(MID(CELL(\"FILENAME\",$A$1),FIND(\"[\",CELL(\"FILENAME\",$A$1))+4,4),MID(CELL(\"FILENAME\",$A$1),FIND(\"[\",CELL(\"FILENAME\",$A$1))+8,2),1)),1)&\" \"&MID(CELL(\"FILENAME\",$A$1),FIND(\"[\",CELL(\"FILENAME\",$A$1))+4,4)","v":"July 2014"}]
[]
[null,"FILE NAME",{"$f":"MID(CELL(\"FILENAME\",$A$1),1,FIND(\"[\",CELL(\"FILENAME\",$A$1))-1)","v":"C:\\Users\\Lion\\Desktop\\Sales Report\\ROOM OCCUPANCY\\7 JULY 2014\\01TSU\\"}]
[null,null,null,null,null,null,null,null,null,null,null,null,null,null,null,null,null,null,null,null,null,"ROOM"]
[null,"LISTS",2,"January",null,"ALL",null,"BEER EXCHANGE",null,"RECEPTION"]
[null,null,{"$f":"INDEX($C$16:$C$25,$C$14,1)","v":"REPORT B"},"February",null,"NORMAL",null,"BEER PACKAGE",null,"MV / AUDIO"]
[null,null,"REPORT A","March",null,"CHILDREN",null,"BEER SIDE ORDER",null,"F&B"]
[null,null,"REPORT B","April",null,"LADIES",null,"LIQUOR PACKAGE",null,"OVERALL EXPERIENCE"]
[null,null,"REPORT C","May",null,"SENIOR CITIZEN",null,"LIQUOR SIDE ORDER"]
[null,null,"REPORT D","June",null,"STUDENT",null,"MEAL"]
[null,null,"REPORT E","July",null,null,null,"MEMBERSHIP"]
[null,null,"REPORT F","August",null,null,null,"WINE"]
[null,null,"REPORT G","September"]
[null,null,"DATA","October"]
[null,null,null,"November"]
[null,null,null,"December"]
[]
[null,"MENU"]
[]
[null,"DATE","DATE","PUBLIC","PUBLIC","SALES",null,null,null,"ROOMS USED",null,null,null,null,null,null,null,null,null,null,null,null,null,null,null,null,null,null,null,null,null,null,null,null,"PAX",null,null,null,null,null,null,null,null,null,null,"PROMOTION",null,null,null,null,null,null,null,null,null,null,null,null,null,null,null,null,null,null,null,null,null,null,null,null,null,null,null,null,null,null,null,null,null,null,null,null,null,null,null,null,null,null,null,null,null,null,null,null,null,"KITCHEN",null,null,null,"MEMBERSHIP",null,null,null,"BEER PACKAGE",null,null,null,"BEER EXCHANGE",null,null,null,"BEER BOTTLE",null,null,null,"BEER BUCKET",null,null,null,"BEER ROUND",null,null,null,"LIQUOR PACKAGE",null,null,null,"LIQUOR SIDE ORDER",null,null,null,"WINE PACKAGE",null,null,null,{"$f":"$J$14","v":"RECEPTION"},null,null,null,{"$f":"$J$15","v":"MV / AUDIO"},null,null,null,{"$f":"$J$16","v":"F&B"},null,null,null,{"$f":"$J$17","v":"OVERALL EXPERIENCE"},null,null,null,"QUESTION 01",null,"QUESTION 02",null,"COMPLIMENT / COMPLAINT"]
[null,null,null,"HOLIDAY","HOLIDAY","CASH A.M.","CARD A.M.","CASH P.M.","CARD P.M.","ROOMS","NOON K","HAPPY","NORMAL","MIDNIGHT","PARTY ROOMS","TIME","PAX","AMOUNT","PARTY ROOMS","TIME","PAX","AMOUNT","PARTY ROOMS","TIME","PAX","AMOUNT","PARTY ROOMS","TIME","PAX","AMOUNT","PARTY ROOMS","TIME","PAX","AMOUNT","NOON K","NOON K","HAPPY","HAPPY","HAPPY","HAPPY","NORMAL","NORMAL","MIDNIGHT","MIDNIGHT","MIDNIGHT","TYPE","NOON K","HAPPY","NORMAL","MIDNIGHT","TYPE","NOON K","HAPPY","NORMAL","MIDNIGHT","TYPE","NOON K","HAPPY","NORMAL","MIDNIGHT","TYPE","NOON K","HAPPY","NORMAL","MIDNIGHT","TYPE","NOON K","HAPPY","NORMAL","MIDNIGHT","TYPE","NOON K","HAPPY","NORMAL","MIDNIGHT","TYPE","NOON K","HAPPY","NORMAL","MIDNIGHT","TYPE","NOON K","HAPPY","NORMAL","MIDNIGHT","TYPE","NOON K","HAPPY","NORMAL","MIDNIGHT","TYPE","NOON K","HAPPY","NORMAL","MIDNIGHT","NOON K","HAPPY","NORMAL","MIDNIGHT","NOON K","HAPPY","NORMAL","MIDNIGHT","NOON K","HAPPY","NORMAL","MIDNIGHT","NOON K","HAPPY","NORMAL","MIDNIGHT","NOON K","HAPPY","NORMAL","MIDNIGHT","NOON K","HAPPY","NORMAL","MIDNIGHT","NOON K","HAPPY","NORMAL","MIDNIGHT","NOON K","HAPPY","NORMAL","MIDNIGHT","NOON K","HAPPY","NORMAL","MIDNIGHT","NOON K","HAPPY","NORMAL","MIDNIGHT","EXCELLENT","GOOD","NORMAL","POOR","EXCELLENT","GOOD","NORMAL","POOR","EXCELLENT","GOOD","NORMAL","POOR","EXCELLENT","GOOD","NORMAL","POOR","YES","NO","YES","NO","J","L","LL","LLL"]
[null,{"$f":"ROW()+1","v":32},null,"EVE",null,null,null,null,null,null,null,null,null,null,null,null,null,null,null,null,null,null,null,null,null,null,null,null,null,null,null,null,null,null,"NORMAL","CHILDREN","NORMAL","CHILDREN","SENIOR","STUDENT","NORMAL","CHILDREN","NORMAL","CHILDREN","LADIES"]
[null,"CELL","C8","K6","K8","C102","D102","C103","D103","D106","C109","C110","C111","C112","E109","F109","G109","H109","E110","F110","G110","H110","E111","F111","G111","H111","E112","F112","G112","H112","E113","F113","G113","H113","C116","D116","C117","D117","F117","G117","C118","D118","C119","D119","E119","B192","D192","E192","F192","G192","B193","D193","E193","F193","G193","B194","D194","E194","F194","G194","B195","D195","E195","F195","G195","B196","D196","E196","F196","G196","B197","D197","E197","F197","G197","B198","D198","E198","F198","G198","B199","D199","E199","F199","G199","B200","D200","E200","F200","G200","B201","D201","E201","F201","G201","D208","E208","F208","G208","D212","E212","F212","G212","D226","E226","F226","G226","D227","E227","F227","G227","D228","E228","F228","G228","D229","E229","F229","G229","D230","E230","F230","G230","D234","E234","F234","G234","D235","E235","F235","G235","D239","E239","F239","G239","C418","D418","E418","F418","C419","D419","E419","F419","C420","D420","E420","F420","C421","D421","E421","F421","F427","G427","F428","G428","D446","E446","F446","G446"]
[null,{"$f":"IFERROR(DATE(MID(CELL(\"FILENAME\",$A$1),FIND(\"[\",CELL(\"FILENAME\",$A$1))+4,4),MID(CELL(\"FILENAME\",$A$1),FIND(\"[\",CELL(\"FILENAME\",$A$1))+8,2),MID($C33,1,2)),\"\")","v":"2014-07-01"},"01 July 2014 Tuesday",false,false,1885.6,0,2090.3000000000002,0,46,14,19,36,8,217,0,14,126,0,0,0,0,0,0,0,0,0,0,0,0,0,0,0,0,41,0,57,0,0,18,104,1,25,0,18,"K-Lunch",34,0,0,0,"LOK-LOK",0,0,0,0,"Member 30%",0,23,38,5,"Member Package",0,0,0,0,"Tiger (2+1) Round",0,0,0,0,"Student Member Card",0,0,0,0,"Student Member Price",0,0,0,0,0,0,0,0,0,0,0,0,0,0,0,0,0,0,0,0,0,58,0,0,0,1,0,0,0,12,0,0,0,0,0,0,0,2,0,0,0,12,0,0,0,0,0,0,0,0,0,0,0,0,0,0,0,0,0,0,0,0,0,0,0,0,0,0,0,0,0,0,0,0,0,0,0,0,0,0,0,0,0]
[null,{"$f":"IFERROR(DATE(MID(CELL(\"FILENAME\",$A$1),FIND(\"[\",CELL(\"FILENAME\",$A$1))+4,4),MID(CELL(\"FILENAME\",$A$1),FIND(\"[\",CELL(\"FILENAME\",$A$1))+8,2),MID($C34,1,2)),\"\")","v":"2014-07-02"},"02 July 2014 Wednesday",false,false,1949.5,0,1954.9,57.2,46,15,17,35,4,217,0,8,104,0,0,0,0,0,0,0,0,0,0,0,0,0,0,0,0,37,1,62,0,0,23,88,1,11,0,6,"K-Lunch",34,0,0,0,"LOK-LOK",0,0,48,0,"Member 30%",0,0,0,0,"Member Package",0,0,0,0,"Tiger (2+1) Round",0,0,1,0,"Student Member Card",0,0,0,0,"Student Member Price",0,0,0,0,0,0,0,0,0,0,0,0,0,0,0,0,0,0,0,0,0,41,0,0,0,1,0,0,0,0,0,0,0,0,0,0,0,3,0,0,0,52,0,0,0,0,0,0,0,0,0,0,0,0,0,0,0,0,0,0,0,0,0,0,0,0,0,0,0,0,0,0,0,0,0,0,0,0,0,0,0,0,0]
[null,{"$f":"IFERROR(DATE(MID(CELL(\"FILENAME\",$A$1),FIND(\"[\",CELL(\"FILENAME\",$A$1))+4,4),MID(CELL(\"FILENAME\",$A$1),FIND(\"[\",CELL(\"FILENAME\",$A$1))+8,2),MID($C35,1,2)),\"\")","v":"2014-07-03"},"03 July 2014 Thursday",false,false,2276.6,0,2804.1,50.4,46,13,19,55,4,201,0,13,104,217,0,8,64,308,0,5,40,0,0,0,0,0,0,0,0,41,1,64,2,0,16,204,2,13,1,9,"K-Lunch",39,0,0,0,"LOK-LOK",0,0,126,0,"Member 30%",0,0,0,0,"Member Package",0,0,0,0,"Tiger (2+1) Round",0,0,0,0,"Student Member Card",0,0,0,0,"Student Member Price",0,0,0,0,0,0,0,0,0,0,0,0,0,0,0,0,0,0,0,0,0,50,0,0,3,2,1,0,12,0,0,0,0,0,0,0,0,2,0,0,0,16,0,0,0,12,0,0,0,0,0,0,0,0,0,0,0,0,0,0,0,0,0,0,0,0,0,0,0,0,0,0,0,0,0,0,0,0,0,0,0,0,0]
[null,"2014-07-04","04 July 2014 Friday",false,false,3684.7,198.9,6144.9,841.4,46,26,29,64,5,217,0,21,412.9,301,0,8,201.6,0,0,0,0,0,0,0,0,0,0,0,0,86,5,115,3,0,0,212,5,15,0,0,"K-Lunch",80,0,0,0,"LOK-LOK",0,0,192,0,"Member 30%",0,0,0,0,"Member Package",0,0,0,0,"Tiger (2+1) Round",0,0,0,0,"Student Member Card",0,0,0,0,"Student Member Price",0,0,0,0,0,0,0,0,0,0,0,0,0,0,0,0,0,0,0,0,0,82,0,0,3,5,0,0,0,36,0,0,0,0,0,0,0,4,0,0,0,48,0,0,0,24,0,0,0,0,0,0,0,0,0,0,0,0,0,0,0,0,0,0,0,0,0,0,0,0,0,0,0,0,0,0,0,0,0,0,0,0,0]
[null,"2014-07-05","05 July 2014 Saturday",false,false,6724.3,403,9133.4,1302.8,46,35,45,71,18,201,0,39,718,217,0,18,372.6,301,0,26,483.2,308,0,17,463.6,0,0,0,0,129,5,183,8,0,0,259,6,77,2,0,"K-Lunch",120,0,0,0,"LOK-LOK",0,0,138,0,"Member 30%",0,0,0,0,"Member Package",0,0,0,0,"Tiger (2+1) Round",0,0,0,0,"Student Member Card",0,0,0,0,"Student Member Price",0,0,0,0,0,0,0,0,0,0,0,0,0,0,0,0,0,0,0,0,0,115,0,0,4,13,0,0,12,96,24,0,0,0,0,0,0,4,0,0,0,180,0,0,0,72,0,0,0,0,0,0,0,0,0,0,0,0,0,0,0,0,0,0,0,0,0,0,0,0,0,0,0,0,0,0,0,0,0,0,0,0,0]
[null,"2014-07-06","06 July 2014 Sunday",false,false,5770.1,324.2,2753.2,688.4,46,34,49,41,10,201,0,13,427.7,217,0,12,194.4,301,0,6,97.2,308,0,9,162,0,0,0,0,109,2,164,2,0,0,126,1,31,0,22,"K-Lunch",100,0,0,0,"LOK-LOK",0,0,88,0,"Member 30%",0,0,0,0,"Member Package",0,0,0,0,"Tiger (2+1) Round",0,0,0,0,"Student Member Card",0,0,0,0,"Student Member Price",0,0,0,0,0,0,0,0,0,0,0,0,0,0,0,0,0,0,0,0,0,108,0,0,1,1,0,0,24,0,0,0,0,0,0,0,0,3,0,0,0,72,0,0,0,24,0,0,0,0,0,0,0,0,0,0,0,0,0,0,0,0,0,0,0,0,0,0,0,0,0,0,0,0,0,0,0,0,0,0,0,0,0]
[null,"2014-07-07","07 July 2014 Monday",false,false,2773.7,0,4000.2,86.4,46,25,22,68,9,217,0,24,184,301,0,8,32,308,0,8,32,0,0,0,0,0,0,0,0,82,1,60,0,0,19,253,1,28,0,19,"K-Lunch",79,0,0,0,"LOK-LOK",0,0,91,0,"Member 30%",0,0,0,0,"Member Package",0,0,0,0,"Tiger (2+1) Round",0,0,3,0,"Student Member Card",0,0,0,0,"Student Member Price",0,0,0,0,0,0,0,0,0,0,0,0,0,0,0,0,0,0,0,0,0,0,0,0,1,1,0,0,0,12,0,0,0,0,0,0,0,0,0,0,0,64,0,0,0,0,0,0,0,0,0,0,0,0,0,0,0,0,0,0,0,0,0,0,0,0,0,0,0,0,0,0,0,0,0,0,0,0,0,0,0,0,0]
[null,"2014-07-08","08 July 2014 Tuesday",false,false,1697.5,0,3210.5,268,46,9,16,59,11,217,0,17,183.2,201,0,10,40,0,0,0,0,0,0,0,0,0,0,0,0,34,0,46,0,0,3,196,2,42,0,16,"K-Lunch",29,0,0,0,"LOK-LOK",0,0,172,0,"Member 30%",0,30,0,0,"Member Package",0,0,0,0,"Tiger (2+1) Round",0,0,0,0,"Student Member Card",0,0,0,0,"Student Member Price",0,0,0,0,0,0,0,0,0,0,0,0,0,0,0,0,0,0,0,0,0,81,0,0,0,1,0,0,0,0,0,0,0,0,0,0,0,1,0,0,0,24,0,0,0,0,0,0,0,0,0,0,0,0,0,0,0,0,0,0,0,0,0,0,0,0,0,0,0,0,0,0,0,0,0,0,0,0,0,0,0,0,0]
[null,"2014-07-09","09 July 2014 Wednesday",false,false,2240,0,2823.1,172.8,46,23,17,54,10,0,0,0,0,0,0,0,0,0,0,0,0,0,0,0,0,0,0,0,0,62,2,55,1,0,13,179,4,24,0,16,"K-Lunch",59,0,0,0,"LOK-LOK",0,0,106,0,"Member 30%",0,0,0,0,"Member Package",0,0,0,0,"Tiger (2+1) Round",0,0,0,0,"Student Member Card",0,0,0,0,"Student Member Price",0,0,0,0,0,0,0,0,0,0,0,0,0,0,0,0,0,0,0,0,0,76,0,0,1,1,0,0,0,0,0,0,0,0,0,0,0,2,0,0,0,20,0,0,0,12,0,0,0,0,0,0,0,0,0,0,0,0,0,0,0,0,0,0,0,0,0,0,0,0,0,0,0,0,0,0,0,0,0,0,0,0,0]
[null,"2014-07-10","10 July 2014 Thursday",false,false,1945.3,130,2340.4,439.6,46,13,11,63,4,201,0,15,60,301,0,6,20,217,0,7,28,308,0,10,40,0,0,0,0,37,0,36,0,0,19,221,6,10,0,5,"K-Lunch",32,0,0,0,"LOK-LOK",0,0,141,0,"Member 30%",0,0,0,0,"Member Package",0,0,0,0,"Tiger (2+1) Round",0,0,0,0,"Student Member Card",0,0,0,0,"Student Member Price",0,0,0,0,0,0,0,0,0,0,0,0,0,0,0,0,0,0,0,0,0,63,0,0,0,2,0,0,0,12,0,0,0,0,0,0,0,2,0,0,0,20,0,0,0,12,0,0,0,0,0,0,0,0,0,0,0,0,0,0,0,0,0,0,0,0,0,0,0,0,0,0,0,0,0,0,0,0,0,0,0,0,0]
[null,"2014-07-11","11 July 2014 Friday",false,false,3349.9,1236,4818.3,1508.4,46,24,20,48,9,308,0,10,149,301,0,14,208,217,0,11,163.9,201,0,50,1563.8,0,0,0,0,133,2,88,5,0,0,151,7,25,0,0,"K-Lunch",131,0,0,0,"LOK-LOK",0,0,155,0,"Member 30%",0,0,0,0,"Member Package",0,0,0,0,"Tiger (2+1) Round",0,0,0,0,"Student Member Card",0,0,0,0,"Student Member Price",0,0,0,0,0,0,0,0,0,0,0,0,0,0,0,0,0,0,0,0,0,74,0,0,0,8,1,0,96,48,12,0,0,0,0,0,0,0,0,0,0,164,0,0,0,24,0,0,0,0,0,0,0,0,0,0,0,0,0,0,0,0,0,0,0,0,0,0,0,0,0,0,0,0,0,0,0,0,0,0,0,0,0]
[null,"2014-07-12","12 July 2014 Saturday",false,false,5977.2,526.9,7675.4,2613.6,46,33,57,69,13,201,0,30,1262,217,0,28,578,308,0,14,199.6,301,0,20,375.6,0,0,0,0,121,1,202,17,0,0,267,2,44,0,0,"K-Lunch",116,0,0,0,"LOK-LOK",0,0,97,0,"Member 30%",0,0,0,0,"Member Package",0,0,0,0,"Tiger (2+1) Round",0,0,0,0,"Student Member Card",0,0,0,0,"Student Member Price",0,0,0,0,0,0,0,0,0,0,0,0,0,0,0,0,0,0,0,0,0,97,0,0,5,5,0,0,0,108,12,0,0,0,0,0,0,1,0,0,0,156,0,0,0,48,0,0,0,0,0,0,0,0,0,0,0,0,0,0,0,0,0,0,0,0,0,0,0,0,0,0,0,0,0,0,0,0,0,0,0,0,0]
[null,"2014-07-13","13 July 2014 Sunday",false,false,5160.8,130,3949.8,916,46,23,48,58,9,301,0,7,113.4,308,0,3,54,217,0,27,776,0,0,0,0,0,0,0,0,69,3,160,4,3,0,181,4,31,0,10,"K-Lunch",52,0,0,0,"LOK-LOK",0,0,182,0,"Member 30%",0,0,0,0,"Member Package",0,0,0,0,"Tiger (2+1) Round",0,0,0,0,"Student Member Card",0,0,0,0,"Student Member Price",0,0,0,0,0,0,0,0,0,0,0,0,0,0,0,0,0,0,0,0,0,96,0,0,2,3,0,0,0,24,0,0,0,0,0,0,0,5,0,0,0,48,0,0,0,12,0,0,0,0,0,0,0,0,0,0,0,0,0,0,0,0,0,0,0,0,0,0,0,0,0,0,0,0,0,0,0,0,0,0,0,0,0]
[null,"2014-07-14","14 July 2014 Monday",false,false,2212.6,0,2356.8000000000002,172.8,46,19,21,62,6,308,0.70833333333333337,8,16,217,0.70833333333333337,9,18,201,0.73958333333333337,10,20,0,0,0,0,0,0,0,0,60,2,59,0,0,14,230,12,17,0,15,"K-Lunch",56,0,0,0,"LOK-LOK",0,0,103,0,"Member 30%",0,0,0,0,"Member Package",0,0,0,0,"Tiger (2+1) Round",0,0,0,0,"Student Member Card",0,0,0,0,"Student Member Price",0,0,0,0,0,0,0,0,0,0,0,0,0,0,0,0,0,0,0,0,0,76,0,0,1,0,0,0,0,12,0,0,0,0,0,0,0,2,0,0,0,40,0,0,0,0,0,0,0,0,0,0,0,0,0,0,0,0,0,0,0,0,0,0,0,0,0,0,0,0,0,0,0,0,0,0,0,0,0,0,0,0,0]
[null,"2014-07-15","15 July 2014 Tuesday",false,false,2254.3000000000002,57.1,2154.4,402.8,46,18,30,30,4,217,0,16,378.4,201,0,8,134.4,0,0,0,0,0,0,0,0,0,0,0,0,56,1,79,3,1,4,104,0,15,0,8,"K-Lunch",55,0,0,0,"LOK-LOK",0,0,47,0,"Member 30%",0,45,92,2,"Member Package",0,0,0,1,"Tiger (2+1) Round",0,0,0,0,"Student Member Card",0,0,0,0,"Student Member Price",0,0,0,0,0,0,0,0,0,0,0,0,0,0,0,0,0,0,0,0,0,52,0,0,4,3,0,0,0,12,12,0,0,0,0,0,0,0,0,0,0,32,0,0,0,24,0,0,0,0,0,0,0,0,0,0,0,0,0,0,0,0,0,0,0,0,0,0,0,0,0,0,0,0,0,0,0,0,0,0,0,0,0]
[null,"2014-07-16","16 July 2014 Wednesday",false,false,0,0,0,0,46,17,19,39,9,201,0,23,441.6,217,0,18,352.9,0,0,0,0,0,0,0,0,0,0,0,0,56,0,78,0,0,6,118,0,33,0,21,"K-Lunch",49,0,0,0,"LOK-LOK",0,0,93,0,"Member 30%",0,0,0,0,"Member Package",0,0,0,0,"Tiger (2+1) Round",0,0,5,0,"Student Member Card",0,0,0,0,"Student Member Price",0,0,0,0,0,0,0,0,0,0,0,0,0,0,0,0,0,0,0,0,0,56,0,0,0,2,0,0,12,12,12,0,0,0,0,0,0,3,0,0,0,100,0,0,0,12,0,0,0,0,0,0,0,0,0,0,0,0,0,0,0,0,0,0,0,0,0,0,0,0,0,0,0,0,0,0,0,0,0,0,0,0,0]
[null,"2014-07-17","17 July 2014 Thursday",false,false,2193.6,168,4529.2,0,46,16,21,41,7,217,0,19,209.1,201,0,10,359.2,0,0,0,0,0,0,0,0,0,0,0,0,52,0,72,2,0,28,130,1,22,0,12,"K-Lunch",46,0,0,0,"LOK-LOK",0,0,35,0,"Member 30%",0,0,0,0,"Member Package",0,0,0,0,"Tiger (2+1) Round",0,0,0,0,"Student Member Card",0,0,0,0,"Student Member Price",0,0,0,0,0,0,0,0,0,0,0,0,0,0,0,0,0,0,0,0,0,59,0,0,2,6,0,0,0,36,12,0,0,0,0,0,0,5,0,0,0,68,0,0,0,24,0,0,0,0,0,0,0,0,0,0,0,0,0,0,0,0,0,0,0,0,0,0,0,0,0,0,0,0,0,0,0,0,0,0,0,0,0]
[null,"2014-07-18","18 July 2014 Friday",false,false,3102.1,0,6252,3305.2,46,27,17,64,5,217,0,24,840,201,0,12,624,301,0,10,526.4,308,0,12,409.6,0,0,0,0,96,5,58,0,0,0,245,4,13,0,0,"K-Lunch",89,0,0,0,"LOK-LOK",0,0,103,0,"Member 30%",0,0,0,0,"Member Package",0,0,0,0,"Tiger (2+1) Round",0,0,0,0,"Student Member Card",0,0,0,0,"Student Member Price",0,0,0,0,0,0,0,0,0,0,0,0,0,0,0,0,0,0,0,0,0,73,0,0,0,8,0,0,12,204,12,0,0,0,0,0,0,0,0,0,0,244,0,0,0,48,0,0,0,0,0,0,0,0,0,0,0,0,0,0,0,0,0,0,0,0,0,0,0,0,0,0,0,0,0,0,0,0,0,0,0,0,0]
[null,"2014-07-19","19 July 2014 Saturday",false,false,5571.1,131.6,9584.7000000000007,1224.8,46,34,53,76,16,201,0,15,722.4,217,0,27,816,301,0,22,576,308,0,14,199.79999999999998,0,0,0,0,105,3,162,11,0,0,287,17,67,0,0,"K-Lunch",100,0,0,0,"LOK-LOK",0,0,214,0,"Member 30%",0,0,0,0,"Member Package",0,0,0,0,"Tiger (2+1) Round",0,0,0,0,"Student Member Card",0,0,0,0,"Student Member Price",0,0,0,0,0,0,0,0,0,0,0,0,0,0,0,0,0,0,0,0,0,119,0,0,5,13,1,0,12,108,48,0,0,0,0,0,0,3,0,0,0,192,0,0,0,0,0,0,0,0,0,0,0,0,0,0,0,0,0,0,0,0,0,0,0,0,0,0,0,0,0,0,0,0,0,0,0,0,0,0,0,0,0]
[null,"2014-07-20","20 July 2014 Sunday",false,false,4853.2,467.2,3396.9,790.7,46,36,51,44,11,217,0,23,629.20000000000005,301,0,2,32.4,308,0,4,36,0,0,0,0,0,0,0,0,111,4,154,7,0,0,136,3,34,0,13,"K-Lunch",104,0,0,0,"LOK-LOK",0,0,53,0,"Member 30%",0,0,0,0,"Member Package",0,0,0,0,"Tiger (2+1) Round",0,0,0,0,"Student Member Card",0,0,0,0,"Student Member Price",0,0,0,0,0,0,0,0,0,0,0,0,0,0,0,0,0,0,0,0,0,57,0,0,5,3,0,0,12,24,24,0,0,0,0,0,0,3,0,0,0,80,0,0,0,36,0,0,0,0,0,0,0,0,0,0,0,0,0,0,0,0,0,0,0,0,0,0,0,0,0,0,0,0,0,0,0,0,0,0,0,0,0]
[null,"2014-07-21","21 July 2014 Monday",false,false,1548.2,127.3,2658.2,86.4,46,20,18,29,11,217,0,4,39.6,0,0,0,0,0,0,0,0,0,0,0,0,0,0,0,0,61,2,57,1,0,21,76,0,34,0,19,"K-Lunch",53,0,0,0,"LOK-LOK",0,0,44,0,"Member 30%",0,0,0,0,"Member Package",0,0,0,0,"Tiger (2+1) Round",0,0,0,0,"Student Member Card",0,0,0,0,"Student Member Price",0,0,0,0,0,0,0,0,0,0,0,0,0,0,0,0,0,0,0,0,0,49,0,0,1,1,0,0,0,0,12,0,0,0,0,0,0,1,0,0,0,40,0,0,0,12,0,0,0,0,0,0,0,0,0,0,0,0,0,0,0,0,0,0,0,0,0,0,0,0,0,0,0,0,0,0,0,0,0,0,0,0,0]
[null,"2014-07-22","22 July 2014 Tuesday",false,false,1398.1,0,3489.1,1028.8,46,16,18,38,12,0,0,0,0,0,0,0,0,0,0,0,0,0,0,0,0,0,0,0,0,46,3,50,0,0,3,123,1,38,0,14,"K-Lunch",38,0,0,0,"LOK-LOK",0,0,101,0,"Member 30%",0,30,79,13,"Member Package",0,0,4,0,"Tiger (2+1) Round",0,0,0,0,"Student Member Card",0,0,0,0,"Student Member Price",0,0,0,0,0,0,0,0,0,0,0,0,0,0,0,0,0,0,0,0,0,50,0,0,1,4,0,0,0,48,0,0,0,0,0,0,0,4,0,0,0,76,0,0,0,24,0,0,0,0,0,0,0,0,0,0,0,0,0,0,0,0,0,0,0,0,0,0,0,0,0,0,0,0,0,0,0,0,0,0,0,0,0]
[null,"2014-07-23","23 July 2014 Wednesday",false,false,1807.3,0,2300.6999999999998,278.39999999999998,46,14,22,25,9,0,0,0,0,0,0,0,0,0,0,0,0,0,0,0,0,0,0,0,0,54,0,57,2,0,8,77,0,30,0,18,"K-Lunch",52,0,0,0,"LOK-LOK",0,0,88,0,"Member 30%",0,0,0,0,"Member Package",0,0,0,0,"Tiger (2+1) Round",0,0,1,0,"Student Member Card",0,0,0,0,"Student Member Price",0,0,0,0,0,0,0,0,0,0,0,0,0,0,0,0,0,0,0,0,0,38,0,0,1,1,0,0,0,0,0,0,0,0,0,0,0,1,0,0,0,16,0,0,0,12,0,0,0,0,0,0,0,0,0,0,0,0,0,0,0,0,0,0,0,0,0,0,0,0,0,0,0,0,0,0,0,0,0,0,0,0,0]
[null,"2014-07-24","24 July 2014 Thursday",false,false,2390.5,0,3574.6,556,46,17,21,35,6,217,0,10,119,201,0,9,95.2,308,0,8,194,0,0,0,0,0,0,0,0,75,5,64,0,0,8,114,2,19,0,9,"K-Lunch",68,0,0,0,"LOK-LOK",0,0,95,0,"Member 30%",0,0,0,0,"Member Package",0,0,0,0,"Tiger (2+1) Round",0,0,0,0,"Student Member Card",0,0,0,0,"Student Member Price",0,0,0,0,0,0,0,0,0,0,0,0,0,0,0,0,0,0,0,0,0,15,0,0,1,1,0,0,0,36,0,0,0,0,0,0,0,4,0,0,0,48,0,0,0,12,0,0,0,0,0,0,0,0,0,0,0,0,0,0,0,0,0,0,0,0,0,0,0,0,0,0,0,0,0,0,0,0,0,0,0,0,0]
[null,"2014-07-25","25 July 2014 Friday",false,false,3413.2,285.3,3984.2,1316.4,46,23,23,49,6,217,0,9,134.1,0,0,0,0,0,0,0,0,0,0,0,0,0,0,0,0,80,1,88,2,0,0,168,7,19,0,0,"K-Lunch",78,0,0,0,"LOK-LOK",0,0,76,0,"Member 30%",0,0,0,0,"Member Package",0,0,0,0,"Tiger (2+1) Round",0,0,0,0,"Student Member Card",0,0,0,0,"Student Member Price",0,0,0,0,0,0,0,0,0,0,0,0,0,0,0,0,0,0,0,0,0,57,0,0,3,5,0,0,12,24,0,0,0,0,0,0,0,0,0,0,0,60,0,0,0,36,0,0,0,0,0,0,0,0,0,0,0,0,0,0,0,0,0,0,0,0,0,0,0,0,0,0,0,0,0,0,0,0,0,0,0,0,0]
[null,"2014-07-26","26 July 2014 Saturday",false,false,7238.6,724.2,8983.2000000000007,2719.6,46,45,51,83,9,201,0,27,596.70000000000005,217,0,33,1094.4000000000001,301,0,22,430.20000000000005,308,0,26,695.4,0,0,0,0,171,3,179,3,0,0,348,7,50,0,0,"K-Lunch",163,0,0,0,"LOK-LOK",0,0,72,0,"Member 30%",0,0,0,0,"Member Package",0,0,0,0,"Tiger (2+1) Round",0,0,0,0,"Student Member Card",0,0,0,0,"Student Member Price",0,0,0,0,0,0,0,0,0,0,0,0,0,0,0,0,0,0,0,0,0,98,0,0,1,11,0,0,0,156,36,0,0,0,0,0,0,1,0,0,0,248,0,0,0,24,0,0,0,0,0,0,0,0,0,0,0,0,0,0,0,0,0,0,0,0,0,0,0,0,0,0,0,0,0,0,0,0,0,0,0,0,0]
[null,"2014-07-27","27 July 2014 Sunday",true,false,7080.5,496.2,10738.5,386,46,47,47,83,15,201,0,35,709.1,217,0,28,633,301,0,28,702.3,308,0,16,273,0,0,0,0,187,15,177,6,0,0,314,7,74,0,0,"K-Lunch",172,0,0,0,"LOK-LOK",0,0,126,0,"Member 30%",0,0,0,0,"Member Package",0,0,0,0,"Tiger (2+1) Round",0,0,0,0,"Student Member Card",0,0,0,0,"Student Member Price",0,0,0,0,0,0,0,0,0,0,0,0,0,0,0,0,0,0,0,0,0,96,0,0,0,1,0,0,12,48,12,0,0,0,0,0,0,3,0,0,0,104,0,0,0,48,0,0,0,0,0,0,0,0,0,0,0,0,0,0,0,0,0,0,0,0,0,0,0,0,0,0,0,0,0,0,0,0,0,0,0,0,0]
[null,"2014-07-28","28 July 2014 Monday",false,true,7112.5,1013.5,7470.2,2171.6999999999998,46,46,46,76,9,217,0,20,351,308,0,15,329.6,301,0,9,320,201,0,16,952,0,0,0,0,191,15,190,12,0,0,305,10,10,0,0,"K-Lunch",167,0,0,0,"LOK-LOK",0,0,187,0,"Member 30%",0,0,0,0,"Member Package",0,0,0,0,"Tiger (2+1) Round",0,0,3,0,"Student Member Card",0,0,0,0,"Student Member Price",0,0,0,0,0,0,0,0,0,0,0,0,0,0,0,0,0,0,0,0,0,110,0,0,0,0,0,0,0,84,0,0,0,0,0,0,0,10,0,0,0,148,0,0,0,12,0,0,0,0,0,0,0,0,0,0,0,0,0,0,0,0,0,0,0,0,0,0,0,0,0,0,0,0,0,0,0,0,0,0,0,0,0]
[null,"2014-07-29","29 July 2014 Tuesday",false,true,6573.5,621.1,5591,517.20000000000005,46,46,46,74,9,201,0,16,250.8,217,0,34,736.4,308,0,15,185.6,301,0,21,385.1,0,0,0,0,204,9,142,10,0,0,257,4,20,0,12,"K-Lunch",193,0,0,0,"LOK-LOK",0,0,138,0,"Member 30%",0,0,0,0,"Member Package",0,0,0,0,"Tiger (2+1) Round",0,0,0,0,"Student Member Card",0,0,0,0,"Student Member Price",0,0,0,0,0,0,0,0,0,0,0,0,0,0,0,0,0,0,0,0,0,84,0,0,1,2,0,0,0,24,0,0,0,0,0,0,0,7,0,0,0,52,0,0,0,24,0,0,0,0,0,0,0,0,0,0,0,0,0,0,0,0,0,0,0,0,0,0,0,0,0,0,0,0,0,0,0,0,0,0,0,0,0]
[null,"2014-07-30","30 July 2014 Wednesday",false,false,4742.3,217.8,4028.3,408,46,42,47,51,10,201,0,20,316,217,0,11,140.4,301,0,14,156.6,308,0,5,49.5,0,0,0,0,187,7,159,3,0,66,172,4,37,2,21,"K-Lunch",170,0,0,0,"LOK-LOK",0,0,107,0,"Member 30%",0,0,0,0,"Member Package",0,0,0,0,"Tiger (2+1) Round",0,0,0,0,"Student Member Card",0,0,0,0,"Student Member Price",0,0,0,0,0,0,0,0,0,0,0,0,0,0,0,0,0,0,0,0,0,102,0,0,0,0,0,0,0,12,0,0,0,0,0,0,0,5,0,0,0,24,0,0,0,0,0,0,0,0,0,0,0,0,0,0,0,0,0,0,0,0,0,0,0,0,0,0,0,0,0,0,0,0,0,0,0,0,0,0,0,0,0]
[null,"2014-07-31","31 July 2014 Thursday",false,false,4532.7,450,3931.2,302.39999999999998,46,44,40,35,10,201,0,4,40,217,0,29,508.29999999999995,301,0,3,35.700000000000003,308,0,16,303.39999999999998,0,0,0,0,175,19,141,3,1,40,144,4,35,1,20,"K-Lunch",153,0,0,0,"LOK-LOK",0,0,49,0,"Member 30%",0,0,0,0,"Member Package",0,0,0,0,"Tiger (2+1) Round",0,0,0,0,"Student Member Card",0,0,0,0,"Student Member Price",0,0,0,0,0,0,0,0,0,0,0,0,0,0,0,0,0,0,0,0,0,54,0,0,1,3,0,0,0,0,12,0,0,0,0,0,0,2,0,0,0,28,0,0,0,24,0,0,0,0,0,0,0,0,0,0,0,0,0,0,0,0,0,0,0,0,0,0,0,0,0,0,0,0,0,0,0,0,0,0,0,0,0]
[null,""]
[null,""]
[null,""]
[null,""]
[null,""]
[null,""]
[null,""]
[null,""]
[null,""]
[null,""]
[null,""]
[null,""]
[null,""]
[null,""]
[null,""]
[null,""]
[null,""]
[null,""]
[null,""]

{"sheet":"Report A","index":2,"n_rows":62,"n_cols":17,"rows_kept":62,"cut":false,"hidden":false,"merged":[]}
[]
[]
[null,null,"MONTHLY SALES REPORTING BY OUTLET"]
[]
[]
[null,"SUBJECT","REPORT A : SALES PERFORMANCE FOR THE MONTH"]
[]
[null,"OUTLET",{"$f":"Data!$C$8","v":"TSU"}]
[]
[null,"MONTH / YEAR",{"$f":"Data!$C$10","v":"July 2014"}]
[]
[null,"MENU"]
[]
[null,"DATE","DAY","ROW",{"$f":"\"SALES FOR \"&IF(MATCH(MID($C$10,1,FIND(\" \",$C$10,1)-1),Data!$D$14:$D$25,0)=1,\"December \"&MID($C$10,FIND(\" \",$C$10,1)+1,4)-1,INDEX(Data!$D$14:$D$25,MATCH(MID($C$10,1,FIND(\" \",$C$10,1)-1),Data!$D$14:$D$25,0)-1,1)&\" \"&MID($C$10,FIND(\" \",$C$10,1)+1,4))","v":"SALES FOR June 2014"},null,null,{"$f":"\"SALES FOR \"&$C$10","v":"SALES FOR July 2014"},null,null,{"$f":"\"SALES FOR \"&MID($C$10,1,FIND(\" \",$C$10,1)-1)&\" \"&MID($C$10,FIND(\" \",$C$10,1)+1,4)-1","v":"SALES FOR July 2013"},null,null,"COMPARISON OF SALES",null,null,"CHART : COMPARISON OF SALES PERFORMANCE"]
[null,null,null,null,{"$f":"IFERROR(MID(CELL(\"FILENAME\",$A$1),1,FIND(\"Reports\",CELL(\"FILENAME\",$A$1))+7)&\"YR\"&MID($E$14,FIND(\"20\",$E$14),4)&\"\\\"&MID($E$14,11,FIND(\"20\",$E$14)-12)&\"\\\"&$C$8&\"\\\",\"\")","v":""},null,null,null,null,null,{"$f":"IFERROR(MID(CELL(\"FILENAME\",$A$1),1,FIND(\"Reports\",CELL(\"FILENAME\",$A$1))+7)&\"YR\"&MID($K$14,FIND(\"20\",$K$14),4)&\"\\\"&MID($K$14,11,FIND(\"20\",$K$14)-12)&\"\\\"&$C$8&\"\\\",\"\")","v":""}]
[null,null,null,null,{"$f":"IFERROR($C$8&MID($E$14,FIND(\"20\",$E$14),4)&TEXT(MATCH(MID($E$14,11,FIND(\"20\",$E$14)-12),Data!$D$14:$D$25,0),\"00\")&\"Sales.xlsm\",\"\")","v":"TSU201406Sales.xlsm"},null,null,null,null,null,{"$f":"IFERROR($C$8&MID($K$14,FIND(\"20\",$K$14),4)&TEXT(MATCH(MID($K$14,11,FIND(\"20\",$K$14)-12),Data!$D$14:$D$25,0),\"00\")&\"Sales.xlsm\",\"\")","v":"TSU201307Sales.xlsm"}]
[null,null,null,null,"A.M.","P.M.","TOTAL","A.M.","P.M.","TOTAL","A.M.","P.M.","TOTAL","LAST MONTH","THIS MONTH","LAST YEAR","SELECT TO VIEW"]
[null,null,null,null,null,null,null,null,null,null,null,null,null,{"$f":"IF($N$20=TRUE,\"A.M.\",IF($O$20=TRUE,\"P.M.\",\"TOTAL\"))","v":"A.M."},{"$f":"$N$18","v":"A.M."},{"$f":"$N$18","v":"A.M."}]
[null,null,null,null,"( RM )","( RM )","( RM )","( RM )","( RM )","( RM )","( RM )","( RM )","( RM )","( RM )","( RM )","( RM )"]
[null,"SUMMARY FOR MONTH",null,null,null,null,null,null,null,null,null,null,null,true,false,false,"LEGEND"]
[null,"TOTAL SALES",null,null,{"$f":"SUM(E$32:E$62)","v":135427.19999999998},{"$f":"SUM(F$32:F$62)","v":210731.50000000003},{"$f":"SUM(G$32:G$62)","v":346158.69999999995},{"$f":"SUM(H$32:H$62)","v":121167.8},{"$f":"SUM(I$32:I$62)","v":163333.90000000002},284501.70000000007,0,0,0]
[null,"AVERAGE SALES",null,null,{"$f":"IFERROR(SUM(E$32:E$62)/COUNTIF($D$32:$D$62,\">0\"),\"\")","v":4368.6193548387091},{"$f":"IFERROR(SUM(F$32:F$62)/COUNTIF($D$32:$D$62,\">0\"),\"\")","v":6797.7903225806458},{"$f":"IFERROR(SUM(G$32:G$62)/COUNTIF($D$32:$D$62,\">0\"),\"\")","v":11166.409677419353},{"$f":"IFERROR(SUM(H$32:H$62)/COUNTIF($D$32:$D$62,\">0\"),\"\")","v":3908.6387096774192},5268.8354838709683,9177.4741935483889,0,0,0]
[null,"HIGHEST SALES",null,null,{"$f":"IFERROR(IF(LARGE(E$32:E$62,1)>0,LARGE(E$32:E$62,1),\"NIL\"),\"NIL\")","v":7245.2},13509.400000000001,20754.600000000002,8126,11702.800000000001,19665.600000000002,"NIL","NIL","NIL"]
[null,"LOWEST SALES",null,null,{"$f":"IFERROR(IF(LARGE(E$32:E$62,COUNTIF(E$32:E$62,\">0\"))<>E$23,LARGE(E$32:E$62,COUNTIF(E$32:E$62,\">0\")),\"NIL\"),\"NIL\")","v":2872.2},3826.7,7353.5,1398.1,2012.1000000000001,3961.6000000000004,"NIL","NIL","NIL"]
[null,"AVERAGE FOR ","MONDAY",null,3578.7749999999996,6261.3249999999998,9840.1,{"$f":"IFERROR(SUMIF($C$32:$C$62,\"Monday*\",H$32:H$62)/COUNTIF($C$32:$C$62,\"Monday*\"),\"\")","v":3696.95},4750.6750000000002,8447.625]
[null,null,"TUESDAY",null,3462.5,4939.5,8402,{"$f":"IFERROR(SUMIF($C$32:$C$62,\"Tuesday*\",H$32:H$62)/COUNTIF($C$32:$C$62,\"Tuesday*\"),\"\")","v":2897.44},3750.4199999999996,6647.8600000000006]
[null,null,"WEDNESDAY",null,4213.18,5379.78,9592.9600000000009,{"$f":"IFERROR(SUMIF($C$32:$C$62,\"Wednesday*\",H$32:H$62)/COUNTIF($C$32:$C$62,\"Wednesday*\"),\"\")","v":2191.38},2404.6800000000003,4596.0600000000004]
[null,null,"THURSDAY",null,3530.3599999999997,6631.5200000000013,10161.879999999999,{"$f":"IFERROR(SUMIF($C$32:$C$62,\"Thursday*\",H$32:H$62)/COUNTIF($C$32:$C$62,\"Thursday*\"),\"\")","v":2817.34},3705.5800000000004,6522.92]
[null,null,"FRIDAY",null,4035.4250000000002,7703.0249999999996,11738.45,{"$f":"IFERROR(SUMIF($C$32:$C$62,\"Friday*\",H$32:H$62)/COUNTIF($C$32:$C$62,\"Friday*\"),\"\")","v":3817.5250000000001},7042.7000000000007,10860.225]
[null,null,"SATURDAY",null,6214.5499999999993,11544.650000000001,17759.2,{"$f":"IFERROR(SUMIF($C$32:$C$62,\"Saturday*\",H$32:H$62)/COUNTIF($C$32:$C$62,\"Saturday*\"),\"\")","v":6824.2249999999995},10809.375,17633.600000000002]
[null,{"$f":"ROW()+COUNTIF($B$32:$B$62,\">0\")","v":62},"SUNDAY",{"$f":"COUNTIF(D32:D62,\">0\")","v":31},6020.5,5985.375,12005.875,{"$f":"IFERROR(SUMIF($C$32:$C$62,\"Sunday*\",H$32:H$62)/COUNTIF($C$32:$C$62,\"Sunday*\"),\"\")","v":6070.55},5904.875,11975.424999999999]
[null,{"$f":"IFERROR(DATE(MID(CELL(\"FILENAME\",$A$1),FIND(\"[\",CELL(\"FILENAME\",$A$1))+4,4),MID(CELL(\"FILENAME\",$A$1),FIND(\"[\",CELL(\"FILENAME\",$A$1))+8,2),1),\"\")","v":"2014-07-01"},{"$f":"IFERROR(IF($B32=\"\",\"\",IF(AND($B32<>\"\",INDEX(Data!$D$33:$D$82,MATCH($B32,Data!$B$33:$B$82,0),1)=TRUE),TEXT($B32,\"DDDD\")&\" +\",IF(AND($B32<>\"\",INDEX(Data!$E$33:$E$82,MATCH($B32,Data!$B$33:$B$82,0),1)=TRUE),TEXT($B32,\"DDDD\")&\" ++\",TEXT($B32,\"DDDD\")))),TEXT($B32,\"DDDD\"))","v":"Tuesday"},{"$f":"IFERROR(IF($B32<>\"\",MATCH($B32,Data!$B$33:$B$82,0),\"\"),\"\")","v":1},3392.2,6221.8,{"$f":"IFERROR($E32+$F32,\"\")","v":9614},{"$f":"IFERROR(INDEX(Data!$F$33:$F$82,$D32,1)+INDEX(Data!$G$33:$G$82,$D32,1),\"\")","v":1885.6},{"$f":"IFERROR(INDEX(Data!$H$33:$H$82,$D32,1)+INDEX(Data!$I$33:$I$82,$D32,1),\"\")","v":2090.3000000000002},{"$f":"IFERROR($H32+$I32,\"\")","v":3975.9},null,null,{"$f":"IFERROR($K32+$L32,\"\")","v":0},{"$f":"IFERROR(IF(N$18=\"A.M.\",$E32,IF(N$18=\"P.M.\",$F32,$G32)),\"\")","v":3392.2},{"$f":"IFERROR(IF(O$18=\"A.M.\",$H32,IF(O$18=\"P.M.\",$I32,$J32)),\"\")","v":1885.6},{"$f":"IFERROR(IF(P$18=\"A.M.\",$K32,IF(P$18=\"P.M.\",$L32,$M32)),\"\")","v":0}]
[null,{"$f":"IFERROR(IF(AND(MONTH($B32+1)=MONTH($B$32),YEAR($B32+1)=YEAR($B$32)),$B32+1,\"\"),\"\")","v":"2014-07-02"},{"$f":"IFERROR(IF($B33=\"\",\"\",IF(AND($B33<>\"\",INDEX(Data!$D$33:$D$82,MATCH($B33,Data!$B$33:$B$82,0),1)=TRUE),TEXT($B33,\"DDDD\")&\" +\",IF(AND($B33<>\"\",INDEX(Data!$E$33:$E$82,MATCH($B33,Data!$B$33:$B$82,0),1)=TRUE),TEXT($B33,\"DDDD\")&\" ++\",TEXT($B33,\"DDDD\")))),TEXT($B33,\"DDDD\"))","v":"Wednesday"},{"$f":"IFERROR(IF($B33<>\"\",MATCH($B33,Data!$B$33:$B$82,0),\"\"),\"\")","v":2},2970.9,5456.8,8427.7000000000007,{"$f":"IFERROR(INDEX(Data!$F$33:$F$82,$D33,1)+INDEX(Data!$G$33:$G$82,$D33,1),\"\")","v":1949.5},{"$f":"IFERROR(INDEX(Data!$H$33:$H$82,$D33,1)+INDEX(Data!$I$33:$I$82,$D33,1),\"\")","v":2012.1000000000001},{"$f":"IFERROR($H33+$I33,\"\")","v":3961.6000000000004},null,null,{"$f":"IFERROR($K33+$L33,\"\")","v":0},{"$f":"IFERROR(IF(N$18=\"A.M.\",$E33,IF(N$18=\"P.M.\",$F33,$G33)),\"\")","v":2970.9},{"$f":"IFERROR(IF(O$18=\"A.M.\",$H33,IF(O$18=\"P.M.\",$I33,$J33)),\"\")","v":1949.5},{"$f":"IFERROR(IF(P$18=\"A.M.\",$K33,IF(P$18=\"P.M.\",$L33,$M33)),\"\")","v":0}]
[null,"2014-07-03",{"$f":"IFERROR(IF($B34=\"\",\"\",IF(AND($B34<>\"\",INDEX(Data!$D$33:$D$82,MATCH($B34,Data!$B$33:$B$82,0),1)=TRUE),TEXT($B34,\"DDDD\")&\" +\",IF(AND($B34<>\"\",INDEX(Data!$E$33:$E$82,MATCH($B34,Data!$B$33:$B$82,0),1)=TRUE),TEXT($B34,\"DDDD\")&\" ++\",TEXT($B34,\"DDDD\")))),TEXT($B34,\"DDDD\"))","v":"Thursday"},{"$f":"IFERROR(IF($B34<>\"\",MATCH($B34,Data!$B$33:$B$82,0),\"\"),\"\")","v":3},3139.6,8148.3,11287.9,{"$f":"IFERROR(INDEX(Data!$F$33:$F$82,$D34,1)+INDEX(Data!$G$33:$G$82,$D34,1),\"\")","v":2276.6},{"$f":"IFERROR(INDEX(Data!$H$33:$H$82,$D34,1)+INDEX(Data!$I$33:$I$82,$D34,1),\"\")","v":2854.5},5131.1000000000004,null,null,0,3139.6,2276.6,{"$f":"IFERROR(IF(P$18=\"A.M.\",$K34,IF(P$18=\"P.M.\",$L34,$M34)),\"\")","v":0}]
[null,"2014-07-04",{"$f":"IFERROR(IF($B35=\"\",\"\",IF(AND($B35<>\"\",INDEX(Data!$D$33:$D$82,MATCH($B35,Data!$B$33:$B$82,0),1)=TRUE),TEXT($B35,\"DDDD\")&\" +\",IF(AND($B35<>\"\",INDEX(Data!$E$33:$E$82,MATCH($B35,Data!$B$33:$B$82,0),1)=TRUE),TEXT($B35,\"DDDD\")&\" ++\",TEXT($B35,\"DDDD\")))),TEXT($B35,\"DDDD\"))","v":"Friday"},{"$f":"IFERROR(IF($B35<>\"\",MATCH($B35,Data!$B$33:$B$82,0),\"\"),\"\")","v":4},3189.6,7064.2,10253.799999999999,{"$f":"IFERROR(INDEX(Data!$F$33:$F$82,$D35,1)+INDEX(Data!$G$33:$G$82,$D35,1),\"\")","v":3883.6},{"$f":"IFERROR(INDEX(Data!$H$33:$H$82,$D35,1)+INDEX(Data!$I$33:$I$82,$D35,1),\"\")","v":6986.2999999999993},10869.9,null,null,0,3189.6,3883.6,0]
[null,"2014-07-05",{"$f":"IFERROR(IF($B36=\"\",\"\",IF(AND($B36<>\"\",INDEX(Data!$D$33:$D$82,MATCH($B36,Data!$B$33:$B$82,0),1)=TRUE),TEXT($B36,\"DDDD\")&\" +\",IF(AND($B36<>\"\",INDEX(Data!$E$33:$E$82,MATCH($B36,Data!$B$33:$B$82,0),1)=TRUE),TEXT($B36,\"DDDD\")&\" ++\",TEXT($B36,\"DDDD\")))),TEXT($B36,\"DDDD\"))","v":"Saturday"},{"$f":"IFERROR(IF($B36<>\"\",MATCH($B36,Data!$B$33:$B$82,0),\"\"),\"\")","v":5},5475.6,12631,18106.599999999999,{"$f":"IFERROR(INDEX(Data!$F$33:$F$82,$D36,1)+INDEX(Data!$G$33:$G$82,$D36,1),\"\")","v":7127.3},{"$f":"IFERROR(INDEX(Data!$H$33:$H$82,$D36,1)+INDEX(Data!$I$33:$I$82,$D36,1),\"\")","v":10436.199999999999},17563.5,null,null,0,5475.6,7127.3,0]
[null,"2014-07-06",{"$f":"IFERROR(IF($B37=\"\",\"\",IF(AND($B37<>\"\",INDEX(Data!$D$33:$D$82,MATCH($B37,Data!$B$33:$B$82,0),1)=TRUE),TEXT($B37,\"DDDD\")&\" +\",IF(AND($B37<>\"\",INDEX(Data!$E$33:$E$82,MATCH($B37,Data!$B$33:$B$82,0),1)=TRUE),TEXT($B37,\"DDDD\")&\" ++\",TEXT($B37,\"DDDD\")))),TEXT($B37,\"DDDD\"))","v":"Sunday"},{"$f":"IFERROR(IF($B37<>\"\",MATCH($B37,Data!$B$33:$B$82,0),\"\"),\"\")","v":6},6792.8,7622.5,14415.3,{"$f":"IFERROR(INDEX(Data!$F$33:$F$82,$D37,1)+INDEX(Data!$G$33:$G$82,$D37,1),\"\")","v":6094.3},{"$f":"IFERROR(INDEX(Data!$H$33:$H$82,$D37,1)+INDEX(Data!$I$33:$I$82,$D37,1),\"\")","v":3441.6},9535.9,null,null,0,6792.8,6094.3,0]
[null,"2014-07-07",{"$f":"IFERROR(IF($B38=\"\",\"\",IF(AND($B38<>\"\",INDEX(Data!$D$33:$D$82,MATCH($B38,Data!$B$33:$B$82,0),1)=TRUE),TEXT($B38,\"DDDD\")&\" +\",IF(AND($B38<>\"\",INDEX(Data!$E$33:$E$82,MATCH($B38,Data!$B$33:$B$82,0),1)=TRUE),TEXT($B38,\"DDDD\")&\" ++\",TEXT($B38,\"DDDD\")))),TEXT($B38,\"DDDD\"))","v":"Monday"},{"$f":"IFERROR(IF($B38<>\"\",MATCH($B38,Data!$B$33:$B$82,0),\"\"),\"\")","v":7},3266.8,7486.5,10753.3,{"$f":"IFERROR(INDEX(Data!$F$33:$F$82,$D38,1)+INDEX(Data!$G$33:$G$82,$D38,1),\"\")","v":2773.7},{"$f":"IFERROR(INDEX(Data!$H$33:$H$82,$D38,1)+INDEX(Data!$I$33:$I$82,$D38,1),\"\")","v":4086.6},6860.2999999999993,null,null,0,3266.8,2773.7,0]
[null,"2014-07-08",{"$f":"IFERROR(IF($B39=\"\",\"\",IF(AND($B39<>\"\",INDEX(Data!$D$33:$D$82,MATCH($B39,Data!$B$33:$B$82,0),1)=TRUE),TEXT($B39,\"DDDD\")&\" +\",IF(AND($B39<>\"\",INDEX(Data!$E$33:$E$82,MATCH($B39,Data!$B$33:$B$82,0),1)=TRUE),TEXT($B39,\"DDDD\")&\" ++\",TEXT($B39,\"DDDD\")))),TEXT($B39,\"DDDD\"))","v":"Tuesday"},{"$f":"IFERROR(IF($B39<>\"\",MATCH($B39,Data!$B$33:$B$82,0),\"\"),\"\")","v":8},3427.8,4113.2,7541,{"$f":"IFERROR(INDEX(Data!$F$33:$F$82,$D39,1)+INDEX(Data!$G$33:$G$82,$D39,1),\"\")","v":1697.5},{"$f":"IFERROR(INDEX(Data!$H$33:$H$82,$D39,1)+INDEX(Data!$I$33:$I$82,$D39,1),\"\")","v":3478.5},5176,null,null,0,3427.8,1697.5,0]
[null,"2014-07-09",{"$f":"IFERROR(IF($B40=\"\",\"\",IF(AND($B40<>\"\",INDEX(Data!$D$33:$D$82,MATCH($B40,Data!$B$33:$B$82,0),1)=TRUE),TEXT($B40,\"DDDD\")&\" +\",IF(AND($B40<>\"\",INDEX(Data!$E$33:$E$82,MATCH($B40,Data!$B$33:$B$82,0),1)=TRUE),TEXT($B40,\"DDDD\")&\" ++\",TEXT($B40,\"DDDD\")))),TEXT($B40,\"DDDD\"))","v":"Wednesday"},{"$f":"IFERROR(IF($B40<>\"\",MATCH($B40,Data!$B$33:$B$82,0),\"\"),\"\")","v":9},4181.6000000000004,4727.5999999999995,8909.2000000000007,{"$f":"IFERROR(INDEX(Data!$F$33:$F$82,$D40,1)+INDEX(Data!$G$33:$G$82,$D40,1),\"\")","v":2240},{"$f":"IFERROR(INDEX(Data!$H$33:$H$82,$D40,1)+INDEX(Data!$I$33:$I$82,$D40,1),\"\")","v":2995.9},5235.8999999999996,null,null,0,4181.6000000000004,2240,0]
[null,"2014-07-10",{"$f":"IFERROR(IF($B41=\"\",\"\",IF(AND($B41<>\"\",INDEX(Data!$D$33:$D$82,MATCH($B41,Data!$B$33:$B$82,0),1)=TRUE),TEXT($B41,\"DDDD\")&\" +\",IF(AND($B41<>\"\",INDEX(Data!$E$33:$E$82,MATCH($B41,Data!$B$33:$B$82,0),1)=TRUE),TEXT($B41,\"DDDD\")&\" ++\",TEXT($B41,\"DDDD\")))),TEXT($B41,\"DDDD\"))","v":"Thursday"},{"$f":"IFERROR(IF($B41<>\"\",MATCH($B41,Data!$B$33:$B$82,0),\"\"),\"\")","v":10},3495.1,4728.8999999999996,8224,{"$f":"IFERROR(INDEX(Data!$F$33:$F$82,$D41,1)+INDEX(Data!$G$33:$G$82,$D41,1),\"\")","v":2075.3000000000002},{"$f":"IFERROR(INDEX(Data!$H$33:$H$82,$D41,1)+INDEX(Data!$I$33:$I$82,$D41,1),\"\")","v":2780},4855.3,null,null,0,3495.1,2075.3000000000002,0]
[null,"2014-07-11",{"$f":"IFERROR(IF($B42=\"\",\"\",IF(AND($B42<>\"\",INDEX(Data!$D$33:$D$82,MATCH($B42,Data!$B$33:$B$82,0),1)=TRUE),TEXT($B42,\"DDDD\")&\" +\",IF(AND($B42<>\"\",INDEX(Data!$E$33:$E$82,MATCH($B42,Data!$B$33:$B$82,0),1)=TRUE),TEXT($B42,\"DDDD\")&\" ++\",TEXT($B42,\"DDDD\")))),TEXT($B42,\"DDDD\"))","v":"Friday"},{"$f":"IFERROR(IF($B42<>\"\",MATCH($B42,Data!$B$33:$B$82,0),\"\"),\"\")","v":11},4095.4,7683.1,11778.5,{"$f":"IFERROR(INDEX(Data!$F$33:$F$82,$D42,1)+INDEX(Data!$G$33:$G$82,$D42,1),\"\")","v":4585.8999999999996},{"$f":"IFERROR(INDEX(Data!$H$33:$H$82,$D42,1)+INDEX(Data!$I$33:$I$82,$D42,1),\"\")","v":6326.7000000000007},10912.6,null,null,0,4095.4,4585.8999999999996,0]
[null,"2014-07-12",{"$f":"IFERROR(IF($B43=\"\",\"\",IF(AND($B43<>\"\",INDEX(Data!$D$33:$D$82,MATCH($B43,Data!$B$33:$B$82,0),1)=TRUE),TEXT($B43,\"DDDD\")&\" +\",IF(AND($B43<>\"\",INDEX(Data!$E$33:$E$82,MATCH($B43,Data!$B$33:$B$82,0),1)=TRUE),TEXT($B43,\"DDDD\")&\" ++\",TEXT($B43,\"DDDD\")))),TEXT($B43,\"DDDD\"))","v":"Saturday"},{"$f":"IFERROR(IF($B43<>\"\",MATCH($B43,Data!$B$33:$B$82,0),\"\"),\"\")","v":12},7245.2,13509.400000000001,20754.600000000002,{"$f":"IFERROR(INDEX(Data!$F$33:$F$82,$D43,1)+INDEX(Data!$G$33:$G$82,$D43,1),\"\")","v":6504.0999999999995},{"$f":"IFERROR(INDEX(Data!$H$33:$H$82,$D43,1)+INDEX(Data!$I$33:$I$82,$D43,1),\"\")","v":10289},16793.099999999999,null,null,0,7245.2,6504.0999999999995,0]
[null,"2014-07-13",{"$f":"IFERROR(IF($B44=\"\",\"\",IF(AND($B44<>\"\",INDEX(Data!$D$33:$D$82,MATCH($B44,Data!$B$33:$B$82,0),1)=TRUE),TEXT($B44,\"DDDD\")&\" +\",IF(AND($B44<>\"\",INDEX(Data!$E$33:$E$82,MATCH($B44,Data!$B$33:$B$82,0),1)=TRUE),TEXT($B44,\"DDDD\")&\" ++\",TEXT($B44,\"DDDD\")))),TEXT($B44,\"DDDD\"))","v":"Sunday"},{"$f":"IFERROR(IF($B44<>\"\",MATCH($B44,Data!$B$33:$B$82,0),\"\"),\"\")","v":13},5629.4000000000005,6836.5,12465.900000000001,{"$f":"IFERROR(INDEX(Data!$F$33:$F$82,$D44,1)+INDEX(Data!$G$33:$G$82,$D44,1),\"\")","v":5290.8},{"$f":"IFERROR(INDEX(Data!$H$33:$H$82,$D44,1)+INDEX(Data!$I$33:$I$82,$D44,1),\"\")","v":4865.8},10156.6,null,null,0,5629.4000000000005,5290.8,0]
[null,"2014-07-14",{"$f":"IFERROR(IF($B45=\"\",\"\",IF(AND($B45<>\"\",INDEX(Data!$D$33:$D$82,MATCH($B45,Data!$B$33:$B$82,0),1)=TRUE),TEXT($B45,\"DDDD\")&\" +\",IF(AND($B45<>\"\",INDEX(Data!$E$33:$E$82,MATCH($B45,Data!$B$33:$B$82,0),1)=TRUE),TEXT($B45,\"DDDD\")&\" ++\",TEXT($B45,\"DDDD\")))),TEXT($B45,\"DDDD\"))","v":"Monday"},{"$f":"IFERROR(IF($B45<>\"\",MATCH($B45,Data!$B$33:$B$82,0),\"\"),\"\")","v":14},4682.8999999999996,5204.8,9887.7000000000007,{"$f":"IFERROR(INDEX(Data!$F$33:$F$82,$D45,1)+INDEX(Data!$G$33:$G$82,$D45,1),\"\")","v":2212.6},{"$f":"IFERROR(INDEX(Data!$H$33:$H$82,$D45,1)+INDEX(Data!$I$33:$I$82,$D45,1),\"\")","v":2529.6000000000004},4742.2000000000007,null,null,0,4682.8999999999996,2212.6,0]
[null,"2014-07-15",{"$f":"IFERROR(IF($B46=\"\",\"\",IF(AND($B46<>\"\",INDEX(Data!$D$33:$D$82,MATCH($B46,Data!$B$33:$B$82,0),1)=TRUE),TEXT($B46,\"DDDD\")&\" +\",IF(AND($B46<>\"\",INDEX(Data!$E$33:$E$82,MATCH($B46,Data!$B$33:$B$82,0),1)=TRUE),TEXT($B46,\"DDDD\")&\" ++\",TEXT($B46,\"DDDD\")))),TEXT($B46,\"DDDD\"))","v":"Tuesday"},{"$f":"IFERROR(IF($B46<>\"\",MATCH($B46,Data!$B$33:$B$82,0),\"\"),\"\")","v":15},4093.5,4806.8999999999996,8900.4,{"$f":"IFERROR(INDEX(Data!$F$33:$F$82,$D46,1)+INDEX(Data!$G$33:$G$82,$D46,1),\"\")","v":2311.4},{"$f":"IFERROR(INDEX(Data!$H$33:$H$82,$D46,1)+INDEX(Data!$I$33:$I$82,$D46,1),\"\")","v":2557.2000000000003},4868.6000000000004,null,null,0,4093.5,2311.4,0]
[null,"2014-07-16",{"$f":"IFERROR(IF($B47=\"\",\"\",IF(AND($B47<>\"\",INDEX(Data!$D$33:$D$82,MATCH($B47,Data!$B$33:$B$82,0),1)=TRUE),TEXT($B47,\"DDDD\")&\" +\",IF(AND($B47<>\"\",INDEX(Data!$E$33:$E$82,MATCH($B47,Data!$B$33:$B$82,0),1)=TRUE),TEXT($B47,\"DDDD\")&\" ++\",TEXT($B47,\"DDDD\")))),TEXT($B47,\"DDDD\"))","v":"Wednesday"},{"$f":"IFERROR(IF($B47<>\"\",MATCH($B47,Data!$B$33:$B$82,0),\"\"),\"\")","v":16},4354.2,5840.1,10194.299999999999,{"$f":"IFERROR(INDEX(Data!$F$33:$F$82,$D47,1)+INDEX(Data!$G$33:$G$82,$D47,1),\"\")","v":0},{"$f":"IFERROR(INDEX(Data!$H$33:$H$82,$D47,1)+INDEX(Data!$I$33:$I$82,$D47,1),\"\")","v":0},0,null,null,0,4354.2,0,0]
[null,"2014-07-17",{"$f":"IFERROR(IF($B48=\"\",\"\",IF(AND($B48<>\"\",INDEX(Data!$D$33:$D$82,MATCH($B48,Data!$B$33:$B$82,0),1)=TRUE),TEXT($B48,\"DDDD\")&\" +\",IF(AND($B48<>\"\",INDEX(Data!$E$33:$E$82,MATCH($B48,Data!$B$33:$B$82,0),1)=TRUE),TEXT($B48,\"DDDD\")&\" ++\",TEXT($B48,\"DDDD\")))),TEXT($B48,\"DDDD\"))","v":"Thursday"},{"$f":"IFERROR(IF($B48<>\"\",MATCH($B48,Data!$B$33:$B$82,0),\"\"),\"\")","v":17},4856.2,7123.6,11979.8,{"$f":"IFERROR(INDEX(Data!$F$33:$F$82,$D48,1)+INDEX(Data!$G$33:$G$82,$D48,1),\"\")","v":2361.6},{"$f":"IFERROR(INDEX(Data!$H$33:$H$82,$D48,1)+INDEX(Data!$I$33:$I$82,$D48,1),\"\")","v":4529.2},6890.7999999999993,null,null,0,4856.2,2361.6,0]
[null,"2014-07-18",{"$f":"IFERROR(IF($B49=\"\",\"\",IF(AND($B49<>\"\",INDEX(Data!$D$33:$D$82,MATCH($B49,Data!$B$33:$B$82,0),1)=TRUE),TEXT($B49,\"DDDD\")&\" +\",IF(AND($B49<>\"\",INDEX(Data!$E$33:$E$82,MATCH($B49,Data!$B$33:$B$82,0),1)=TRUE),TEXT($B49,\"DDDD\")&\" ++\",TEXT($B49,\"DDDD\")))),TEXT($B49,\"DDDD\"))","v":"Friday"},{"$f":"IFERROR(IF($B49<>\"\",MATCH($B49,Data!$B$33:$B$82,0),\"\"),\"\")","v":18},5804,7793.8,13597.8,{"$f":"IFERROR(INDEX(Data!$F$33:$F$82,$D49,1)+INDEX(Data!$G$33:$G$82,$D49,1),\"\")","v":3102.1},{"$f":"IFERROR(INDEX(Data!$H$33:$H$82,$D49,1)+INDEX(Data!$I$33:$I$82,$D49,1),\"\")","v":9557.2000000000007},12659.300000000001,null,null,0,5804,3102.1,0]
[null,"2014-07-19",{"$f":"IFERROR(IF($B50=\"\",\"\",IF(AND($B50<>\"\",INDEX(Data!$D$33:$D$82,MATCH($B50,Data!$B$33:$B$82,0),1)=TRUE),TEXT($B50,\"DDDD\")&\" +\",IF(AND($B50<>\"\",INDEX(Data!$E$33:$E$82,MATCH($B50,Data!$B$33:$B$82,0),1)=TRUE),TEXT($B50,\"DDDD\")&\" ++\",TEXT($B50,\"DDDD\")))),TEXT($B50,\"DDDD\"))","v":"Saturday"},{"$f":"IFERROR(IF($B50<>\"\",MATCH($B50,Data!$B$33:$B$82,0),\"\"),\"\")","v":19},6424.5,10153.5,16578,{"$f":"IFERROR(INDEX(Data!$F$33:$F$82,$D50,1)+INDEX(Data!$G$33:$G$82,$D50,1),\"\")","v":5702.7000000000007},{"$f":"IFERROR(INDEX(Data!$H$33:$H$82,$D50,1)+INDEX(Data!$I$33:$I$82,$D50,1),\"\")","v":10809.5},16512.2,null,null,0,6424.5,5702.7000000000007,0]
[null,"2014-07-20",{"$f":"IFERROR(IF($B51=\"\",\"\",IF(AND($B51<>\"\",INDEX(Data!$D$33:$D$82,MATCH($B51,Data!$B$33:$B$82,0),1)=TRUE),TEXT($B51,\"DDDD\")&\" +\",IF(AND($B51<>\"\",INDEX(Data!$E$33:$E$82,MATCH($B51,Data!$B$33:$B$82,0),1)=TRUE),TEXT($B51,\"DDDD\")&\" ++\",TEXT($B51,\"DDDD\")))),TEXT($B51,\"DDDD\"))","v":"Sunday"},{"$f":"IFERROR(IF($B51<>\"\",MATCH($B51,Data!$B$33:$B$82,0),\"\"),\"\")","v":20},6261.8,4775.3999999999996,11037.2,{"$f":"IFERROR(INDEX(Data!$F$33:$F$82,$D51,1)+INDEX(Data!$G$33:$G$82,$D51,1),\"\")","v":5320.4},{"$f":"IFERROR(INDEX(Data!$H$33:$H$82,$D51,1)+INDEX(Data!$I$33:$I$82,$D51,1),\"\")","v":4187.6000000000004},9508,null,null,0,6261.8,5320.4,0]
[null,"2014-07-21",{"$f":"IFERROR(IF($B52=\"\",\"\",IF(AND($B52<>\"\",INDEX(Data!$D$33:$D$82,MATCH($B52,Data!$B$33:$B$82,0),1)=TRUE),TEXT($B52,\"DDDD\")&\" +\",IF(AND($B52<>\"\",INDEX(Data!$E$33:$E$82,MATCH($B52,Data!$B$33:$B$82,0),1)=TRUE),TEXT($B52,\"DDDD\")&\" ++\",TEXT($B52,\"DDDD\")))),TEXT($B52,\"DDDD\"))","v":"Monday"},{"$f":"IFERROR(IF($B52<>\"\",MATCH($B52,Data!$B$33:$B$82,0),\"\"),\"\")","v":21},3010.2,7798.2,10808.4,{"$f":"IFERROR(INDEX(Data!$F$33:$F$82,$D52,1)+INDEX(Data!$G$33:$G$82,$D52,1),\"\")","v":1675.5},{"$f":"IFERROR(INDEX(Data!$H$33:$H$82,$D52,1)+INDEX(Data!$I$33:$I$82,$D52,1),\"\")","v":2744.6},4420.1000000000004,null,null,0,3010.2,1675.5,0]
[null,"2014-07-22",{"$f":"IFERROR(IF($B53=\"\",\"\",IF(AND($B53<>\"\",INDEX(Data!$D$33:$D$82,MATCH($B53,Data!$B$33:$B$82,0),1)=TRUE),TEXT($B53,\"DDDD\")&\" +\",IF(AND($B53<>\"\",INDEX(Data!$E$33:$E$82,MATCH($B53,Data!$B$33:$B$82,0),1)=TRUE),TEXT($B53,\"DDDD\")&\" ++\",TEXT($B53,\"DDDD\")))),TEXT($B53,\"DDDD\"))","v":"Tuesday"},{"$f":"IFERROR(IF($B53<>\"\",MATCH($B53,Data!$B$33:$B$82,0),\"\"),\"\")","v":22},2872.2,5728.9,8601.0999999999985,{"$f":"IFERROR(INDEX(Data!$F$33:$F$82,$D53,1)+INDEX(Data!$G$33:$G$82,$D53,1),\"\")","v":1398.1},{"$f":"IFERROR(INDEX(Data!$H$33:$H$82,$D53,1)+INDEX(Data!$I$33:$I$82,$D53,1),\"\")","v":4517.8999999999996},5916,null,null,0,2872.2,1398.1,0]
[null,"2014-07-23",{"$f":"IFERROR(IF($B54=\"\",\"\",IF(AND($B54<>\"\",INDEX(Data!$D$33:$D$82,MATCH($B54,Data!$B$33:$B$82,0),1)=TRUE),TEXT($B54,\"DDDD\")&\" +\",IF(AND($B54<>\"\",INDEX(Data!$E$33:$E$82,MATCH($B54,Data!$B$33:$B$82,0),1)=TRUE),TEXT($B54,\"DDDD\")&\" ++\",TEXT($B54,\"DDDD\")))),TEXT($B54,\"DDDD\"))","v":"Wednesday"},{"$f":"IFERROR(IF($B54<>\"\",MATCH($B54,Data!$B$33:$B$82,0),\"\"),\"\")","v":23},5488.2,4422.5999999999995,9910.7999999999993,{"$f":"IFERROR(INDEX(Data!$F$33:$F$82,$D54,1)+INDEX(Data!$G$33:$G$82,$D54,1),\"\")","v":1807.3},{"$f":"IFERROR(INDEX(Data!$H$33:$H$82,$D54,1)+INDEX(Data!$I$33:$I$82,$D54,1),\"\")","v":2579.1},4386.3999999999996,null,null,0,5488.2,1807.3,0]
[null,"2014-07-24",{"$f":"IFERROR(IF($B55=\"\",\"\",IF(AND($B55<>\"\",INDEX(Data!$D$33:$D$82,MATCH($B55,Data!$B$33:$B$82,0),1)=TRUE),TEXT($B55,\"DDDD\")&\" +\",IF(AND($B55<>\"\",INDEX(Data!$E$33:$E$82,MATCH($B55,Data!$B$33:$B$82,0),1)=TRUE),TEXT($B55,\"DDDD\")&\" ++\",TEXT($B55,\"DDDD\")))),TEXT($B55,\"DDDD\"))","v":"Thursday"},{"$f":"IFERROR(IF($B55<>\"\",MATCH($B55,Data!$B$33:$B$82,0),\"\"),\"\")","v":24},3203.1,6114.4,9317.5,{"$f":"IFERROR(INDEX(Data!$F$33:$F$82,$D55,1)+INDEX(Data!$G$33:$G$82,$D55,1),\"\")","v":2390.5},{"$f":"IFERROR(INDEX(Data!$H$33:$H$82,$D55,1)+INDEX(Data!$I$33:$I$82,$D55,1),\"\")","v":4130.6000000000004},6521.1,null,null,0,3203.1,2390.5,0]
[null,"2014-07-25",{"$f":"IFERROR(IF($B56=\"\",\"\",IF(AND($B56<>\"\",INDEX(Data!$D$33:$D$82,MATCH($B56,Data!$B$33:$B$82,0),1)=TRUE),TEXT($B56,\"DDDD\")&\" +\",IF(AND($B56<>\"\",INDEX(Data!$E$33:$E$82,MATCH($B56,Data!$B$33:$B$82,0),1)=TRUE),TEXT($B56,\"DDDD\")&\" ++\",TEXT($B56,\"DDDD\")))),TEXT($B56,\"DDDD\"))","v":"Friday"},{"$f":"IFERROR(IF($B56<>\"\",MATCH($B56,Data!$B$33:$B$82,0),\"\"),\"\")","v":25},3052.7,8271,11323.7,{"$f":"IFERROR(INDEX(Data!$F$33:$F$82,$D56,1)+INDEX(Data!$G$33:$G$82,$D56,1),\"\")","v":3698.5},{"$f":"IFERROR(INDEX(Data!$H$33:$H$82,$D56,1)+INDEX(Data!$I$33:$I$82,$D56,1),\"\")","v":5300.6},8999.1,null,null,0,3052.7,3698.5,0]
[null,"2014-07-26",{"$f":"IFERROR(IF($B57=\"\",\"\",IF(AND($B57<>\"\",INDEX(Data!$D$33:$D$82,MATCH($B57,Data!$B$33:$B$82,0),1)=TRUE),TEXT($B57,\"DDDD\")&\" +\",IF(AND($B57<>\"\",INDEX(Data!$E$33:$E$82,MATCH($B57,Data!$B$33:$B$82,0),1)=TRUE),TEXT($B57,\"DDDD\")&\" ++\",TEXT($B57,\"DDDD\")))),TEXT($B57,\"DDDD\"))","v":"Saturday"},{"$f":"IFERROR(IF($B57<>\"\",MATCH($B57,Data!$B$33:$B$82,0),\"\"),\"\")","v":26},5712.9,9884.7000000000007,15597.6,{"$f":"IFERROR(INDEX(Data!$F$33:$F$82,$D57,1)+INDEX(Data!$G$33:$G$82,$D57,1),\"\")","v":7962.8},{"$f":"IFERROR(INDEX(Data!$H$33:$H$82,$D57,1)+INDEX(Data!$I$33:$I$82,$D57,1),\"\")","v":11702.800000000001},19665.600000000002,null,null,0,5712.9,7962.8,0]
[null,"2014-07-27",{"$f":"IFERROR(IF($B58=\"\",\"\",IF(AND($B58<>\"\",INDEX(Data!$D$33:$D$82,MATCH($B58,Data!$B$33:$B$82,0),1)=TRUE),TEXT($B58,\"DDDD\")&\" +\",IF(AND($B58<>\"\",INDEX(Data!$E$33:$E$82,MATCH($B58,Data!$B$33:$B$82,0),1)=TRUE),TEXT($B58,\"DDDD\")&\" ++\",TEXT($B58,\"DDDD\")))),TEXT($B58,\"DDDD\"))","v":"Sunday +"},{"$f":"IFERROR(IF($B58<>\"\",MATCH($B58,Data!$B$33:$B$82,0),\"\"),\"\")","v":27},5398,4707.1000000000004,10105.1,{"$f":"IFERROR(INDEX(Data!$F$33:$F$82,$D58,1)+INDEX(Data!$G$33:$G$82,$D58,1),\"\")","v":7576.7},{"$f":"IFERROR(INDEX(Data!$H$33:$H$82,$D58,1)+INDEX(Data!$I$33:$I$82,$D58,1),\"\")","v":11124.5},18701.2,null,null,0,5398,7576.7,0]
[null,"2014-07-28",{"$f":"IFERROR(IF($B59=\"\",\"\",IF(AND($B59<>\"\",INDEX(Data!$D$33:$D$82,MATCH($B59,Data!$B$33:$B$82,0),1)=TRUE),TEXT($B59,\"DDDD\")&\" +\",IF(AND($B59<>\"\",INDEX(Data!$E$33:$E$82,MATCH($B59,Data!$B$33:$B$82,0),1)=TRUE),TEXT($B59,\"DDDD\")&\" ++\",TEXT($B59,\"DDDD\")))),TEXT($B59,\"DDDD\"))","v":"Monday ++"},{"$f":"IFERROR(IF($B59<>\"\",MATCH($B59,Data!$B$33:$B$82,0),\"\"),\"\")","v":28},3355.2,4555.8,7911,{"$f":"IFERROR(INDEX(Data!$F$33:$F$82,$D59,1)+INDEX(Data!$G$33:$G$82,$D59,1),\"\")","v":8126},{"$f":"IFERROR(INDEX(Data!$H$33:$H$82,$D59,1)+INDEX(Data!$I$33:$I$82,$D59,1),\"\")","v":9641.9},17767.900000000001,null,null,0,3355.2,8126,0]
[null,"2014-07-29",{"$f":"IFERROR(IF($B60=\"\",\"\",IF(AND($B60<>\"\",INDEX(Data!$D$33:$D$82,MATCH($B60,Data!$B$33:$B$82,0),1)=TRUE),TEXT($B60,\"DDDD\")&\" +\",IF(AND($B60<>\"\",INDEX(Data!$E$33:$E$82,MATCH($B60,Data!$B$33:$B$82,0),1)=TRUE),TEXT($B60,\"DDDD\")&\" ++\",TEXT($B60,\"DDDD\")))),TEXT($B60,\"DDDD\"))","v":"Tuesday ++"},{"$f":"IFERROR(IF($B60<>\"\",MATCH($B60,Data!$B$33:$B$82,0),\"\"),\"\")","v":29},3526.8,3826.7,7353.5,{"$f":"IFERROR(INDEX(Data!$F$33:$F$82,$D60,1)+INDEX(Data!$G$33:$G$82,$D60,1),\"\")","v":7194.6},{"$f":"IFERROR(INDEX(Data!$H$33:$H$82,$D60,1)+INDEX(Data!$I$33:$I$82,$D60,1),\"\")","v":6108.2},13302.8,null,null,0,3526.8,7194.6,0]
[null,"2014-07-30",{"$f":"IFERROR(IF($B61=\"\",\"\",IF(AND($B61<>\"\",INDEX(Data!$D$33:$D$82,MATCH($B61,Data!$B$33:$B$82,0),1)=TRUE),TEXT($B61,\"DDDD\")&\" +\",IF(AND($B61<>\"\",INDEX(Data!$E$33:$E$82,MATCH($B61,Data!$B$33:$B$82,0),1)=TRUE),TEXT($B61,\"DDDD\")&\" ++\",TEXT($B61,\"DDDD\")))),TEXT($B61,\"DDDD\"))","v":"Wednesday"},{"$f":"IFERROR(IF($B61<>\"\",MATCH($B61,Data!$B$33:$B$82,0),\"\"),\"\")","v":30},4071,6451.8,10522.8,{"$f":"IFERROR(INDEX(Data!$F$33:$F$82,$D61,1)+INDEX(Data!$G$33:$G$82,$D61,1),\"\")","v":4960.1000000000004},{"$f":"IFERROR(INDEX(Data!$H$33:$H$82,$D61,1)+INDEX(Data!$I$33:$I$82,$D61,1),\"\")","v":4436.3},9396.4000000000015,null,null,0,4071,4960.1000000000004,0]
[null,"2014-07-31",{"$f":"IFERROR(IF($B62=\"\",\"\",IF(AND($B62<>\"\",INDEX(Data!$D$33:$D$82,MATCH($B62,Data!$B$33:$B$82,0),1)=TRUE),TEXT($B62,\"DDDD\")&\" +\",IF(AND($B62<>\"\",INDEX(Data!$E$33:$E$82,MATCH($B62,Data!$B$33:$B$82,0),1)=TRUE),TEXT($B62,\"DDDD\")&\" ++\",TEXT($B62,\"DDDD\")))),TEXT($B62,\"DDDD\"))","v":"Thursday"},{"$f":"IFERROR(IF($B62<>\"\",MATCH($B62,Data!$B$33:$B$82,0),\"\"),\"\")","v":31},2957.8,7042.4000000000005,10000.200000000001,{"$f":"IFERROR(INDEX(Data!$F$33:$F$82,$D62,1)+INDEX(Data!$G$33:$G$82,$D62,1),\"\")","v":4982.7},{"$f":"IFERROR(INDEX(Data!$H$33:$H$82,$D62,1)+INDEX(Data!$I$33:$I$82,$D62,1),\"\")","v":4233.5999999999995},9216.2999999999993,null,null,0,2957.8,4982.7,0]

{"sheet":"Report B","index":3,"n_rows":61,"n_cols":24,"rows_kept":61,"cut":false,"hidden":false,"merged":[]}
[]
[]
[null,null,"MONTHLY SALES REPORTING BY OUTLET"]
[]
[]
[null,"SUBJECT","REPORT B : ROOM OCCUPANCY AND USAGE OF PARTY ROOMS"]
[]
[null,"OUTLET",{"$f":"Data!$C$8","v":"TSU"}]
[]
[null,"MONTH / YEAR",{"$f":"Data!$C$10","v":"July 2014"}]
[]
[null,"MENU"]
[]
[null,"DATE","DAY","ROW","TOTAL","OCCUPANCY OF ROOMS",null,null,null,null,"% OCCUPANCY OF ROOMS",null,null,null,"USAGE OF PARTY ROOMS",null,null,null,null,null,null,null,null,"CHART : % ROOM OCCUPANCY BY SESSION"]
[null,null,null,null,"ROOMS"]
[null,null,null,null,null,"SESSION",true,null,null,null,"SESSION",null,null,null,"ROOM","PAX","SPENDING","ROOM","PAX","SPENDING","ROOM","PAX","SPENDING"]
[null,null,null,null,null,"NOON K","HAPPY","NORMAL","MIDNIGHT","ALL","NOON K","HAPPY","NORMAL","MIDNIGHT","201",null,null,"217",null,null,"308"]
[null,null,null,null,"( ROOMS )","( rooms )","( rooms )","( rooms )","( rooms )","( rooms )","( % )","( % )","( % )","( % )",null,"( pax )","( RM )",null,"( pax )","( RM )",null,"( pax )","( RM )"]
[null,"SUMMARY FOR MONTH",null,null,null,null,null,null,null,null,null,null,null,null,null,null,null,null,null,null,null,null,null,"LEGEND"]
[null,"TOTAL ROOM OCCUPANCY",null,null,null,{"$f":"IF($G$16=TRUE,SUM(F$31:F$61),\"\")","v":814},{"$f":"IF($G$16=TRUE,SUM(G$31:G$61),\"\")","v":960},1655,278,3707,null,null,null,null,{"$f":"SUM(O$31:O$61)","v":20},375,9436.8999999999978,28,509,10186.799999999999,19,215,3832.1]
[null,"AVERAGE ROOM OCCUPANCY",null,null,null,{"$f":"IFERROR(SUM(F$31:F$61)/COUNTIF($D$31:$D$61,\">0\"),\"\")","v":26.258064516129032},30.967741935483872,53.387096774193552,8.9677419354838701,119.58064516129032,0.11416549789621319,0.13464235624123422,0.23211781206171112,3.8990182328190744E-2,0.64516129032258063,12.096774193548388,304.41612903225797,0.90322580645161288,16.419354838709676,328.60645161290319,0.61290322580645162,6.935483870967742,123.61612903225806]
[null,"HIGHEST ROOM OCCUPANCY",null,null,null,{"$f":"IFERROR(IF(LARGE(F$31:F$61,1)>0,LARGE(F$31:F$61,1),\"NIL\"),\"NIL\")","v":47},57,83,18,192,0.20434782608695654,0.24782608695652175,0.36086956521739133,7.8260869565217397E-2,1,50,1563.8,1,34,1094.4000000000001,1,26,695.4]
[null,"LOWEST ROOM OCCUPANCY",null,null,null,{"$f":"IFERROR(IF(LARGE(F$31:F$61,COUNTIF(F$31:F$61,\">0\"))<>F$22,LARGE(F$31:F$61,COUNTIF(F$31:F$61,\">0\")),\"NIL\"),\"NIL\")","v":9},11,25,4,70,3.9130434782608699E-2,4.7826086956521741E-2,0.10869565217391304,1.7391304347826087E-2,"NIL",4,20,"NIL",4,18,"NIL",3,16]
[null,"AVERAGE FOR ","MONDAY",null,null,{"$f":"IFERROR(SUMIF($C$31:$C$61,\"Monday*\",F$31:F$61)/COUNTIF($C$31:$C$61,\"Monday*\"),\"\")","v":27.5},26.75,58.75,8.75,121.75,0.11956521739130435,0.11630434782608697,0.25543478260869568,3.8043478260869568E-2,0.5,6.5,243,1,14.25,148.15,0.75,7.75,94.4]
[null,null,"TUESDAY",null,null,{"$f":"IFERROR(SUMIF($C$31:$C$61,\"Tuesday*\",F$31:F$61)/COUNTIF($C$31:$C$61,\"Tuesday*\"),\"\")","v":20.6},25.8,47.4,8.8000000000000007,102.6,8.9565217391304353E-2,0.11217391304347828,0.20608695652173914,3.826086956521739E-2,0.6,6.8,85.04,0.8,16.2,284.8,0.2,3,37.119999999999997]
[null,null,"WEDNESDAY",null,null,{"$f":"IFERROR(SUMIF($C$31:$C$61,\"Wednesday*\",F$31:F$61)/COUNTIF($C$31:$C$61,\"Wednesday*\"),\"\")","v":22.2},24.4,40.799999999999997,8.4,95.8,9.6521739130434783E-2,0.10608695652173913,0.17739130434782607,3.6521739130434785E-2,0.4,8.6,151.52000000000001,0.6,7.4,119.46,0.2,1,9.9]
[null,null,"THURSDAY",null,null,{"$f":"IFERROR(SUMIF($C$31:$C$61,\"Thursday*\",F$31:F$61)/COUNTIF($C$31:$C$61,\"Thursday*\"),\"\")","v":20.6},22.4,45.8,6.2,95,8.9565217391304353E-2,9.7391304347826085E-2,0.19913043478260867,2.6956521739130435E-2,1,10.199999999999999,131.68,1,14.6,185.68,0.8,7.8,115.47999999999999]
[null,null,"FRIDAY",null,null,{"$f":"IFERROR(SUMIF($C$31:$C$61,\"Friday*\",F$31:F$61)/COUNTIF($C$31:$C$61,\"Friday*\"),\"\")","v":25},22.25,56.25,6.25,109.75,0.10869565217391305,9.6739130434782605E-2,0.24456521739130435,2.717391304347826E-2,0.5,15.5,546.95000000000005,1,16.25,387.72499999999997,0.5,5.5,139.65]
[null,null,"SATURDAY",null,null,{"$f":"IFERROR(SUMIF($C$31:$C$61,\"Saturday*\",F$31:F$61)/COUNTIF($C$31:$C$61,\"Saturday*\"),\"\")","v":36.75},51.5,74.75,14,177,0.15978260869565217,0.22391304347826085,0.32500000000000001,6.08695652173913E-2,1,27.75,824.77500000000009,1,26.5,715.25,1,17.75,389.6]
[null,null,"SUNDAY",null,null,{"$f":"IFERROR(SUMIF($C$31:$C$61,\"Sunday*\",F$31:F$61)/COUNTIF($C$31:$C$61,\"Sunday*\"),\"\")","v":35},48.75,56.5,11.25,151.5,0.15217391304347827,0.21195652173913046,0.24565217391304348,4.8913043478260865E-2,0.5,12,284.2,1,22.5,558.15,1,8,131.25]
[null,{"$f":"'Report A'!$B32","v":"2014-07-01"},{"$f":"'Report A'!$C32","v":"Tuesday"},{"$f":"'Report A'!$D32","v":1},{"$f":"IFERROR(INDEX(Data!$J$33:$J$82,$D31,1),\"\")","v":46},{"$f":"IFERROR(IF($G$16=TRUE,INDEX(Data!$K$33:$K$82,$D31,1),INDEX(Data!$K$33:$K$82,$D31,1)/$E31),\"\")","v":14},{"$f":"IFERROR(IF($G$16=TRUE,INDEX(Data!$L$33:$L$82,$D31,1),INDEX(Data!$L$33:$L$82,$D31,1)/(2*$E31)),\"\")","v":19},{"$f":"IFERROR(IF($G$16=TRUE,INDEX(Data!$M$33:$M$82,$D31,1),INDEX(Data!$M$33:$M$82,$D31,1)/$E31),\"\")","v":36},{"$f":"IFERROR(IF($G$16=TRUE,INDEX(Data!$N$33:$N$82,$D31,1),INDEX(Data!$N$33:$N$82,$D31,1)/$E31),\"\")","v":8},{"$f":"IFERROR(IF($G$16=TRUE,INDEX(Data!$K$33:$K$82,$D31,1)+INDEX(Data!$L$33:$L$82,$D31,1)+INDEX(Data!$M$33:$M$82,$D31,1)+INDEX(Data!$N$33:$N$82,$D31,1),(INDEX(Data!$K$33:$K$82,$D31,1)+INDEX(Data!$L$33:$L$82,$D31,1)+INDEX(Data!$M$33:$M$82,$D31,1)+INDEX(Data!$N$33:$N$82,$D31,1))/(5*$E31)),\"\")","v":77},{"$f":"IFERROR(INDEX(Data!$K$33:$K$82,$D31,1)/(5*$E31),\"\")","v":6.0869565217391307E-2},{"$f":"IFERROR(INDEX(Data!$L$33:$L$82,$D31,1)/(5*$E31),\"\")","v":8.2608695652173908E-2},{"$f":"IFERROR(INDEX(Data!$M$33:$M$82,$D31,1)/(5*$E31),\"\")","v":0.15652173913043479},{"$f":"IFERROR(INDEX(Data!$N$33:$N$82,$D31,1)/(5*$E31),\"\")","v":3.4782608695652174E-2},{"$f":"IFERROR(IF($O$17<>\"\",COUNTIF(INDIRECT(\"Data!$O$\"&$D31+32&\":$AH$\"&$D31+32),$O$17),\"\"),\"\")","v":0},{"$f":"IFERROR((SUMIF(INDIRECT(\"Data!$O$\"&$D31+32&\":$O$\"&$D31+32),$O$17,INDIRECT(\"Data!$Q$\"&$D31+32&\":$Q$\"&$D31+32))+SUMIF(INDIRECT(\"Data!$S$\"&$D31+32&\":$S$\"&$D31+32),$O$17,INDIRECT(\"Data!$U$\"&$D31+32&\":$U$\"&$D31+32))+SUMIF(INDIRECT(\"Data!$W$\"&$D31+32&\":$W$\"&$D31+32),$O$17,INDIRECT(\"Data!$Y$\"&$D31+32&\":$Y$\"&$D31+32))+SUMIF(INDIRECT(\"Data!$AA$\"&$D31+32&\":$AA$\"&$D31+32),$O$17,INDIRECT(\"Data!$AC$\"&$D31+32&\":$AC$\"&$D31+32))+SUMIF(INDIRECT(\"Data!$AE$\"&$D31+32&\":$AE$\"&$D31+32),$O$17,INDIRECT(\"Data!$AG$\"&$D31+32&\":$AG$\"&$D31+32)))/$O31,\"\")","v":""},{"$f":"IFERROR((SUMIF(INDIRECT(\"Data!$O$\"&$D31+32&\":$O$\"&$D31+32),$O$17,INDIRECT(\"Data!$R$\"&$D31+32&\":$R$\"&$D31+32))+SUMIF(INDIRECT(\"Data!$S$\"&$D31+32&\":$S$\"&$D31+32),$O$17,INDIRECT(\"Data!$V$\"&$D31+32&\":$V$\"&$D31+32))+SUMIF(INDIRECT(\"Data!$W$\"&$D31+32&\":$W$\"&$D31+32),$O$17,INDIRECT(\"Data!$Z$\"&$D31+32&\":$Z$\"&$D31+32))+SUMIF(INDIRECT(\"Data!$AA$\"&$D31+32&\":$AA$\"&$D31+32),$O$17,INDIRECT(\"Data!$AD$\"&$D31+32&\":$AD$\"&$D31+32))+SUMIF(INDIRECT(\"Data!$AE$\"&$D31+32&\":$AE$\"&$D31+32),$O$17,INDIRECT(\"Data!$AH$\"&$D31+32&\":$AH$\"&$D31+32)))/$O31,\"\")","v":""},{"$f":"IFERROR(IF($R$17<>\"\",COUNTIF(INDIRECT(\"Data!$O$\"&$D31+32&\":$AH$\"&$D31+32),$R$17),\"\"),\"\")","v":1},{"$f":"IFERROR((SUMIF(INDIRECT(\"Data!$O$\"&$D31+32&\":$O$\"&$D31+32),$R$17,INDIRECT(\"Data!$Q$\"&$D31+32&\":$Q$\"&$D31+32))+SUMIF(INDIRECT(\"Data!$S$\"&$D31+32&\":$S$\"&$D31+32),$R$17,INDIRECT(\"Data!$U$\"&$D31+32&\":$U$\"&$D31+32))+SUMIF(INDIRECT(\"Data!$W$\"&$D31+32&\":$W$\"&$D31+32),$R$17,INDIRECT(\"Data!$Y$\"&$D31+32&\":$Y$\"&$D31+32))+SUMIF(INDIRECT(\"Data!$AA$\"&$D31+32&\":$AA$\"&$D31+32),$R$17,INDIRECT(\"Data!$AC$\"&$D31+32&\":$AC$\"&$D31+32))+SUMIF(INDIRECT(\"Data!$AE$\"&$D31+32&\":$AE$\"&$D31+32),$R$17,INDIRECT(\"Data!$AG$\"&$D31+32&\":$AG$\"&$D31+32)))/$R31,\"\")","v":14},{"$f":"IFERROR((SUMIF(INDIRECT(\"Data!$O$\"&$D31+32&\":$O$\"&$D31+32),$R$17,INDIRECT(\"Data!$R$\"&$D31+32&\":$R$\"&$D31+32))+SUMIF(INDIRECT(\"Data!$S$\"&$D31+32&\":$S$\"&$D31+32),$R$17,INDIRECT(\"Data!$V$\"&$D31+32&\":$V$\"&$D31+32))+SUMIF(INDIRECT(\"Data!$W$\"&$D31+32&\":$W$\"&$D31+32),$R$17,INDIRECT(\"Data!$Z$\"&$D31+32&\":$Z$\"&$D31+32))+SUMIF(INDIRECT(\"Data!$AA$\"&$D31+32&\":$AA$\"&$D31+32),$R$17,INDIRECT(\"Data!$AD$\"&$D31+32&\":$AD$\"&$D31+32))+SUMIF(INDIRECT(\"Data!$AE$\"&$D31+32&\":$AE$\"&$D31+32),$R$17,INDIRECT(\"Data!$AH$\"&$D31+32&\":$AH$\"&$D31+32)))/$R31,\"\")","v":126},{"$f":"IFERROR(IF($U$17<>\"\",COUNTIF(INDIRECT(\"Data!$O$\"&$D31+32&\":$AH$\"&$D31+32),$U$17),\"\"),\"\")","v":0},{"$f":"IFERROR((SUMIF(INDIRECT(\"Data!$O$\"&$D31+32&\":$O$\"&$D31+32),$U$17,INDIRECT(\"Data!$Q$\"&$D31+32&\":$Q$\"&$D31+32))+SUMIF(INDIRECT(\"Data!$S$\"&$D31+32&\":$S$\"&$D31+32),$U$17,INDIRECT(\"Data!$U$\"&$D31+32&\":$U$\"&$D31+32))+SUMIF(INDIRECT(\"Data!$W$\"&$D31+32&\":$W$\"&$D31+32),$U$17,INDIRECT(\"Data!$Y$\"&$D31+32&\":$Y$\"&$D31+32))+SUMIF(INDIRECT(\"Data!$AA$\"&$D31+32&\":$AA$\"&$D31+32),$U$17,INDIRECT(\"Data!$AC$\"&$D31+32&\":$AC$\"&$D31+32))+SUMIF(INDIRECT(\"Data!$AE$\"&$D31+32&\":$AE$\"&$D31+32),$U$17,INDIRECT(\"Data!$AG$\"&$D31+32&\":$AG$\"&$D31+32)))/$U31,\"\")","v":""},{"$f":"IFERROR((SUMIF(INDIRECT(\"Data!$O$\"&$D31+32&\":$O$\"&$D31+32),$U$17,INDIRECT(\"Data!$R$\"&$D31+32&\":$R$\"&$D31+32))+SUMIF(INDIRECT(\"Data!$S$\"&$D31+32&\":$S$\"&$D31+32),$U$17,INDIRECT(\"Data!$V$\"&$D31+32&\":$V$\"&$D31+32))+SUMIF(INDIRECT(\"Data!$W$\"&$D31+32&\":$W$\"&$D31+32),$U$17,INDIRECT(\"Data!$Z$\"&$D31+32&\":$Z$\"&$D31+32))+SUMIF(INDIRECT(\"Data!$AA$\"&$D31+32&\":$AA$\"&$D31+32),$U$17,INDIRECT(\"Data!$AD$\"&$D31+32&\":$AD$\"&$D31+32))+SUMIF(INDIRECT(\"Data!$AE$\"&$D31+32&\":$AE$\"&$D31+32),$U$17,INDIRECT(\"Data!$AH$\"&$D31+32&\":$AH$\"&$D31+32)))/$U31,\"\")","v":""}]
[null,{"$f":"'Report A'!$B33","v":"2014-07-02"},{"$f":"'Report A'!$C33","v":"Wednesday"},{"$f":"'Report A'!$D33","v":2},{"$f":"IFERROR(INDEX(Data!$J$33:$J$82,$D32,1),\"\")","v":46},{"$f":"IFERROR(IF($G$16=TRUE,INDEX(Data!$K$33:$K$82,$D32,1),INDEX(Data!$K$33:$K$82,$D32,1)/$E32),\"\")","v":15},{"$f":"IFERROR(IF($G$16=TRUE,INDEX(Data!$L$33:$L$82,$D32,1),INDEX(Data!$L$33:$L$82,$D32,1)/(2*$E32)),\"\")","v":17},{"$f":"IFERROR(IF($G$16=TRUE,INDEX(Data!$M$33:$M$82,$D32,1),INDEX(Data!$M$33:$M$82,$D32,1)/$E32),\"\")","v":35},{"$f":"IFERROR(IF($G$16=TRUE,INDEX(Data!$N$33:$N$82,$D32,1),INDEX(Data!$N$33:$N$82,$D32,1)/$E32),\"\")","v":4},{"$f":"IFERROR(IF($G$16=TRUE,INDEX(Data!$K$33:$K$82,$D32,1)+INDEX(Data!$L$33:$L$82,$D32,1)+INDEX(Data!$M$33:$M$82,$D32,1)+INDEX(Data!$N$33:$N$82,$D32,1),(INDEX(Data!$K$33:$K$82,$D32,1)+INDEX(Data!$L$33:$L$82,$D32,1)+INDEX(Data!$M$33:$M$82,$D32,1)+INDEX(Data!$N$33:$N$82,$D32,1))/(5*$E32)),\"\")","v":71},{"$f":"IFERROR(INDEX(Data!$K$33:$K$82,$D32,1)/(5*$E32),\"\")","v":6.5217391304347824E-2},{"$f":"IFERROR(INDEX(Data!$L$33:$L$82,$D32,1)/(5*$E32),\"\")","v":7.3913043478260873E-2},{"$f":"IFERROR(INDEX(Data!$M$33:$M$82,$D32,1)/(5*$E32),\"\")","v":0.15217391304347827},{"$f":"IFERROR(INDEX(Data!$N$33:$N$82,$D32,1)/(5*$E32),\"\")","v":1.7391304347826087E-2},0,"","",1,8,104,0,"",""]
[null,{"$f":"'Report A'!$B34","v":"2014-07-03"},{"$f":"'Report A'!$C34","v":"Thursday"},{"$f":"'Report A'!$D34","v":3},{"$f":"IFERROR(INDEX(Data!$J$33:$J$82,$D33,1),\"\")","v":46},{"$f":"IFERROR(IF($G$16=TRUE,INDEX(Data!$K$33:$K$82,$D33,1),INDEX(Data!$K$33:$K$82,$D33,1)/$E33),\"\")","v":13},{"$f":"IFERROR(IF($G$16=TRUE,INDEX(Data!$L$33:$L$82,$D33,1),INDEX(Data!$L$33:$L$82,$D33,1)/(2*$E33)),\"\")","v":19},{"$f":"IFERROR(IF($G$16=TRUE,INDEX(Data!$M$33:$M$82,$D33,1),INDEX(Data!$M$33:$M$82,$D33,1)/$E33),\"\")","v":55},{"$f":"IFERROR(IF($G$16=TRUE,INDEX(Data!$N$33:$N$82,$D33,1),INDEX(Data!$N$33:$N$82,$D33,1)/$E33),\"\")","v":4},{"$f":"IFERROR(IF($G$16=TRUE,INDEX(Data!$K$33:$K$82,$D33,1)+INDEX(Data!$L$33:$L$82,$D33,1)+INDEX(Data!$M$33:$M$82,$D33,1)+INDEX(Data!$N$33:$N$82,$D33,1),(INDEX(Data!$K$33:$K$82,$D33,1)+INDEX(Data!$L$33:$L$82,$D33,1)+INDEX(Data!$M$33:$M$82,$D33,1)+INDEX(Data!$N$33:$N$82,$D33,1))/(5*$E33)),\"\")","v":91},{"$f":"IFERROR(INDEX(Data!$K$33:$K$82,$D33,1)/(5*$E33),\"\")","v":5.6521739130434782E-2},{"$f":"IFERROR(INDEX(Data!$L$33:$L$82,$D33,1)/(5*$E33),\"\")","v":8.2608695652173908E-2},{"$f":"IFERROR(INDEX(Data!$M$33:$M$82,$D33,1)/(5*$E33),\"\")","v":0.2391304347826087},{"$f":"IFERROR(INDEX(Data!$N$33:$N$82,$D33,1)/(5*$E33),\"\")","v":1.7391304347826087E-2},1,13,104,1,8,64,1,5,40]
[null,{"$f":"'Report A'!$B35","v":"2014-07-04"},{"$f":"'Report A'!$C35","v":"Friday"},{"$f":"'Report A'!$D35","v":4},{"$f":"IFERROR(INDEX(Data!$J$33:$J$82,$D34,1),\"\")","v":46},{"$f":"IFERROR(IF($G$16=TRUE,INDEX(Data!$K$33:$K$82,$D34,1),INDEX(Data!$K$33:$K$82,$D34,1)/$E34),\"\")","v":26},{"$f":"IFERROR(IF($G$16=TRUE,INDEX(Data!$L$33:$L$82,$D34,1),INDEX(Data!$L$33:$L$82,$D34,1)/(2*$E34)),\"\")","v":29},{"$f":"IFERROR(IF($G$16=TRUE,INDEX(Data!$M$33:$M$82,$D34,1),INDEX(Data!$M$33:$M$82,$D34,1)/$E34),\"\")","v":64},{"$f":"IFERROR(IF($G$16=TRUE,INDEX(Data!$N$33:$N$82,$D34,1),INDEX(Data!$N$33:$N$82,$D34,1)/$E34),\"\")","v":5},{"$f":"IFERROR(IF($G$16=TRUE,INDEX(Data!$K$33:$K$82,$D34,1)+INDEX(Data!$L$33:$L$82,$D34,1)+INDEX(Data!$M$33:$M$82,$D34,1)+INDEX(Data!$N$33:$N$82,$D34,1),(INDEX(Data!$K$33:$K$82,$D34,1)+INDEX(Data!$L$33:$L$82,$D34,1)+INDEX(Data!$M$33:$M$82,$D34,1)+INDEX(Data!$N$33:$N$82,$D34,1))/(5*$E34)),\"\")","v":124},{"$f":"IFERROR(INDEX(Data!$K$33:$K$82,$D34,1)/(5*$E34),\"\")","v":0.11304347826086956},{"$f":"IFERROR(INDEX(Data!$L$33:$L$82,$D34,1)/(5*$E34),\"\")","v":0.12608695652173912},{"$f":"IFERROR(INDEX(Data!$M$33:$M$82,$D34,1)/(5*$E34),\"\")","v":0.27826086956521739},{"$f":"IFERROR(INDEX(Data!$N$33:$N$82,$D34,1)/(5*$E34),\"\")","v":2.1739130434782608E-2},0,"","",1,21,412.9,0,"",""]
[null,{"$f":"'Report A'!$B36","v":"2014-07-05"},{"$f":"'Report A'!$C36","v":"Saturday"},{"$f":"'Report A'!$D36","v":5},{"$f":"IFERROR(INDEX(Data!$J$33:$J$82,$D35,1),\"\")","v":46},{"$f":"IFERROR(IF($G$16=TRUE,INDEX(Data!$K$33:$K$82,$D35,1),INDEX(Data!$K$33:$K$82,$D35,1)/$E35),\"\")","v":35},{"$f":"IFERROR(IF($G$16=TRUE,INDEX(Data!$L$33:$L$82,$D35,1),INDEX(Data!$L$33:$L$82,$D35,1)/(2*$E35)),\"\")","v":45},{"$f":"IFERROR(IF($G$16=TRUE,INDEX(Data!$M$33:$M$82,$D35,1),INDEX(Data!$M$33:$M$82,$D35,1)/$E35),\"\")","v":71},{"$f":"IFERROR(IF($G$16=TRUE,INDEX(Data!$N$33:$N$82,$D35,1),INDEX(Data!$N$33:$N$82,$D35,1)/$E35),\"\")","v":18},{"$f":"IFERROR(IF($G$16=TRUE,INDEX(Data!$K$33:$K$82,$D35,1)+INDEX(Data!$L$33:$L$82,$D35,1)+INDEX(Data!$M$33:$M$82,$D35,1)+INDEX(Data!$N$33:$N$82,$D35,1),(INDEX(Data!$K$33:$K$82,$D35,1)+INDEX(Data!$L$33:$L$82,$D35,1)+INDEX(Data!$M$33:$M$82,$D35,1)+INDEX(Data!$N$33:$N$82,$D35,1))/(5*$E35)),\"\")","v":169},{"$f":"IFERROR(INDEX(Data!$K$33:$K$82,$D35,1)/(5*$E35),\"\")","v":0.15217391304347827},{"$f":"IFERROR(INDEX(Data!$L$33:$L$82,$D35,1)/(5*$E35),\"\")","v":0.19565217391304349},{"$f":"IFERROR(INDEX(Data!$M$33:$M$82,$D35,1)/(5*$E35),\"\")","v":0.30869565217391304},{"$f":"IFERROR(INDEX(Data!$N$33:$N$82,$D35,1)/(5*$E35),\"\")","v":7.8260869565217397E-2},1,39,718,1,18,372.6,1,17,463.6]
[null,{"$f":"'Report A'!$B37","v":"2014-07-06"},{"$f":"'Report A'!$C37","v":"Sunday"},{"$f":"'Report A'!$D37","v":6},{"$f":"IFERROR(INDEX(Data!$J$33:$J$82,$D36,1),\"\")","v":46},{"$f":"IFERROR(IF($G$16=TRUE,INDEX(Data!$K$33:$K$82,$D36,1),INDEX(Data!$K$33:$K$82,$D36,1)/$E36),\"\")","v":34},{"$f":"IFERROR(IF($G$16=TRUE,INDEX(Data!$L$33:$L$82,$D36,1),INDEX(Data!$L$33:$L$82,$D36,1)/(2*$E36)),\"\")","v":49},{"$f":"IFERROR(IF($G$16=TRUE,INDEX(Data!$M$33:$M$82,$D36,1),INDEX(Data!$M$33:$M$82,$D36,1)/$E36),\"\")","v":41},{"$f":"IFERROR(IF($G$16=TRUE,INDEX(Data!$N$33:$N$82,$D36,1),INDEX(Data!$N$33:$N$82,$D36,1)/$E36),\"\")","v":10},{"$f":"IFERROR(IF($G$16=TRUE,INDEX(Data!$K$33:$K$82,$D36,1)+INDEX(Data!$L$33:$L$82,$D36,1)+INDEX(Data!$M$33:$M$82,$D36,1)+INDEX(Data!$N$33:$N$82,$D36,1),(INDEX(Data!$K$33:$K$82,$D36,1)+INDEX(Data!$L$33:$L$82,$D36,1)+INDEX(Data!$M$33:$M$82,$D36,1)+INDEX(Data!$N$33:$N$82,$D36,1))/(5*$E36)),\"\")","v":134},{"$f":"IFERROR(INDEX(Data!$K$33:$K$82,$D36,1)/(5*$E36),\"\")","v":0.14782608695652175},{"$f":"IFERROR(INDEX(Data!$L$33:$L$82,$D36,1)/(5*$E36),\"\")","v":0.21304347826086956},{"$f":"IFERROR(INDEX(Data!$M$33:$M$82,$D36,1)/(5*$E36),\"\")","v":0.17826086956521739},{"$f":"IFERROR(INDEX(Data!$N$33:$N$82,$D36,1)/(5*$E36),\"\")","v":4.3478260869565216E-2},1,13,427.7,1,12,194.4,1,9,162]
[null,{"$f":"'Report A'!$B38","v":"2014-07-07"},{"$f":"'Report A'!$C38","v":"Monday"},{"$f":"'Report A'!$D38","v":7},{"$f":"IFERROR(INDEX(Data!$J$33:$J$82,$D37,1),\"\")","v":46},{"$f":"IFERROR(IF($G$16=TRUE,INDEX(Data!$K$33:$K$82,$D37,1),INDEX(Data!$K$33:$K$82,$D37,1)/$E37),\"\")","v":25},{"$f":"IFERROR(IF($G$16=TRUE,INDEX(Data!$L$33:$L$82,$D37,1),INDEX(Data!$L$33:$L$82,$D37,1)/(2*$E37)),\"\")","v":22},{"$f":"IFERROR(IF($G$16=TRUE,INDEX(Data!$M$33:$M$82,$D37,1),INDEX(Data!$M$33:$M$82,$D37,1)/$E37),\"\")","v":68},{"$f":"IFERROR(IF($G$16=TRUE,INDEX(Data!$N$33:$N$82,$D37,1),INDEX(Data!$N$33:$N$82,$D37,1)/$E37),\"\")","v":9},{"$f":"IFERROR(IF($G$16=TRUE,INDEX(Data!$K$33:$K$82,$D37,1)+INDEX(Data!$L$33:$L$82,$D37,1)+INDEX(Data!$M$33:$M$82,$D37,1)+INDEX(Data!$N$33:$N$82,$D37,1),(INDEX(Data!$K$33:$K$82,$D37,1)+INDEX(Data!$L$33:$L$82,$D37,1)+INDEX(Data!$M$33:$M$82,$D37,1)+INDEX(Data!$N$33:$N$82,$D37,1))/(5*$E37)),\"\")","v":124},{"$f":"IFERROR(INDEX(Data!$K$33:$K$82,$D37,1)/(5*$E37),\"\")","v":0.10869565217391304},{"$f":"IFERROR(INDEX(Data!$L$33:$L$82,$D37,1)/(5*$E37),\"\")","v":9.5652173913043481E-2},{"$f":"IFERROR(INDEX(Data!$M$33:$M$82,$D37,1)/(5*$E37),\"\")","v":0.29565217391304349},{"$f":"IFERROR(INDEX(Data!$N$33:$N$82,$D37,1)/(5*$E37),\"\")","v":3.9130434782608699E-2},0,"","",1,24,184,1,8,32]
[null,{"$f":"'Report A'!$B39","v":"2014-07-08"},{"$f":"'Report A'!$C39","v":"Tuesday"},{"$f":"'Report A'!$D39","v":8},{"$f":"IFERROR(INDEX(Data!$J$33:$J$82,$D38,1),\"\")","v":46},{"$f":"IFERROR(IF($G$16=TRUE,INDEX(Data!$K$33:$K$82,$D38,1),INDEX(Data!$K$33:$K$82,$D38,1)/$E38),\"\")","v":9},{"$f":"IFERROR(IF($G$16=TRUE,INDEX(Data!$L$33:$L$82,$D38,1),INDEX(Data!$L$33:$L$82,$D38,1)/(2*$E38)),\"\")","v":16},{"$f":"IFERROR(IF($G$16=TRUE,INDEX(Data!$M$33:$M$82,$D38,1),INDEX(Data!$M$33:$M$82,$D38,1)/$E38),\"\")","v":59},{"$f":"IFERROR(IF($G$16=TRUE,INDEX(Data!$N$33:$N$82,$D38,1),INDEX(Data!$N$33:$N$82,$D38,1)/$E38),\"\")","v":11},{"$f":"IFERROR(IF($G$16=TRUE,INDEX(Data!$K$33:$K$82,$D38,1)+INDEX(Data!$L$33:$L$82,$D38,1)+INDEX(Data!$M$33:$M$82,$D38,1)+INDEX(Data!$N$33:$N$82,$D38,1),(INDEX(Data!$K$33:$K$82,$D38,1)+INDEX(Data!$L$33:$L$82,$D38,1)+INDEX(Data!$M$33:$M$82,$D38,1)+INDEX(Data!$N$33:$N$82,$D38,1))/(5*$E38)),\"\")","v":95},{"$f":"IFERROR(INDEX(Data!$K$33:$K$82,$D38,1)/(5*$E38),\"\")","v":3.9130434782608699E-2},{"$f":"IFERROR(INDEX(Data!$L$33:$L$82,$D38,1)/(5*$E38),\"\")","v":6.9565217391304349E-2},{"$f":"IFERROR(INDEX(Data!$M$33:$M$82,$D38,1)/(5*$E38),\"\")","v":0.2565217391304348},{"$f":"IFERROR(INDEX(Data!$N$33:$N$82,$D38,1)/(5*$E38),\"\")","v":4.7826086956521741E-2},1,10,40,1,17,183.2,0,"",""]
[null,{"$f":"'Report A'!$B40","v":"2014-07-09"},{"$f":"'Report A'!$C40","v":"Wednesday"},{"$f":"'Report A'!$D40","v":9},{"$f":"IFERROR(INDEX(Data!$J$33:$J$82,$D39,1),\"\")","v":46},{"$f":"IFERROR(IF($G$16=TRUE,INDEX(Data!$K$33:$K$82,$D39,1),INDEX(Data!$K$33:$K$82,$D39,1)/$E39),\"\")","v":23},{"$f":"IFERROR(IF($G$16=TRUE,INDEX(Data!$L$33:$L$82,$D39,1),INDEX(Data!$L$33:$L$82,$D39,1)/(2*$E39)),\"\")","v":17},{"$f":"IFERROR(IF($G$16=TRUE,INDEX(Data!$M$33:$M$82,$D39,1),INDEX(Data!$M$33:$M$82,$D39,1)/$E39),\"\")","v":54},{"$f":"IFERROR(IF($G$16=TRUE,INDEX(Data!$N$33:$N$82,$D39,1),INDEX(Data!$N$33:$N$82,$D39,1)/$E39),\"\")","v":10},{"$f":"IFERROR(IF($G$16=TRUE,INDEX(Data!$K$33:$K$82,$D39,1)+INDEX(Data!$L$33:$L$82,$D39,1)+INDEX(Data!$M$33:$M$82,$D39,1)+INDEX(Data!$N$33:$N$82,$D39,1),(INDEX(Data!$K$33:$K$82,$D39,1)+INDEX(Data!$L$33:$L$82,$D39,1)+INDEX(Data!$M$33:$M$82,$D39,1)+INDEX(Data!$N$33:$N$82,$D39,1))/(5*$E39)),\"\")","v":104},{"$f":"IFERROR(INDEX(Data!$K$33:$K$82,$D39,1)/(5*$E39),\"\")","v":0.1},{"$f":"IFERROR(INDEX(Data!$L$33:$L$82,$D39,1)/(5*$E39),\"\")","v":7.3913043478260873E-2},{"$f":"IFERROR(INDEX(Data!$M$33:$M$82,$D39,1)/(5*$E39),\"\")","v":0.23478260869565218},{"$f":"IFERROR(INDEX(Data!$N$33:$N$82,$D39,1)/(5*$E39),\"\")","v":4.3478260869565216E-2},0,"","",0,"","",0,"",""]
[null,{"$f":"'Report A'!$B41","v":"2014-07-10"},{"$f":"'Report A'!$C41","v":"Thursday"},{"$f":"'Report A'!$D41","v":10},{"$f":"IFERROR(INDEX(Data!$J$33:$J$82,$D40,1),\"\")","v":46},{"$f":"IFERROR(IF($G$16=TRUE,INDEX(Data!$K$33:$K$82,$D40,1),INDEX(Data!$K$33:$K$82,$D40,1)/$E40),\"\")","v":13},{"$f":"IFERROR(IF($G$16=TRUE,INDEX(Data!$L$33:$L$82,$D40,1),INDEX(Data!$L$33:$L$82,$D40,1)/(2*$E40)),\"\")","v":11},{"$f":"IFERROR(IF($G$16=TRUE,INDEX(Data!$M$33:$M$82,$D40,1),INDEX(Data!$M$33:$M$82,$D40,1)/$E40),\"\")","v":63},{"$f":"IFERROR(IF($G$16=TRUE,INDEX(Data!$N$33:$N$82,$D40,1),INDEX(Data!$N$33:$N$82,$D40,1)/$E40),\"\")","v":4},{"$f":"IFERROR(IF($G$16=TRUE,INDEX(Data!$K$33:$K$82,$D40,1)+INDEX(Data!$L$33:$L$82,$D40,1)+INDEX(Data!$M$33:$M$82,$D40,1)+INDEX(Data!$N$33:$N$82,$D40,1),(INDEX(Data!$K$33:$K$82,$D40,1)+INDEX(Data!$L$33:$L$82,$D40,1)+INDEX(Data!$M$33:$M$82,$D40,1)+INDEX(Data!$N$33:$N$82,$D40,1))/(5*$E40)),\"\")","v":91},{"$f":"IFERROR(INDEX(Data!$K$33:$K$82,$D40,1)/(5*$E40),\"\")","v":5.6521739130434782E-2},{"$f":"IFERROR(INDEX(Data!$L$33:$L$82,$D40,1)/(5*$E40),\"\")","v":4.7826086956521741E-2},{"$f":"IFERROR(INDEX(Data!$M$33:$M$82,$D40,1)/(5*$E40),\"\")","v":0.27391304347826084},{"$f":"IFERROR(INDEX(Data!$N$33:$N$82,$D40,1)/(5*$E40),\"\")","v":1.7391304347826087E-2},1,15,60,1,7,28,1,10,40]
[null,{"$f":"'Report A'!$B42","v":"2014-07-11"},{"$f":"'Report A'!$C42","v":"Friday"},{"$f":"'Report A'!$D42","v":11},{"$f":"IFERROR(INDEX(Data!$J$33:$J$82,$D41,1),\"\")","v":46},{"$f":"IFERROR(IF($G$16=TRUE,INDEX(Data!$K$33:$K$82,$D41,1),INDEX(Data!$K$33:$K$82,$D41,1)/$E41),\"\")","v":24},{"$f":"IFERROR(IF($G$16=TRUE,INDEX(Data!$L$33:$L$82,$D41,1),INDEX(Data!$L$33:$L$82,$D41,1)/(2*$E41)),\"\")","v":20},{"$f":"IFERROR(IF($G$16=TRUE,INDEX(Data!$M$33:$M$82,$D41,1),INDEX(Data!$M$33:$M$82,$D41,1)/$E41),\"\")","v":48},{"$f":"IFERROR(IF($G$16=TRUE,INDEX(Data!$N$33:$N$82,$D41,1),INDEX(Data!$N$33:$N$82,$D41,1)/$E41),\"\")","v":9},{"$f":"IFERROR(IF($G$16=TRUE,INDEX(Data!$K$33:$K$82,$D41,1)+INDEX(Data!$L$33:$L$82,$D41,1)+INDEX(Data!$M$33:$M$82,$D41,1)+INDEX(Data!$N$33:$N$82,$D41,1),(INDEX(Data!$K$33:$K$82,$D41,1)+INDEX(Data!$L$33:$L$82,$D41,1)+INDEX(Data!$M$33:$M$82,$D41,1)+INDEX(Data!$N$33:$N$82,$D41,1))/(5*$E41)),\"\")","v":101},{"$f":"IFERROR(INDEX(Data!$K$33:$K$82,$D41,1)/(5*$E41),\"\")","v":0.10434782608695652},{"$f":"IFERROR(INDEX(Data!$L$33:$L$82,$D41,1)/(5*$E41),\"\")","v":8.6956521739130432E-2},{"$f":"IFERROR(INDEX(Data!$M$33:$M$82,$D41,1)/(5*$E41),\"\")","v":0.20869565217391303},{"$f":"IFERROR(INDEX(Data!$N$33:$N$82,$D41,1)/(5*$E41),\"\")","v":3.9130434782608699E-2},1,50,1563.8,1,11,163.9,1,10,149]
[null,{"$f":"'Report A'!$B43","v":"2014-07-12"},{"$f":"'Report A'!$C43","v":"Saturday"},{"$f":"'Report A'!$D43","v":12},{"$f":"IFERROR(INDEX(Data!$J$33:$J$82,$D42,1),\"\")","v":46},{"$f":"IFERROR(IF($G$16=TRUE,INDEX(Data!$K$33:$K$82,$D42,1),INDEX(Data!$K$33:$K$82,$D42,1)/$E42),\"\")","v":33},{"$f":"IFERROR(IF($G$16=TRUE,INDEX(Data!$L$33:$L$82,$D42,1),INDEX(Data!$L$33:$L$82,$D42,1)/(2*$E42)),\"\")","v":57},{"$f":"IFERROR(IF($G$16=TRUE,INDEX(Data!$M$33:$M$82,$D42,1),INDEX(Data!$M$33:$M$82,$D42,1)/$E42),\"\")","v":69},{"$f":"IFERROR(IF($G$16=TRUE,INDEX(Data!$N$33:$N$82,$D42,1),INDEX(Data!$N$33:$N$82,$D42,1)/$E42),\"\")","v":13},{"$f":"IFERROR(IF($G$16=TRUE,INDEX(Data!$K$33:$K$82,$D42,1)+INDEX(Data!$L$33:$L$82,$D42,1)+INDEX(Data!$M$33:$M$82,$D42,1)+INDEX(Data!$N$33:$N$82,$D42,1),(INDEX(Data!$K$33:$K$82,$D42,1)+INDEX(Data!$L$33:$L$82,$D42,1)+INDEX(Data!$M$33:$M$82,$D42,1)+INDEX(Data!$N$33:$N$82,$D42,1))/(5*$E42)),\"\")","v":172},{"$f":"IFERROR(INDEX(Data!$K$33:$K$82,$D42,1)/(5*$E42),\"\")","v":0.14347826086956522},{"$f":"IFERROR(INDEX(Data!$L$33:$L$82,$D42,1)/(5*$E42),\"\")","v":0.24782608695652175},{"$f":"IFERROR(INDEX(Data!$M$33:$M$82,$D42,1)/(5*$E42),\"\")","v":0.3},{"$f":"IFERROR(INDEX(Data!$N$33:$N$82,$D42,1)/(5*$E42),\"\")","v":5.6521739130434782E-2},1,30,1262,1,28,578,1,14,199.6]
[null,{"$f":"'Report A'!$B44","v":"2014-07-13"},{"$f":"'Report A'!$C44","v":"Sunday"},{"$f":"'Report A'!$D44","v":13},{"$f":"IFERROR(INDEX(Data!$J$33:$J$82,$D43,1),\"\")","v":46},{"$f":"IFERROR(IF($G$16=TRUE,INDEX(Data!$K$33:$K$82,$D43,1),INDEX(Data!$K$33:$K$82,$D43,1)/$E43),\"\")","v":23},{"$f":"IFERROR(IF($G$16=TRUE,INDEX(Data!$L$33:$L$82,$D43,1),INDEX(Data!$L$33:$L$82,$D43,1)/(2*$E43)),\"\")","v":48},{"$f":"IFERROR(IF($G$16=TRUE,INDEX(Data!$M$33:$M$82,$D43,1),INDEX(Data!$M$33:$M$82,$D43,1)/$E43),\"\")","v":58},{"$f":"IFERROR(IF($G$16=TRUE,INDEX(Data!$N$33:$N$82,$D43,1),INDEX(Data!$N$33:$N$82,$D43,1)/$E43),\"\")","v":9},{"$f":"IFERROR(IF($G$16=TRUE,INDEX(Data!$K$33:$K$82,$D43,1)+INDEX(Data!$L$33:$L$82,$D43,1)+INDEX(Data!$M$33:$M$82,$D43,1)+INDEX(Data!$N$33:$N$82,$D43,1),(INDEX(Data!$K$33:$K$82,$D43,1)+INDEX(Data!$L$33:$L$82,$D43,1)+INDEX(Data!$M$33:$M$82,$D43,1)+INDEX(Data!$N$33:$N$82,$D43,1))/(5*$E43)),\"\")","v":138},{"$f":"IFERROR(INDEX(Data!$K$33:$K$82,$D43,1)/(5*$E43),\"\")","v":0.1},{"$f":"IFERROR(INDEX(Data!$L$33:$L$82,$D43,1)/(5*$E43),\"\")","v":0.20869565217391303},{"$f":"IFERROR(INDEX(Data!$M$33:$M$82,$D43,1)/(5*$E43),\"\")","v":0.25217391304347825},{"$f":"IFERROR(INDEX(Data!$N$33:$N$82,$D43,1)/(5*$E43),\"\")","v":3.9130434782608699E-2},0,"","",1,27,776,1,3,54]
[null,{"$f":"'Report A'!$B45","v":"2014-07-14"},{"$f":"'Report A'!$C45","v":"Monday"},{"$f":"'Report A'!$D45","v":14},{"$f":"IFERROR(INDEX(Data!$J$33:$J$82,$D44,1),\"\")","v":46},{"$f":"IFERROR(IF($G$16=TRUE,INDEX(Data!$K$33:$K$82,$D44,1),INDEX(Data!$K$33:$K$82,$D44,1)/$E44),\"\")","v":19},{"$f":"IFERROR(IF($G$16=TRUE,INDEX(Data!$L$33:$L$82,$D44,1),INDEX(Data!$L$33:$L$82,$D44,1)/(2*$E44)),\"\")","v":21},{"$f":"IFERROR(IF($G$16=TRUE,INDEX(Data!$M$33:$M$82,$D44,1),INDEX(Data!$M$33:$M$82,$D44,1)/$E44),\"\")","v":62},{"$f":"IFERROR(IF($G$16=TRUE,INDEX(Data!$N$33:$N$82,$D44,1),INDEX(Data!$N$33:$N$82,$D44,1)/$E44),\"\")","v":6},{"$f":"IFERROR(IF($G$16=TRUE,INDEX(Data!$K$33:$K$82,$D44,1)+INDEX(Data!$L$33:$L$82,$D44,1)+INDEX(Data!$M$33:$M$82,$D44,1)+INDEX(Data!$N$33:$N$82,$D44,1),(INDEX(Data!$K$33:$K$82,$D44,1)+INDEX(Data!$L$33:$L$82,$D44,1)+INDEX(Data!$M$33:$M$82,$D44,1)+INDEX(Data!$N$33:$N$82,$D44,1))/(5*$E44)),\"\")","v":108},{"$f":"IFERROR(INDEX(Data!$K$33:$K$82,$D44,1)/(5*$E44),\"\")","v":8.2608695652173908E-2},{"$f":"IFERROR(INDEX(Data!$L$33:$L$82,$D44,1)/(5*$E44),\"\")","v":9.1304347826086957E-2},{"$f":"IFERROR(INDEX(Data!$M$33:$M$82,$D44,1)/(5*$E44),\"\")","v":0.26956521739130435},{"$f":"IFERROR(INDEX(Data!$N$33:$N$82,$D44,1)/(5*$E44),\"\")","v":2.6086956521739129E-2},1,10,20,1,9,18,1,8,16]
[null,{"$f":"'Report A'!$B46","v":"2014-07-15"},{"$f":"'Report A'!$C46","v":"Tuesday"},{"$f":"'Report A'!$D46","v":15},{"$f":"IFERROR(INDEX(Data!$J$33:$J$82,$D45,1),\"\")","v":46},{"$f":"IFERROR(IF($G$16=TRUE,INDEX(Data!$K$33:$K$82,$D45,1),INDEX(Data!$K$33:$K$82,$D45,1)/$E45),\"\")","v":18},{"$f":"IFERROR(IF($G$16=TRUE,INDEX(Data!$L$33:$L$82,$D45,1),INDEX(Data!$L$33:$L$82,$D45,1)/(2*$E45)),\"\")","v":30},{"$f":"IFERROR(IF($G$16=TRUE,INDEX(Data!$M$33:$M$82,$D45,1),INDEX(Data!$M$33:$M$82,$D45,1)/$E45),\"\")","v":30},{"$f":"IFERROR(IF($G$16=TRUE,INDEX(Data!$N$33:$N$82,$D45,1),INDEX(Data!$N$33:$N$82,$D45,1)/$E45),\"\")","v":4},{"$f":"IFERROR(IF($G$16=TRUE,INDEX(Data!$K$33:$K$82,$D45,1)+INDEX(Data!$L$33:$L$82,$D45,1)+INDEX(Data!$M$33:$M$82,$D45,1)+INDEX(Data!$N$33:$N$82,$D45,1),(INDEX(Data!$K$33:$K$82,$D45,1)+INDEX(Data!$L$33:$L$82,$D45,1)+INDEX(Data!$M$33:$M$82,$D45,1)+INDEX(Data!$N$33:$N$82,$D45,1))/(5*$E45)),\"\")","v":82},{"$f":"IFERROR(INDEX(Data!$K$33:$K$82,$D45,1)/(5*$E45),\"\")","v":7.8260869565217397E-2},{"$f":"IFERROR(INDEX(Data!$L$33:$L$82,$D45,1)/(5*$E45),\"\")","v":0.13043478260869565},{"$f":"IFERROR(INDEX(Data!$M$33:$M$82,$D45,1)/(5*$E45),\"\")","v":0.13043478260869565},{"$f":"IFERROR(INDEX(Data!$N$33:$N$82,$D45,1)/(5*$E45),\"\")","v":1.7391304347826087E-2},1,8,134.4,1,16,378.4,0,"",""]
[null,{"$f":"'Report A'!$B47","v":"2014-07-16"},{"$f":"'Report A'!$C47","v":"Wednesday"},{"$f":"'Report A'!$D47","v":16},{"$f":"IFERROR(INDEX(Data!$J$33:$J$82,$D46,1),\"\")","v":46},{"$f":"IFERROR(IF($G$16=TRUE,INDEX(Data!$K$33:$K$82,$D46,1),INDEX(Data!$K$33:$K$82,$D46,1)/$E46),\"\")","v":17},{"$f":"IFERROR(IF($G$16=TRUE,INDEX(Data!$L$33:$L$82,$D46,1),INDEX(Data!$L$33:$L$82,$D46,1)/(2*$E46)),\"\")","v":19},{"$f":"IFERROR(IF($G$16=TRUE,INDEX(Data!$M$33:$M$82,$D46,1),INDEX(Data!$M$33:$M$82,$D46,1)/$E46),\"\")","v":39},{"$f":"IFERROR(IF($G$16=TRUE,INDEX(Data!$N$33:$N$82,$D46,1),INDEX(Data!$N$33:$N$82,$D46,1)/$E46),\"\")","v":9},{"$f":"IFERROR(IF($G$16=TRUE,INDEX(Data!$K$33:$K$82,$D46,1)+INDEX(Data!$L$33:$L$82,$D46,1)+INDEX(Data!$M$33:$M$82,$D46,1)+INDEX(Data!$N$33:$N$82,$D46,1),(INDEX(Data!$K$33:$K$82,$D46,1)+INDEX(Data!$L$33:$L$82,$D46,1)+INDEX(Data!$M$33:$M$82,$D46,1)+INDEX(Data!$N$33:$N$82,$D46,1))/(5*$E46)),\"\")","v":84},{"$f":"IFERROR(INDEX(Data!$K$33:$K$82,$D46,1)/(5*$E46),\"\")","v":7.3913043478260873E-2},{"$f":"IFERROR(INDEX(Data!$L$33:$L$82,$D46,1)/(5*$E46),\"\")","v":8.2608695652173908E-2},{"$f":"IFERROR(INDEX(Data!$M$33:$M$82,$D46,1)/(5*$E46),\"\")","v":0.16956521739130434},{"$f":"IFERROR(INDEX(Data!$N$33:$N$82,$D46,1)/(5*$E46),\"\")","v":3.9130434782608699E-2},1,23,441.6,1,18,352.9,0,"",""]
[null,{"$f":"'Report A'!$B48","v":"2014-07-17"},{"$f":"'Report A'!$C48","v":"Thursday"},{"$f":"'Report A'!$D48","v":17},{"$f":"IFERROR(INDEX(Data!$J$33:$J$82,$D47,1),\"\")","v":46},{"$f":"IFERROR(IF($G$16=TRUE,INDEX(Data!$K$33:$K$82,$D47,1),INDEX(Data!$K$33:$K$82,$D47,1)/$E47),\"\")","v":16},{"$f":"IFERROR(IF($G$16=TRUE,INDEX(Data!$L$33:$L$82,$D47,1),INDEX(Data!$L$33:$L$82,$D47,1)/(2*$E47)),\"\")","v":21},{"$f":"IFERROR(IF($G$16=TRUE,INDEX(Data!$M$33:$M$82,$D47,1),INDEX(Data!$M$33:$M$82,$D47,1)/$E47),\"\")","v":41},{"$f":"IFERROR(IF($G$16=TRUE,INDEX(Data!$N$33:$N$82,$D47,1),INDEX(Data!$N$33:$N$82,$D47,1)/$E47),\"\")","v":7},{"$f":"IFERROR(IF($G$16=TRUE,INDEX(Data!$K$33:$K$82,$D47,1)+INDEX(Data!$L$33:$L$82,$D47,1)+INDEX(Data!$M$33:$M$82,$D47,1)+INDEX(Data!$N$33:$N$82,$D47,1),(INDEX(Data!$K$33:$K$82,$D47,1)+INDEX(Data!$L$33:$L$82,$D47,1)+INDEX(Data!$M$33:$M$82,$D47,1)+INDEX(Data!$N$33:$N$82,$D47,1))/(5*$E47)),\"\")","v":85},{"$f":"IFERROR(INDEX(Data!$K$33:$K$82,$D47,1)/(5*$E47),\"\")","v":6.9565217391304349E-2},{"$f":"IFERROR(INDEX(Data!$L$33:$L$82,$D47,1)/(5*$E47),\"\")","v":9.1304347826086957E-2},{"$f":"IFERROR(INDEX(Data!$M$33:$M$82,$D47,1)/(5*$E47),\"\")","v":0.17826086956521739},{"$f":"IFERROR(INDEX(Data!$N$33:$N$82,$D47,1)/(5*$E47),\"\")","v":3.0434782608695653E-2},1,10,359.2,1,19,209.1,0,"",""]
[null,{"$f":"'Report A'!$B49","v":"2014-07-18"},{"$f":"'Report A'!$C49","v":"Friday"},{"$f":"'Report A'!$D49","v":18},{"$f":"IFERROR(INDEX(Data!$J$33:$J$82,$D48,1),\"\")","v":46},{"$f":"IFERROR(IF($G$16=TRUE,INDEX(Data!$K$33:$K$82,$D48,1),INDEX(Data!$K$33:$K$82,$D48,1)/$E48),\"\")","v":27},{"$f":"IFERROR(IF($G$16=TRUE,INDEX(Data!$L$33:$L$82,$D48,1),INDEX(Data!$L$33:$L$82,$D48,1)/(2*$E48)),\"\")","v":17},{"$f":"IFERROR(IF($G$16=TRUE,INDEX(Data!$M$33:$M$82,$D48,1),INDEX(Data!$M$33:$M$82,$D48,1)/$E48),\"\")","v":64},{"$f":"IFERROR(IF($G$16=TRUE,INDEX(Data!$N$33:$N$82,$D48,1),INDEX(Data!$N$33:$N$82,$D48,1)/$E48),\"\")","v":5},{"$f":"IFERROR(IF($G$16=TRUE,INDEX(Data!$K$33:$K$82,$D48,1)+INDEX(Data!$L$33:$L$82,$D48,1)+INDEX(Data!$M$33:$M$82,$D48,1)+INDEX(Data!$N$33:$N$82,$D48,1),(INDEX(Data!$K$33:$K$82,$D48,1)+INDEX(Data!$L$33:$L$82,$D48,1)+INDEX(Data!$M$33:$M$82,$D48,1)+INDEX(Data!$N$33:$N$82,$D48,1))/(5*$E48)),\"\")","v":113},{"$f":"IFERROR(INDEX(Data!$K$33:$K$82,$D48,1)/(5*$E48),\"\")","v":0.11739130434782609},{"$f":"IFERROR(INDEX(Data!$L$33:$L$82,$D48,1)/(5*$E48),\"\")","v":7.3913043478260873E-2},{"$f":"IFERROR(INDEX(Data!$M$33:$M$82,$D48,1)/(5*$E48),\"\")","v":0.27826086956521739},{"$f":"IFERROR(INDEX(Data!$N$33:$N$82,$D48,1)/(5*$E48),\"\")","v":2.1739130434782608E-2},1,12,624,1,24,840,1,12,409.6]
[null,{"$f":"'Report A'!$B50","v":"2014-07-19"},{"$f":"'Report A'!$C50","v":"Saturday"},{"$f":"'Report A'!$D50","v":19},{"$f":"IFERROR(INDEX(Data!$J$33:$J$82,$D49,1),\"\")","v":46},{"$f":"IFERROR(IF($G$16=TRUE,INDEX(Data!$K$33:$K$82,$D49,1),INDEX(Data!$K$33:$K$82,$D49,1)/$E49),\"\")","v":34},{"$f":"IFERROR(IF($G$16=TRUE,INDEX(Data!$L$33:$L$82,$D49,1),INDEX(Data!$L$33:$L$82,$D49,1)/(2*$E49)),\"\")","v":53},{"$f":"IFERROR(IF($G$16=TRUE,INDEX(Data!$M$33:$M$82,$D49,1),INDEX(Data!$M$33:$M$82,$D49,1)/$E49),\"\")","v":76},{"$f":"IFERROR(IF($G$16=TRUE,INDEX(Data!$N$33:$N$82,$D49,1),INDEX(Data!$N$33:$N$82,$D49,1)/$E49),\"\")","v":16},{"$f":"IFERROR(IF($G$16=TRUE,INDEX(Data!$K$33:$K$82,$D49,1)+INDEX(Data!$L$33:$L$82,$D49,1)+INDEX(Data!$M$33:$M$82,$D49,1)+INDEX(Data!$N$33:$N$82,$D49,1),(INDEX(Data!$K$33:$K$82,$D49,1)+INDEX(Data!$L$33:$L$82,$D49,1)+INDEX(Data!$M$33:$M$82,$D49,1)+INDEX(Data!$N$33:$N$82,$D49,1))/(5*$E49)),\"\")","v":179},{"$f":"IFERROR(INDEX(Data!$K$33:$K$82,$D49,1)/(5*$E49),\"\")","v":0.14782608695652175},{"$f":"IFERROR(INDEX(Data!$L$33:$L$82,$D49,1)/(5*$E49),\"\")","v":0.23043478260869565},{"$f":"IFERROR(INDEX(Data!$M$33:$M$82,$D49,1)/(5*$E49),\"\")","v":0.33043478260869563},{"$f":"IFERROR(INDEX(Data!$N$33:$N$82,$D49,1)/(5*$E49),\"\")","v":6.9565217391304349E-2},1,15,722.4,1,27,816,1,14,199.79999999999998]
[null,{"$f":"'Report A'!$B51","v":"2014-07-20"},{"$f":"'Report A'!$C51","v":"Sunday"},{"$f":"'Report A'!$D51","v":20},{"$f":"IFERROR(INDEX(Data!$J$33:$J$82,$D50,1),\"\")","v":46},{"$f":"IFERROR(IF($G$16=TRUE,INDEX(Data!$K$33:$K$82,$D50,1),INDEX(Data!$K$33:$K$82,$D50,1)/$E50),\"\")","v":36},{"$f":"IFERROR(IF($G$16=TRUE,INDEX(Data!$L$33:$L$82,$D50,1),INDEX(Data!$L$33:$L$82,$D50,1)/(2*$E50)),\"\")","v":51},{"$f":"IFERROR(IF($G$16=TRUE,INDEX(Data!$M$33:$M$82,$D50,1),INDEX(Data!$M$33:$M$82,$D50,1)/$E50),\"\")","v":44},{"$f":"IFERROR(IF($G$16=TRUE,INDEX(Data!$N$33:$N$82,$D50,1),INDEX(Data!$N$33:$N$82,$D50,1)/$E50),\"\")","v":11},{"$f":"IFERROR(IF($G$16=TRUE,INDEX(Data!$K$33:$K$82,$D50,1)+INDEX(Data!$L$33:$L$82,$D50,1)+INDEX(Data!$M$33:$M$82,$D50,1)+INDEX(Data!$N$33:$N$82,$D50,1),(INDEX(Data!$K$33:$K$82,$D50,1)+INDEX(Data!$L$33:$L$82,$D50,1)+INDEX(Data!$M$33:$M$82,$D50,1)+INDEX(Data!$N$33:$N$82,$D50,1))/(5*$E50)),\"\")","v":142},{"$f":"IFERROR(INDEX(Data!$K$33:$K$82,$D50,1)/(5*$E50),\"\")","v":0.15652173913043479},{"$f":"IFERROR(INDEX(Data!$L$33:$L$82,$D50,1)/(5*$E50),\"\")","v":0.22173913043478261},{"$f":"IFERROR(INDEX(Data!$M$33:$M$82,$D50,1)/(5*$E50),\"\")","v":0.19130434782608696},{"$f":"IFERROR(INDEX(Data!$N$33:$N$82,$D50,1)/(5*$E50),\"\")","v":4.7826086956521741E-2},0,"","",1,23,629.20000000000005,1,4,36]
[null,{"$f":"'Report A'!$B52","v":"2014-07-21"},{"$f":"'Report A'!$C52","v":"Monday"},{"$f":"'Report A'!$D52","v":21},{"$f":"IFERROR(INDEX(Data!$J$33:$J$82,$D51,1),\"\")","v":46},{"$f":"IFERROR(IF($G$16=TRUE,INDEX(Data!$K$33:$K$82,$D51,1),INDEX(Data!$K$33:$K$82,$D51,1)/$E51),\"\")","v":20},{"$f":"IFERROR(IF($G$16=TRUE,INDEX(Data!$L$33:$L$82,$D51,1),INDEX(Data!$L$33:$L$82,$D51,1)/(2*$E51)),\"\")","v":18},{"$f":"IFERROR(IF($G$16=TRUE,INDEX(Data!$M$33:$M$82,$D51,1),INDEX(Data!$M$33:$M$82,$D51,1)/$E51),\"\")","v":29},{"$f":"IFERROR(IF($G$16=TRUE,INDEX(Data!$N$33:$N$82,$D51,1),INDEX(Data!$N$33:$N$82,$D51,1)/$E51),\"\")","v":11},{"$f":"IFERROR(IF($G$16=TRUE,INDEX(Data!$K$33:$K$82,$D51,1)+INDEX(Data!$L$33:$L$82,$D51,1)+INDEX(Data!$M$33:$M$82,$D51,1)+INDEX(Data!$N$33:$N$82,$D51,1),(INDEX(Data!$K$33:$K$82,$D51,1)+INDEX(Data!$L$33:$L$82,$D51,1)+INDEX(Data!$M$33:$M$82,$D51,1)+INDEX(Data!$N$33:$N$82,$D51,1))/(5*$E51)),\"\")","v":78},{"$f":"IFERROR(INDEX(Data!$K$33:$K$82,$D51,1)/(5*$E51),\"\")","v":8.6956521739130432E-2},{"$f":"IFERROR(INDEX(Data!$L$33:$L$82,$D51,1)/(5*$E51),\"\")","v":7.8260869565217397E-2},{"$f":"IFERROR(INDEX(Data!$M$33:$M$82,$D51,1)/(5*$E51),\"\")","v":0.12608695652173912},{"$f":"IFERROR(INDEX(Data!$N$33:$N$82,$D51,1)/(5*$E51),\"\")","v":4.7826086956521741E-2},0,"","",1,4,39.6,0,"",""]
[null,{"$f":"'Report A'!$B53","v":"2014-07-22"},{"$f":"'Report A'!$C53","v":"Tuesday"},{"$f":"'Report A'!$D53","v":22},{"$f":"IFERROR(INDEX(Data!$J$33:$J$82,$D52,1),\"\")","v":46},{"$f":"IFERROR(IF($G$16=TRUE,INDEX(Data!$K$33:$K$82,$D52,1),INDEX(Data!$K$33:$K$82,$D52,1)/$E52),\"\")","v":16},{"$f":"IFERROR(IF($G$16=TRUE,INDEX(Data!$L$33:$L$82,$D52,1),INDEX(Data!$L$33:$L$82,$D52,1)/(2*$E52)),\"\")","v":18},{"$f":"IFERROR(IF($G$16=TRUE,INDEX(Data!$M$33:$M$82,$D52,1),INDEX(Data!$M$33:$M$82,$D52,1)/$E52),\"\")","v":38},{"$f":"IFERROR(IF($G$16=TRUE,INDEX(Data!$N$33:$N$82,$D52,1),INDEX(Data!$N$33:$N$82,$D52,1)/$E52),\"\")","v":12},{"$f":"IFERROR(IF($G$16=TRUE,INDEX(Data!$K$33:$K$82,$D52,1)+INDEX(Data!$L$33:$L$82,$D52,1)+INDEX(Data!$M$33:$M$82,$D52,1)+INDEX(Data!$N$33:$N$82,$D52,1),(INDEX(Data!$K$33:$K$82,$D52,1)+INDEX(Data!$L$33:$L$82,$D52,1)+INDEX(Data!$M$33:$M$82,$D52,1)+INDEX(Data!$N$33:$N$82,$D52,1))/(5*$E52)),\"\")","v":84},{"$f":"IFERROR(INDEX(Data!$K$33:$K$82,$D52,1)/(5*$E52),\"\")","v":6.9565217391304349E-2},{"$f":"IFERROR(INDEX(Data!$L$33:$L$82,$D52,1)/(5*$E52),\"\")","v":7.8260869565217397E-2},{"$f":"IFERROR(INDEX(Data!$M$33:$M$82,$D52,1)/(5*$E52),\"\")","v":0.16521739130434782},{"$f":"IFERROR(INDEX(Data!$N$33:$N$82,$D52,1)/(5*$E52),\"\")","v":5.2173913043478258E-2},0,"","",0,"","",0,"",""]
[null,{"$f":"'Report A'!$B54","v":"2014-07-23"},{"$f":"'Report A'!$C54","v":"Wednesday"},{"$f":"'Report A'!$D54","v":23},{"$f":"IFERROR(INDEX(Data!$J$33:$J$82,$D53,1),\"\")","v":46},{"$f":"IFERROR(IF($G$16=TRUE,INDEX(Data!$K$33:$K$82,$D53,1),INDEX(Data!$K$33:$K$82,$D53,1)/$E53),\"\")","v":14},{"$f":"IFERROR(IF($G$16=TRUE,INDEX(Data!$L$33:$L$82,$D53,1),INDEX(Data!$L$33:$L$82,$D53,1)/(2*$E53)),\"\")","v":22},{"$f":"IFERROR(IF($G$16=TRUE,INDEX(Data!$M$33:$M$82,$D53,1),INDEX(Data!$M$33:$M$82,$D53,1)/$E53),\"\")","v":25},{"$f":"IFERROR(IF($G$16=TRUE,INDEX(Data!$N$33:$N$82,$D53,1),INDEX(Data!$N$33:$N$82,$D53,1)/$E53),\"\")","v":9},{"$f":"IFERROR(IF($G$16=TRUE,INDEX(Data!$K$33:$K$82,$D53,1)+INDEX(Data!$L$33:$L$82,$D53,1)+INDEX(Data!$M$33:$M$82,$D53,1)+INDEX(Data!$N$33:$N$82,$D53,1),(INDEX(Data!$K$33:$K$82,$D53,1)+INDEX(Data!$L$33:$L$82,$D53,1)+INDEX(Data!$M$33:$M$82,$D53,1)+INDEX(Data!$N$33:$N$82,$D53,1))/(5*$E53)),\"\")","v":70},{"$f":"IFERROR(INDEX(Data!$K$33:$K$82,$D53,1)/(5*$E53),\"\")","v":6.0869565217391307E-2},{"$f":"IFERROR(INDEX(Data!$L$33:$L$82,$D53,1)/(5*$E53),\"\")","v":9.5652173913043481E-2},{"$f":"IFERROR(INDEX(Data!$M$33:$M$82,$D53,1)/(5*$E53),\"\")","v":0.10869565217391304},{"$f":"IFERROR(INDEX(Data!$N$33:$N$82,$D53,1)/(5*$E53),\"\")","v":3.9130434782608699E-2},0,"","",0,"","",0,"",""]
[null,{"$f":"'Report A'!$B55","v":"2014-07-24"},{"$f":"'Report A'!$C55","v":"Thursday"},{"$f":"'Report A'!$D55","v":24},{"$f":"IFERROR(INDEX(Data!$J$33:$J$82,$D54,1),\"\")","v":46},{"$f":"IFERROR(IF($G$16=TRUE,INDEX(Data!$K$33:$K$82,$D54,1),INDEX(Data!$K$33:$K$82,$D54,1)/$E54),\"\")","v":17},{"$f":"IFERROR(IF($G$16=TRUE,INDEX(Data!$L$33:$L$82,$D54,1),INDEX(Data!$L$33:$L$82,$D54,1)/(2*$E54)),\"\")","v":21},{"$f":"IFERROR(IF($G$16=TRUE,INDEX(Data!$M$33:$M$82,$D54,1),INDEX(Data!$M$33:$M$82,$D54,1)/$E54),\"\")","v":35},{"$f":"IFERROR(IF($G$16=TRUE,INDEX(Data!$N$33:$N$82,$D54,1),INDEX(Data!$N$33:$N$82,$D54,1)/$E54),\"\")","v":6},{"$f":"IFERROR(IF($G$16=TRUE,INDEX(Data!$K$33:$K$82,$D54,1)+INDEX(Data!$L$33:$L$82,$D54,1)+INDEX(Data!$M$33:$M$82,$D54,1)+INDEX(Data!$N$33:$N$82,$D54,1),(INDEX(Data!$K$33:$K$82,$D54,1)+INDEX(Data!$L$33:$L$82,$D54,1)+INDEX(Data!$M$33:$M$82,$D54,1)+INDEX(Data!$N$33:$N$82,$D54,1))/(5*$E54)),\"\")","v":79},{"$f":"IFERROR(INDEX(Data!$K$33:$K$82,$D54,1)/(5*$E54),\"\")","v":7.3913043478260873E-2},{"$f":"IFERROR(INDEX(Data!$L$33:$L$82,$D54,1)/(5*$E54),\"\")","v":9.1304347826086957E-2},{"$f":"IFERROR(INDEX(Data!$M$33:$M$82,$D54,1)/(5*$E54),\"\")","v":0.15217391304347827},{"$f":"IFERROR(INDEX(Data!$N$33:$N$82,$D54,1)/(5*$E54),\"\")","v":2.6086956521739129E-2},1,9,95.2,1,10,119,1,8,194]
[null,{"$f":"'Report A'!$B56","v":"2014-07-25"},{"$f":"'Report A'!$C56","v":"Friday"},{"$f":"'Report A'!$D56","v":25},{"$f":"IFERROR(INDEX(Data!$J$33:$J$82,$D55,1),\"\")","v":46},{"$f":"IFERROR(IF($G$16=TRUE,INDEX(Data!$K$33:$K$82,$D55,1),INDEX(Data!$K$33:$K$82,$D55,1)/$E55),\"\")","v":23},{"$f":"IFERROR(IF($G$16=TRUE,INDEX(Data!$L$33:$L$82,$D55,1),INDEX(Data!$L$33:$L$82,$D55,1)/(2*$E55)),\"\")","v":23},{"$f":"IFERROR(IF($G$16=TRUE,INDEX(Data!$M$33:$M$82,$D55,1),INDEX(Data!$M$33:$M$82,$D55,1)/$E55),\"\")","v":49},{"$f":"IFERROR(IF($G$16=TRUE,INDEX(Data!$N$33:$N$82,$D55,1),INDEX(Data!$N$33:$N$82,$D55,1)/$E55),\"\")","v":6},{"$f":"IFERROR(IF($G$16=TRUE,INDEX(Data!$K$33:$K$82,$D55,1)+INDEX(Data!$L$33:$L$82,$D55,1)+INDEX(Data!$M$33:$M$82,$D55,1)+INDEX(Data!$N$33:$N$82,$D55,1),(INDEX(Data!$K$33:$K$82,$D55,1)+INDEX(Data!$L$33:$L$82,$D55,1)+INDEX(Data!$M$33:$M$82,$D55,1)+INDEX(Data!$N$33:$N$82,$D55,1))/(5*$E55)),\"\")","v":101},{"$f":"IFERROR(INDEX(Data!$K$33:$K$82,$D55,1)/(5*$E55),\"\")","v":0.1},{"$f":"IFERROR(INDEX(Data!$L$33:$L$82,$D55,1)/(5*$E55),\"\")","v":0.1},{"$f":"IFERROR(INDEX(Data!$M$33:$M$82,$D55,1)/(5*$E55),\"\")","v":0.21304347826086956},{"$f":"IFERROR(INDEX(Data!$N$33:$N$82,$D55,1)/(5*$E55),\"\")","v":2.6086956521739129E-2},0,"","",1,9,134.1,0,"",""]
[null,{"$f":"'Report A'!$B57","v":"2014-07-26"},{"$f":"'Report A'!$C57","v":"Saturday"},{"$f":"'Report A'!$D57","v":26},{"$f":"IFERROR(INDEX(Data!$J$33:$J$82,$D56,1),\"\")","v":46},{"$f":"IFERROR(IF($G$16=TRUE,INDEX(Data!$K$33:$K$82,$D56,1),INDEX(Data!$K$33:$K$82,$D56,1)/$E56),\"\")","v":45},{"$f":"IFERROR(IF($G$16=TRUE,INDEX(Data!$L$33:$L$82,$D56,1),INDEX(Data!$L$33:$L$82,$D56,1)/(2*$E56)),\"\")","v":51},{"$f":"IFERROR(IF($G$16=TRUE,INDEX(Data!$M$33:$M$82,$D56,1),INDEX(Data!$M$33:$M$82,$D56,1)/$E56),\"\")","v":83},{"$f":"IFERROR(IF($G$16=TRUE,INDEX(Data!$N$33:$N$82,$D56,1),INDEX(Data!$N$33:$N$82,$D56,1)/$E56),\"\")","v":9},{"$f":"IFERROR(IF($G$16=TRUE,INDEX(Data!$K$33:$K$82,$D56,1)+INDEX(Data!$L$33:$L$82,$D56,1)+INDEX(Data!$M$33:$M$82,$D56,1)+INDEX(Data!$N$33:$N$82,$D56,1),(INDEX(Data!$K$33:$K$82,$D56,1)+INDEX(Data!$L$33:$L$82,$D56,1)+INDEX(Data!$M$33:$M$82,$D56,1)+INDEX(Data!$N$33:$N$82,$D56,1))/(5*$E56)),\"\")","v":188},{"$f":"IFERROR(INDEX(Data!$K$33:$K$82,$D56,1)/(5*$E56),\"\")","v":0.19565217391304349},{"$f":"IFERROR(INDEX(Data!$L$33:$L$82,$D56,1)/(5*$E56),\"\")","v":0.22173913043478261},{"$f":"IFERROR(INDEX(Data!$M$33:$M$82,$D56,1)/(5*$E56),\"\")","v":0.36086956521739133},{"$f":"IFERROR(INDEX(Data!$N$33:$N$82,$D56,1)/(5*$E56),\"\")","v":3.9130434782608699E-2},1,27,596.70000000000005,1,33,1094.4000000000001,1,26,695.4]
[null,{"$f":"'Report A'!$B58","v":"2014-07-27"},{"$f":"'Report A'!$C58","v":"Sunday +"},{"$f":"'Report A'!$D58","v":27},{"$f":"IFERROR(INDEX(Data!$J$33:$J$82,$D57,1),\"\")","v":46},{"$f":"IFERROR(IF($G$16=TRUE,INDEX(Data!$K$33:$K$82,$D57,1),INDEX(Data!$K$33:$K$82,$D57,1)/$E57),\"\")","v":47},{"$f":"IFERROR(IF($G$16=TRUE,INDEX(Data!$L$33:$L$82,$D57,1),INDEX(Data!$L$33:$L$82,$D57,1)/(2*$E57)),\"\")","v":47},{"$f":"IFERROR(IF($G$16=TRUE,INDEX(Data!$M$33:$M$82,$D57,1),INDEX(Data!$M$33:$M$82,$D57,1)/$E57),\"\")","v":83},{"$f":"IFERROR(IF($G$16=TRUE,INDEX(Data!$N$33:$N$82,$D57,1),INDEX(Data!$N$33:$N$82,$D57,1)/$E57),\"\")","v":15},{"$f":"IFERROR(IF($G$16=TRUE,INDEX(Data!$K$33:$K$82,$D57,1)+INDEX(Data!$L$33:$L$82,$D57,1)+INDEX(Data!$M$33:$M$82,$D57,1)+INDEX(Data!$N$33:$N$82,$D57,1),(INDEX(Data!$K$33:$K$82,$D57,1)+INDEX(Data!$L$33:$L$82,$D57,1)+INDEX(Data!$M$33:$M$82,$D57,1)+INDEX(Data!$N$33:$N$82,$D57,1))/(5*$E57)),\"\")","v":192},{"$f":"IFERROR(INDEX(Data!$K$33:$K$82,$D57,1)/(5*$E57),\"\")","v":0.20434782608695654},{"$f":"IFERROR(INDEX(Data!$L$33:$L$82,$D57,1)/(5*$E57),\"\")","v":0.20434782608695654},{"$f":"IFERROR(INDEX(Data!$M$33:$M$82,$D57,1)/(5*$E57),\"\")","v":0.36086956521739133},{"$f":"IFERROR(INDEX(Data!$N$33:$N$82,$D57,1)/(5*$E57),\"\")","v":6.5217391304347824E-2},1,35,709.1,1,28,633,1,16,273]
[null,{"$f":"'Report A'!$B59","v":"2014-07-28"},{"$f":"'Report A'!$C59","v":"Monday ++"},{"$f":"'Report A'!$D59","v":28},{"$f":"IFERROR(INDEX(Data!$J$33:$J$82,$D58,1),\"\")","v":46},{"$f":"IFERROR(IF($G$16=TRUE,INDEX(Data!$K$33:$K$82,$D58,1),INDEX(Data!$K$33:$K$82,$D58,1)/$E58),\"\")","v":46},{"$f":"IFERROR(IF($G$16=TRUE,INDEX(Data!$L$33:$L$82,$D58,1),INDEX(Data!$L$33:$L$82,$D58,1)/(2*$E58)),\"\")","v":46},{"$f":"IFERROR(IF($G$16=TRUE,INDEX(Data!$M$33:$M$82,$D58,1),INDEX(Data!$M$33:$M$82,$D58,1)/$E58),\"\")","v":76},{"$f":"IFERROR(IF($G$16=TRUE,INDEX(Data!$N$33:$N$82,$D58,1),INDEX(Data!$N$33:$N$82,$D58,1)/$E58),\"\")","v":9},{"$f":"IFERROR(IF($G$16=TRUE,INDEX(Data!$K$33:$K$82,$D58,1)+INDEX(Data!$L$33:$L$82,$D58,1)+INDEX(Data!$M$33:$M$82,$D58,1)+INDEX(Data!$N$33:$N$82,$D58,1),(INDEX(Data!$K$33:$K$82,$D58,1)+INDEX(Data!$L$33:$L$82,$D58,1)+INDEX(Data!$M$33:$M$82,$D58,1)+INDEX(Data!$N$33:$N$82,$D58,1))/(5*$E58)),\"\")","v":177},{"$f":"IFERROR(INDEX(Data!$K$33:$K$82,$D58,1)/(5*$E58),\"\")","v":0.2},{"$f":"IFERROR(INDEX(Data!$L$33:$L$82,$D58,1)/(5*$E58),\"\")","v":0.2},{"$f":"IFERROR(INDEX(Data!$M$33:$M$82,$D58,1)/(5*$E58),\"\")","v":0.33043478260869563},{"$f":"IFERROR(INDEX(Data!$N$33:$N$82,$D58,1)/(5*$E58),\"\")","v":3.9130434782608699E-2},1,16,952,1,20,351,1,15,329.6]
[null,{"$f":"'Report A'!$B60","v":"2014-07-29"},{"$f":"'Report A'!$C60","v":"Tuesday ++"},{"$f":"'Report A'!$D60","v":29},{"$f":"IFERROR(INDEX(Data!$J$33:$J$82,$D59,1),\"\")","v":46},{"$f":"IFERROR(IF($G$16=TRUE,INDEX(Data!$K$33:$K$82,$D59,1),INDEX(Data!$K$33:$K$82,$D59,1)/$E59),\"\")","v":46},{"$f":"IFERROR(IF($G$16=TRUE,INDEX(Data!$L$33:$L$82,$D59,1),INDEX(Data!$L$33:$L$82,$D59,1)/(2*$E59)),\"\")","v":46},{"$f":"IFERROR(IF($G$16=TRUE,INDEX(Data!$M$33:$M$82,$D59,1),INDEX(Data!$M$33:$M$82,$D59,1)/$E59),\"\")","v":74},{"$f":"IFERROR(IF($G$16=TRUE,INDEX(Data!$N$33:$N$82,$D59,1),INDEX(Data!$N$33:$N$82,$D59,1)/$E59),\"\")","v":9},{"$f":"IFERROR(IF($G$16=TRUE,INDEX(Data!$K$33:$K$82,$D59,1)+INDEX(Data!$L$33:$L$82,$D59,1)+INDEX(Data!$M$33:$M$82,$D59,1)+INDEX(Data!$N$33:$N$82,$D59,1),(INDEX(Data!$K$33:$K$82,$D59,1)+INDEX(Data!$L$33:$L$82,$D59,1)+INDEX(Data!$M$33:$M$82,$D59,1)+INDEX(Data!$N$33:$N$82,$D59,1))/(5*$E59)),\"\")","v":175},{"$f":"IFERROR(INDEX(Data!$K$33:$K$82,$D59,1)/(5*$E59),\"\")","v":0.2},{"$f":"IFERROR(INDEX(Data!$L$33:$L$82,$D59,1)/(5*$E59),\"\")","v":0.2},{"$f":"IFERROR(INDEX(Data!$M$33:$M$82,$D59,1)/(5*$E59),\"\")","v":0.32173913043478258},{"$f":"IFERROR(INDEX(Data!$N$33:$N$82,$D59,1)/(5*$E59),\"\")","v":3.9130434782608699E-2},1,16,250.8,1,34,736.4,1,15,185.6]
[null,{"$f":"'Report A'!$B61","v":"2014-07-30"},{"$f":"'Report A'!$C61","v":"Wednesday"},{"$f":"'Report A'!$D61","v":30},{"$f":"IFERROR(INDEX(Data!$J$33:$J$82,$D60,1),\"\")","v":46},{"$f":"IFERROR(IF($G$16=TRUE,INDEX(Data!$K$33:$K$82,$D60,1),INDEX(Data!$K$33:$K$82,$D60,1)/$E60),\"\")","v":42},{"$f":"IFERROR(IF($G$16=TRUE,INDEX(Data!$L$33:$L$82,$D60,1),INDEX(Data!$L$33:$L$82,$D60,1)/(2*$E60)),\"\")","v":47},{"$f":"IFERROR(IF($G$16=TRUE,INDEX(Data!$M$33:$M$82,$D60,1),INDEX(Data!$M$33:$M$82,$D60,1)/$E60),\"\")","v":51},{"$f":"IFERROR(IF($G$16=TRUE,INDEX(Data!$N$33:$N$82,$D60,1),INDEX(Data!$N$33:$N$82,$D60,1)/$E60),\"\")","v":10},{"$f":"IFERROR(IF($G$16=TRUE,INDEX(Data!$K$33:$K$82,$D60,1)+INDEX(Data!$L$33:$L$82,$D60,1)+INDEX(Data!$M$33:$M$82,$D60,1)+INDEX(Data!$N$33:$N$82,$D60,1),(INDEX(Data!$K$33:$K$82,$D60,1)+INDEX(Data!$L$33:$L$82,$D60,1)+INDEX(Data!$M$33:$M$82,$D60,1)+INDEX(Data!$N$33:$N$82,$D60,1))/(5*$E60)),\"\")","v":150},{"$f":"IFERROR(INDEX(Data!$K$33:$K$82,$D60,1)/(5*$E60),\"\")","v":0.18260869565217391},{"$f":"IFERROR(INDEX(Data!$L$33:$L$82,$D60,1)/(5*$E60),\"\")","v":0.20434782608695654},{"$f":"IFERROR(INDEX(Data!$M$33:$M$82,$D60,1)/(5*$E60),\"\")","v":0.22173913043478261},{"$f":"IFERROR(INDEX(Data!$N$33:$N$82,$D60,1)/(5*$E60),\"\")","v":4.3478260869565216E-2},1,20,316,1,11,140.4,1,5,49.5]
[null,{"$f":"'Report A'!$B62","v":"2014-07-31"},{"$f":"'Report A'!$C62","v":"Thursday"},{"$f":"'Report A'!$D62","v":31},{"$f":"IFERROR(INDEX(Data!$J$33:$J$82,$D61,1),\"\")","v":46},{"$f":"IFERROR(IF($G$16=TRUE,INDEX(Data!$K$33:$K$82,$D61,1),INDEX(Data!$K$33:$K$82,$D61,1)/$E61),\"\")","v":44},{"$f":"IFERROR(IF($G$16=TRUE,INDEX(Data!$L$33:$L$82,$D61,1),INDEX(Data!$L$33:$L$82,$D61,1)/(2*$E61)),\"\")","v":40},{"$f":"IFERROR(IF($G$16=TRUE,INDEX(Data!$M$33:$M$82,$D61,1),INDEX(Data!$M$33:$M$82,$D61,1)/$E61),\"\")","v":35},{"$f":"IFERROR(IF($G$16=TRUE,INDEX(Data!$N$33:$N$82,$D61,1),INDEX(Data!$N$33:$N$82,$D61,1)/$E61),\"\")","v":10},{"$f":"IFERROR(IF($G$16=TRUE,INDEX(Data!$K$33:$K$82,$D61,1)+INDEX(Data!$L$33:$L$82,$D61,1)+INDEX(Data!$M$33:$M$82,$D61,1)+INDEX(Data!$N$33:$N$82,$D61,1),(INDEX(Data!$K$33:$K$82,$D61,1)+INDEX(Data!$L$33:$L$82,$D61,1)+INDEX(Data!$M$33:$M$82,$D61,1)+INDEX(Data!$N$33:$N$82,$D61,1))/(5*$E61)),\"\")","v":129},{"$f":"IFERROR(INDEX(Data!$K$33:$K$82,$D61,1)/(5*$E61),\"\")","v":0.19130434782608696},{"$f":"IFERROR(INDEX(Data!$L$33:$L$82,$D61,1)/(5*$E61),\"\")","v":0.17391304347826086},{"$f":"IFERROR(INDEX(Data!$M$33:$M$82,$D61,1)/(5*$E61),\"\")","v":0.15217391304347827},{"$f":"IFERROR(INDEX(Data!$N$33:$N$82,$D61,1)/(5*$E61),\"\")","v":4.3478260869565216E-2},1,4,40,1,29,508.29999999999995,1,16,303.39999999999998]

{"sheet":"Report C","index":4,"n_rows":61,"n_cols":15,"rows_kept":61,"cut":false,"hidden":false,"merged":[]}
[]
[]
[null,null,"MONTHLY SALES REPORTING BY OUTLET"]
[]
[]
[null,"SUBJECT","REPORT C : PAX BY CATEGORY AND AVERAGE PAX PER ROOM"]
[]
[null,"OUTLET",{"$f":"Data!$C$8","v":"TSU"}]
[]
[null,"MONTH / YEAR",{"$f":"Data!$C$10","v":"July 2014"}]
[]
[null,"MENU"]
[]
[null,"DATE","DAY","ROW","TOTAL PAX PER SESSION BY CATEGORY",null,null,null,null,"AVERAGE PAX PER ROOM BY ALL CATEGORY",null,null,null,null,{"$f":"\"CHART : PAX BY \"&$G$15&\" ( CATEGORY ) AND AVERAGE PAX PER ROOM\"","v":"CHART : PAX BY STUDENT ( CATEGORY ) AND AVERAGE PAX PER ROOM"}]
[null,null,null,null,"CHOOSE CATEGORY",null,"STUDENT"]
[null,null,null,null,"NOON K","HAPPY","NORMAL","MIDNIGHT","ALL","NOON K","HAPPY","NORMAL","MIDNIGHT","ALL"]
[null,null,null,null,"( pax )","( pax )","( pax )","( pax )","( pax )","( pax )","( pax )","( pax )","( pax )","( pax )"]
[null,"SUMMARY FOR MONTH",null,null,null,null,null,null,null,null,null,null,null,null,"LEGEND"]
[]
[null,"TOTAL PAX",null,null,{"$f":"SUM(E$31:E$61)","v":0},{"$f":"SUM(F$31:F$61)","v":309},0,0,309,112.1491316125668,120.48935512947524,107.87454827141066,139.10122793872793,114.8527320573411]
[null,"AVERAGE PAX",null,null,{"$f":"IFERROR(SUM(E$31:E$61)/COUNTIF($D$31:$D$61,\">0\"),\"\")","v":0},{"$f":"IFERROR(SUM(F$31:F$61)/COUNTIF($D$31:$D$61,\">0\"),\"\")","v":9.9677419354838701},0,0,9.9677419354838701,3.617713922986026,3.8867533912733951,3.4798241377874408,4.4871363851202561,3.7049268405593905]
[null,"HIGHEST PAX",null,null,{"$f":"IFERROR(IF(LARGE(E$31:E$61,1)>0,LARGE(E$31:E$61,1),\"NIL\"),\"NIL\")","v":"NIL"},66,"NIL","NIL",66,5.625,5,4.2771084337349397,6,4.5193798449612403]
[null,"LOWEST PAX",null,null,{"$f":"IFERROR(IF(LARGE(E$31:E$61,COUNTIF(E$31:E$61,\">0\"))<>E$22,LARGE(E$31:E$61,COUNTIF(E$31:E$61,\">0\")),\"NIL\"),\"NIL\")","v":"NIL"},3,"NIL","NIL",3,2.5333333333333332,2.9,2.5428571428571427,1.1111111111111112,3.2253521126760565]
[null,"AVERAGE FOR ","MONDAY",null,{"$f":"IFERROR(SUMIF($C$31:$C$61,\"Monday*\",E$31:E$61)/COUNTIF($C$31:$C$61,\"Monday*\"),\"\")","v":0},{"$f":"IFERROR(SUMIF($C$31:$C$61,\"Monday*\",F$31:F$61)/COUNTIF($C$31:$C$61,\"Monday*\"),\"\")","v":13.5},0,0,13.5,3.552854691075515,3.9618232009536358,3.6009866053440875,4.1212121212121211,3.7841274792477635]
[null,null,"TUESDAY",null,{"$f":"IFERROR(SUMIF($C$31:$C$61,\"Tuesday*\",E$31:E$61)/COUNTIF($C$31:$C$61,\"Tuesday*\"),\"\")","v":0},{"$f":"IFERROR(SUMIF($C$31:$C$61,\"Tuesday*\",F$31:F$61)/COUNTIF($C$31:$C$61,\"Tuesday*\"),\"\")","v":5.6},0,0,5.6,3.5131901311249139,3.2317321383168065,3.3058900916974068,4.8573232323232318,3.4742788679014609]
[null,null,"WEDNESDAY",null,{"$f":"IFERROR(SUMIF($C$31:$C$61,\"Wednesday*\",E$31:E$61)/COUNTIF($C$31:$C$61,\"Wednesday*\"),\"\")","v":0},{"$f":"IFERROR(SUMIF($C$31:$C$61,\"Wednesday*\",F$31:F$61)/COUNTIF($C$31:$C$61,\"Wednesday*\"),\"\")","v":23.2},0,0,23.2,3.4172500304469606,4.2752789072464994,3.0976734899087841,5.1166666666666663,3.6527334261982149]
[null,null,"THURSDAY",null,{"$f":"IFERROR(SUMIF($C$31:$C$61,\"Thursday*\",E$31:E$61)/COUNTIF($C$31:$C$61,\"Thursday*\"),\"\")","v":0},{"$f":"IFERROR(SUMIF($C$31:$C$61,\"Thursday*\",F$31:F$61)/COUNTIF($C$31:$C$61,\"Thursday*\"),\"\")","v":22.2},0,0,22.2,3.6883792677910328,4.4453007518796985,3.6173216485411608,4.9247619047619056,3.9137214027840708]
[null,null,"FRIDAY",null,{"$f":"IFERROR(SUMIF($C$31:$C$61,\"Friday*\",E$31:E$61)/COUNTIF($C$31:$C$61,\"Friday*\"),\"\")","v":0},{"$f":"IFERROR(SUMIF($C$31:$C$61,\"Friday*\",F$31:F$61)/COUNTIF($C$31:$C$61,\"Friday*\"),\"\")","v":0},0,0,0,4.0968699677938805,4.0109434253461504,3.5360863095238093,2.8861111111111111,3.7413209116372674]
[null,null,"SATURDAY",null,{"$f":"IFERROR(SUMIF($C$31:$C$61,\"Saturday*\",E$31:E$61)/COUNTIF($C$31:$C$61,\"Saturday*\"),\"\")","v":0},{"$f":"IFERROR(SUMIF($C$31:$C$61,\"Saturday*\",F$31:F$61)/COUNTIF($C$31:$C$61,\"Saturday*\"),\"\")","v":0},0,0,0,3.6421695951107718,3.7298320254947392,3.9770133811424508,4.3791399572649574,3.8628089760090862]
[null,null,"SUNDAY",null,{"$f":"IFERROR(SUMIF($C$31:$C$61,\"Sunday*\",E$31:E$61)/COUNTIF($C$31:$C$61,\"Sunday*\"),\"\")","v":0},{"$f":"IFERROR(SUMIF($C$31:$C$61,\"Sunday*\",F$31:F$61)/COUNTIF($C$31:$C$61,\"Sunday*\"),\"\")","v":0},0,0,0,3.4718643624579038,3.4793503837705293,3.3284442341581331,4.7654040404040403,3.5240085263364747]
[null,{"$f":"'Report A'!$B32","v":"2014-07-01"},{"$f":"'Report A'!$C32","v":"Tuesday"},{"$f":"'Report A'!$D32","v":1},{"$f":"IFERROR(IF($G$15=\"ALL\",SUMIFS(INDIRECT(\"Data!$AI$\"&$D31+32&\":$AS$\"&$D31+32),Data!$AI$30:$AS$30,E$16),SUMIFS(INDIRECT(\"Data!$AI$\"&$D31+32&\":$AS$\"&$D31+32),Data!$AI$30:$AS$30,E$16,Data!$AI$31:$AS$31,$G$15)),\"\")","v":0},{"$f":"IFERROR(IF($G$15=\"ALL\",SUMIFS(INDIRECT(\"Data!$AI$\"&$D31+32&\":$AS$\"&$D31+32),Data!$AI$30:$AS$30,F$16),SUMIFS(INDIRECT(\"Data!$AI$\"&$D31+32&\":$AS$\"&$D31+32),Data!$AI$30:$AS$30,F$16,Data!$AI$31:$AS$31,$G$15)),\"\")","v":18},{"$f":"IFERROR(IF($G$15=\"ALL\",SUMIFS(INDIRECT(\"Data!$AI$\"&$D31+32&\":$AS$\"&$D31+32),Data!$AI$30:$AS$30,G$16),SUMIFS(INDIRECT(\"Data!$AI$\"&$D31+32&\":$AS$\"&$D31+32),Data!$AI$30:$AS$30,G$16,Data!$AI$31:$AS$31,$G$15)),\"\")","v":0},{"$f":"IFERROR(IF($G$15=\"ALL\",SUMIFS(INDIRECT(\"Data!$AI$\"&$D31+32&\":$AS$\"&$D31+32),Data!$AI$30:$AS$30,H$16),SUMIFS(INDIRECT(\"Data!$AI$\"&$D31+32&\":$AS$\"&$D31+32),Data!$AI$30:$AS$30,H$16,Data!$AI$31:$AS$31,$G$15)),\"\")","v":0},{"$f":"IFERROR(SUM($E31:$H31),\"\")","v":18},{"$f":"IFERROR((SUMIFS(INDIRECT(\"Data!$AI$\"&$D31+32&\":$AS$\"&$D31+32),Data!$AI$30:$AS$30,J$16))/(INDEX(Data!$K$33:$K$82,$D31,1)),\"\")","v":2.9285714285714284},{"$f":"IFERROR((SUMIFS(INDIRECT(\"Data!$AI$\"&$D31+32&\":$AS$\"&$D31+32),Data!$AI$30:$AS$30,K$16))/(INDEX(Data!$L$33:$L$82,$D31,1)),\"\")","v":3.9473684210526314},{"$f":"IFERROR((SUMIFS(INDIRECT(\"Data!$AI$\"&$D31+32&\":$AS$\"&$D31+32),Data!$AI$30:$AS$30,L$16))/(INDEX(Data!$M$33:$M$82,$D31,1)),\"\")","v":2.9166666666666665},{"$f":"IFERROR((SUMIFS(INDIRECT(\"Data!$AI$\"&$D31+32&\":$AS$\"&$D31+32),Data!$AI$30:$AS$30,M$16))/(INDEX(Data!$N$33:$N$82,$D31,1)),\"\")","v":5.375},{"$f":"IFERROR((SUM(INDIRECT(\"Data!$AI$\"&$D31+32&\":$AS$\"&$D31+32)))/(INDEX(Data!$K$33:$K$82,$D31,1)+INDEX(Data!$L$33:$L$82,$D31,1)+INDEX(Data!$M$33:$M$82,$D31,1)+INDEX(Data!$N$33:$N$82,$D31,1)),\"\")","v":3.4285714285714284}]
[null,{"$f":"'Report A'!$B33","v":"2014-07-02"},{"$f":"'Report A'!$C33","v":"Wednesday"},{"$f":"'Report A'!$D33","v":2},{"$f":"IFERROR(IF($G$15=\"ALL\",SUMIFS(INDIRECT(\"Data!$AI$\"&$D32+32&\":$AS$\"&$D32+32),Data!$AI$30:$AS$30,E$16),SUMIFS(INDIRECT(\"Data!$AI$\"&$D32+32&\":$AS$\"&$D32+32),Data!$AI$30:$AS$30,E$16,Data!$AI$31:$AS$31,$G$15)),\"\")","v":0},{"$f":"IFERROR(IF($G$15=\"ALL\",SUMIFS(INDIRECT(\"Data!$AI$\"&$D32+32&\":$AS$\"&$D32+32),Data!$AI$30:$AS$30,F$16),SUMIFS(INDIRECT(\"Data!$AI$\"&$D32+32&\":$AS$\"&$D32+32),Data!$AI$30:$AS$30,F$16,Data!$AI$31:$AS$31,$G$15)),\"\")","v":23},{"$f":"IFERROR(IF($G$15=\"ALL\",SUMIFS(INDIRECT(\"Data!$AI$\"&$D32+32&\":$AS$\"&$D32+32),Data!$AI$30:$AS$30,G$16),SUMIFS(INDIRECT(\"Data!$AI$\"&$D32+32&\":$AS$\"&$D32+32),Data!$AI$30:$AS$30,G$16,Data!$AI$31:$AS$31,$G$15)),\"\")","v":0},{"$f":"IFERROR(IF($G$15=\"ALL\",SUMIFS(INDIRECT(\"Data!$AI$\"&$D32+32&\":$AS$\"&$D32+32),Data!$AI$30:$AS$30,H$16),SUMIFS(INDIRECT(\"Data!$AI$\"&$D32+32&\":$AS$\"&$D32+32),Data!$AI$30:$AS$30,H$16,Data!$AI$31:$AS$31,$G$15)),\"\")","v":0},{"$f":"IFERROR(SUM($E32:$H32),\"\")","v":23},{"$f":"IFERROR((SUMIFS(INDIRECT(\"Data!$AI$\"&$D32+32&\":$AS$\"&$D32+32),Data!$AI$30:$AS$30,J$16))/(INDEX(Data!$K$33:$K$82,$D32,1)),\"\")","v":2.5333333333333332},{"$f":"IFERROR((SUMIFS(INDIRECT(\"Data!$AI$\"&$D32+32&\":$AS$\"&$D32+32),Data!$AI$30:$AS$30,K$16))/(INDEX(Data!$L$33:$L$82,$D32,1)),\"\")","v":5},{"$f":"IFERROR((SUMIFS(INDIRECT(\"Data!$AI$\"&$D32+32&\":$AS$\"&$D32+32),Data!$AI$30:$AS$30,L$16))/(INDEX(Data!$M$33:$M$82,$D32,1)),\"\")","v":2.5428571428571427},{"$f":"IFERROR((SUMIFS(INDIRECT(\"Data!$AI$\"&$D32+32&\":$AS$\"&$D32+32),Data!$AI$30:$AS$30,M$16))/(INDEX(Data!$N$33:$N$82,$D32,1)),\"\")","v":4.25},{"$f":"IFERROR((SUM(INDIRECT(\"Data!$AI$\"&$D32+32&\":$AS$\"&$D32+32)))/(INDEX(Data!$K$33:$K$82,$D32,1)+INDEX(Data!$L$33:$L$82,$D32,1)+INDEX(Data!$M$33:$M$82,$D32,1)+INDEX(Data!$N$33:$N$82,$D32,1)),\"\")","v":3.2253521126760565}]
[null,{"$f":"'Report A'!$B34","v":"2014-07-03"},{"$f":"'Report A'!$C34","v":"Thursday"},{"$f":"'Report A'!$D34","v":3},{"$f":"IFERROR(IF($G$15=\"ALL\",SUMIFS(INDIRECT(\"Data!$AI$\"&$D33+32&\":$AS$\"&$D33+32),Data!$AI$30:$AS$30,E$16),SUMIFS(INDIRECT(\"Data!$AI$\"&$D33+32&\":$AS$\"&$D33+32),Data!$AI$30:$AS$30,E$16,Data!$AI$31:$AS$31,$G$15)),\"\")","v":0},{"$f":"IFERROR(IF($G$15=\"ALL\",SUMIFS(INDIRECT(\"Data!$AI$\"&$D33+32&\":$AS$\"&$D33+32),Data!$AI$30:$AS$30,F$16),SUMIFS(INDIRECT(\"Data!$AI$\"&$D33+32&\":$AS$\"&$D33+32),Data!$AI$30:$AS$30,F$16,Data!$AI$31:$AS$31,$G$15)),\"\")","v":16},{"$f":"IFERROR(IF($G$15=\"ALL\",SUMIFS(INDIRECT(\"Data!$AI$\"&$D33+32&\":$AS$\"&$D33+32),Data!$AI$30:$AS$30,G$16),SUMIFS(INDIRECT(\"Data!$AI$\"&$D33+32&\":$AS$\"&$D33+32),Data!$AI$30:$AS$30,G$16,Data!$AI$31:$AS$31,$G$15)),\"\")","v":0},{"$f":"IFERROR(IF($G$15=\"ALL\",SUMIFS(INDIRECT(\"Data!$AI$\"&$D33+32&\":$AS$\"&$D33+32),Data!$AI$30:$AS$30,H$16),SUMIFS(INDIRECT(\"Data!$AI$\"&$D33+32&\":$AS$\"&$D33+32),Data!$AI$30:$AS$30,H$16,Data!$AI$31:$AS$31,$G$15)),\"\")","v":0},16,{"$f":"IFERROR((SUMIFS(INDIRECT(\"Data!$AI$\"&$D33+32&\":$AS$\"&$D33+32),Data!$AI$30:$AS$30,J$16))/(INDEX(Data!$K$33:$K$82,$D33,1)),\"\")","v":3.2307692307692308},{"$f":"IFERROR((SUMIFS(INDIRECT(\"Data!$AI$\"&$D33+32&\":$AS$\"&$D33+32),Data!$AI$30:$AS$30,K$16))/(INDEX(Data!$L$33:$L$82,$D33,1)),\"\")","v":4.3157894736842106},{"$f":"IFERROR((SUMIFS(INDIRECT(\"Data!$AI$\"&$D33+32&\":$AS$\"&$D33+32),Data!$AI$30:$AS$30,L$16))/(INDEX(Data!$M$33:$M$82,$D33,1)),\"\")","v":3.7454545454545456},{"$f":"IFERROR((SUMIFS(INDIRECT(\"Data!$AI$\"&$D33+32&\":$AS$\"&$D33+32),Data!$AI$30:$AS$30,M$16))/(INDEX(Data!$N$33:$N$82,$D33,1)),\"\")","v":5.75},{"$f":"IFERROR((SUM(INDIRECT(\"Data!$AI$\"&$D33+32&\":$AS$\"&$D33+32)))/(INDEX(Data!$K$33:$K$82,$D33,1)+INDEX(Data!$L$33:$L$82,$D33,1)+INDEX(Data!$M$33:$M$82,$D33,1)+INDEX(Data!$N$33:$N$82,$D33,1)),\"\")","v":3.8791208791208791}]
[null,{"$f":"'Report A'!$B35","v":"2014-07-04"},{"$f":"'Report A'!$C35","v":"Friday"},{"$f":"'Report A'!$D35","v":4},{"$f":"IFERROR(IF($G$15=\"ALL\",SUMIFS(INDIRECT(\"Data!$AI$\"&$D34+32&\":$AS$\"&$D34+32),Data!$AI$30:$AS$30,E$16),SUMIFS(INDIRECT(\"Data!$AI$\"&$D34+32&\":$AS$\"&$D34+32),Data!$AI$30:$AS$30,E$16,Data!$AI$31:$AS$31,$G$15)),\"\")","v":0},{"$f":"IFERROR(IF($G$15=\"ALL\",SUMIFS(INDIRECT(\"Data!$AI$\"&$D34+32&\":$AS$\"&$D34+32),Data!$AI$30:$AS$30,F$16),SUMIFS(INDIRECT(\"Data!$AI$\"&$D34+32&\":$AS$\"&$D34+32),Data!$AI$30:$AS$30,F$16,Data!$AI$31:$AS$31,$G$15)),\"\")","v":0},{"$f":"IFERROR(IF($G$15=\"ALL\",SUMIFS(INDIRECT(\"Data!$AI$\"&$D34+32&\":$AS$\"&$D34+32),Data!$AI$30:$AS$30,G$16),SUMIFS(INDIRECT(\"Data!$AI$\"&$D34+32&\":$AS$\"&$D34+32),Data!$AI$30:$AS$30,G$16,Data!$AI$31:$AS$31,$G$15)),\"\")","v":0},{"$f":"IFERROR(IF($G$15=\"ALL\",SUMIFS(INDIRECT(\"Data!$AI$\"&$D34+32&\":$AS$\"&$D34+32),Data!$AI$30:$AS$30,H$16),SUMIFS(INDIRECT(\"Data!$AI$\"&$D34+32&\":$AS$\"&$D34+32),Data!$AI$30:$AS$30,H$16,Data!$AI$31:$AS$31,$G$15)),\"\")","v":0},0,{"$f":"IFERROR((SUMIFS(INDIRECT(\"Data!$AI$\"&$D34+32&\":$AS$\"&$D34+32),Data!$AI$30:$AS$30,J$16))/(INDEX(Data!$K$33:$K$82,$D34,1)),\"\")","v":3.5},{"$f":"IFERROR((SUMIFS(INDIRECT(\"Data!$AI$\"&$D34+32&\":$AS$\"&$D34+32),Data!$AI$30:$AS$30,K$16))/(INDEX(Data!$L$33:$L$82,$D34,1)),\"\")","v":4.068965517241379},{"$f":"IFERROR((SUMIFS(INDIRECT(\"Data!$AI$\"&$D34+32&\":$AS$\"&$D34+32),Data!$AI$30:$AS$30,L$16))/(INDEX(Data!$M$33:$M$82,$D34,1)),\"\")","v":3.390625},{"$f":"IFERROR((SUMIFS(INDIRECT(\"Data!$AI$\"&$D34+32&\":$AS$\"&$D34+32),Data!$AI$30:$AS$30,M$16))/(INDEX(Data!$N$33:$N$82,$D34,1)),\"\")","v":3},{"$f":"IFERROR((SUM(INDIRECT(\"Data!$AI$\"&$D34+32&\":$AS$\"&$D34+32)))/(INDEX(Data!$K$33:$K$82,$D34,1)+INDEX(Data!$L$33:$L$82,$D34,1)+INDEX(Data!$M$33:$M$82,$D34,1)+INDEX(Data!$N$33:$N$82,$D34,1)),\"\")","v":3.556451612903226}]
[null,{"$f":"'Report A'!$B36","v":"2014-07-05"},{"$f":"'Report A'!$C36","v":"Saturday"},{"$f":"'Report A'!$D36","v":5},{"$f":"IFERROR(IF($G$15=\"ALL\",SUMIFS(INDIRECT(\"Data!$AI$\"&$D35+32&\":$AS$\"&$D35+32),Data!$AI$30:$AS$30,E$16),SUMIFS(INDIRECT(\"Data!$AI$\"&$D35+32&\":$AS$\"&$D35+32),Data!$AI$30:$AS$30,E$16,Data!$AI$31:$AS$31,$G$15)),\"\")","v":0},{"$f":"IFERROR(IF($G$15=\"ALL\",SUMIFS(INDIRECT(\"Data!$AI$\"&$D35+32&\":$AS$\"&$D35+32),Data!$AI$30:$AS$30,F$16),SUMIFS(INDIRECT(\"Data!$AI$\"&$D35+32&\":$AS$\"&$D35+32),Data!$AI$30:$AS$30,F$16,Data!$AI$31:$AS$31,$G$15)),\"\")","v":0},{"$f":"IFERROR(IF($G$15=\"ALL\",SUMIFS(INDIRECT(\"Data!$AI$\"&$D35+32&\":$AS$\"&$D35+32),Data!$AI$30:$AS$30,G$16),SUMIFS(INDIRECT(\"Data!$AI$\"&$D35+32&\":$AS$\"&$D35+32),Data!$AI$30:$AS$30,G$16,Data!$AI$31:$AS$31,$G$15)),\"\")","v":0},{"$f":"IFERROR(IF($G$15=\"ALL\",SUMIFS(INDIRECT(\"Data!$AI$\"&$D35+32&\":$AS$\"&$D35+32),Data!$AI$30:$AS$30,H$16),SUMIFS(INDIRECT(\"Data!$AI$\"&$D35+32&\":$AS$\"&$D35+32),Data!$AI$30:$AS$30,H$16,Data!$AI$31:$AS$31,$G$15)),\"\")","v":0},0,{"$f":"IFERROR((SUMIFS(INDIRECT(\"Data!$AI$\"&$D35+32&\":$AS$\"&$D35+32),Data!$AI$30:$AS$30,J$16))/(INDEX(Data!$K$33:$K$82,$D35,1)),\"\")","v":3.8285714285714287},{"$f":"IFERROR((SUMIFS(INDIRECT(\"Data!$AI$\"&$D35+32&\":$AS$\"&$D35+32),Data!$AI$30:$AS$30,K$16))/(INDEX(Data!$L$33:$L$82,$D35,1)),\"\")","v":4.2444444444444445},{"$f":"IFERROR((SUMIFS(INDIRECT(\"Data!$AI$\"&$D35+32&\":$AS$\"&$D35+32),Data!$AI$30:$AS$30,L$16))/(INDEX(Data!$M$33:$M$82,$D35,1)),\"\")","v":3.732394366197183},{"$f":"IFERROR((SUMIFS(INDIRECT(\"Data!$AI$\"&$D35+32&\":$AS$\"&$D35+32),Data!$AI$30:$AS$30,M$16))/(INDEX(Data!$N$33:$N$82,$D35,1)),\"\")","v":4.3888888888888893},{"$f":"IFERROR((SUM(INDIRECT(\"Data!$AI$\"&$D35+32&\":$AS$\"&$D35+32)))/(INDEX(Data!$K$33:$K$82,$D35,1)+INDEX(Data!$L$33:$L$82,$D35,1)+INDEX(Data!$M$33:$M$82,$D35,1)+INDEX(Data!$N$33:$N$82,$D35,1)),\"\")","v":3.9585798816568047}]
[null,{"$f":"'Report A'!$B37","v":"2014-07-06"},{"$f":"'Report A'!$C37","v":"Sunday"},{"$f":"'Report A'!$D37","v":6},{"$f":"IFERROR(IF($G$15=\"ALL\",SUMIFS(INDIRECT(\"Data!$AI$\"&$D36+32&\":$AS$\"&$D36+32),Data!$AI$30:$AS$30,E$16),SUMIFS(INDIRECT(\"Data!$AI$\"&$D36+32&\":$AS$\"&$D36+32),Data!$AI$30:$AS$30,E$16,Data!$AI$31:$AS$31,$G$15)),\"\")","v":0},{"$f":"IFERROR(IF($G$15=\"ALL\",SUMIFS(INDIRECT(\"Data!$AI$\"&$D36+32&\":$AS$\"&$D36+32),Data!$AI$30:$AS$30,F$16),SUMIFS(INDIRECT(\"Data!$AI$\"&$D36+32&\":$AS$\"&$D36+32),Data!$AI$30:$AS$30,F$16,Data!$AI$31:$AS$31,$G$15)),\"\")","v":0},{"$f":"IFERROR(IF($G$15=\"ALL\",SUMIFS(INDIRECT(\"Data!$AI$\"&$D36+32&\":$AS$\"&$D36+32),Data!$AI$30:$AS$30,G$16),SUMIFS(INDIRECT(\"Data!$AI$\"&$D36+32&\":$AS$\"&$D36+32),Data!$AI$30:$AS$30,G$16,Data!$AI$31:$AS$31,$G$15)),\"\")","v":0},{"$f":"IFERROR(IF($G$15=\"ALL\",SUMIFS(INDIRECT(\"Data!$AI$\"&$D36+32&\":$AS$\"&$D36+32),Data!$AI$30:$AS$30,H$16),SUMIFS(INDIRECT(\"Data!$AI$\"&$D36+32&\":$AS$\"&$D36+32),Data!$AI$30:$AS$30,H$16,Data!$AI$31:$AS$31,$G$15)),\"\")","v":0},0,{"$f":"IFERROR((SUMIFS(INDIRECT(\"Data!$AI$\"&$D36+32&\":$AS$\"&$D36+32),Data!$AI$30:$AS$30,J$16))/(INDEX(Data!$K$33:$K$82,$D36,1)),\"\")","v":3.2647058823529411},{"$f":"IFERROR((SUMIFS(INDIRECT(\"Data!$AI$\"&$D36+32&\":$AS$\"&$D36+32),Data!$AI$30:$AS$30,K$16))/(INDEX(Data!$L$33:$L$82,$D36,1)),\"\")","v":3.3877551020408165},{"$f":"IFERROR((SUMIFS(INDIRECT(\"Data!$AI$\"&$D36+32&\":$AS$\"&$D36+32),Data!$AI$30:$AS$30,L$16))/(INDEX(Data!$M$33:$M$82,$D36,1)),\"\")","v":3.0975609756097562},{"$f":"IFERROR((SUMIFS(INDIRECT(\"Data!$AI$\"&$D36+32&\":$AS$\"&$D36+32),Data!$AI$30:$AS$30,M$16))/(INDEX(Data!$N$33:$N$82,$D36,1)),\"\")","v":5.3},{"$f":"IFERROR((SUM(INDIRECT(\"Data!$AI$\"&$D36+32&\":$AS$\"&$D36+32)))/(INDEX(Data!$K$33:$K$82,$D36,1)+INDEX(Data!$L$33:$L$82,$D36,1)+INDEX(Data!$M$33:$M$82,$D36,1)+INDEX(Data!$N$33:$N$82,$D36,1)),\"\")","v":3.41044776119403}]
[null,{"$f":"'Report A'!$B38","v":"2014-07-07"},{"$f":"'Report A'!$C38","v":"Monday"},{"$f":"'Report A'!$D38","v":7},{"$f":"IFERROR(IF($G$15=\"ALL\",SUMIFS(INDIRECT(\"Data!$AI$\"&$D37+32&\":$AS$\"&$D37+32),Data!$AI$30:$AS$30,E$16),SUMIFS(INDIRECT(\"Data!$AI$\"&$D37+32&\":$AS$\"&$D37+32),Data!$AI$30:$AS$30,E$16,Data!$AI$31:$AS$31,$G$15)),\"\")","v":0},{"$f":"IFERROR(IF($G$15=\"ALL\",SUMIFS(INDIRECT(\"Data!$AI$\"&$D37+32&\":$AS$\"&$D37+32),Data!$AI$30:$AS$30,F$16),SUMIFS(INDIRECT(\"Data!$AI$\"&$D37+32&\":$AS$\"&$D37+32),Data!$AI$30:$AS$30,F$16,Data!$AI$31:$AS$31,$G$15)),\"\")","v":19},{"$f":"IFERROR(IF($G$15=\"ALL\",SUMIFS(INDIRECT(\"Data!$AI$\"&$D37+32&\":$AS$\"&$D37+32),Data!$AI$30:$AS$30,G$16),SUMIFS(INDIRECT(\"Data!$AI$\"&$D37+32&\":$AS$\"&$D37+32),Data!$AI$30:$AS$30,G$16,Data!$AI$31:$AS$31,$G$15)),\"\")","v":0},{"$f":"IFERROR(IF($G$15=\"ALL\",SUMIFS(INDIRECT(\"Data!$AI$\"&$D37+32&\":$AS$\"&$D37+32),Data!$AI$30:$AS$30,H$16),SUMIFS(INDIRECT(\"Data!$AI$\"&$D37+32&\":$AS$\"&$D37+32),Data!$AI$30:$AS$30,H$16,Data!$AI$31:$AS$31,$G$15)),\"\")","v":0},19,{"$f":"IFERROR((SUMIFS(INDIRECT(\"Data!$AI$\"&$D37+32&\":$AS$\"&$D37+32),Data!$AI$30:$AS$30,J$16))/(INDEX(Data!$K$33:$K$82,$D37,1)),\"\")","v":3.32},{"$f":"IFERROR((SUMIFS(INDIRECT(\"Data!$AI$\"&$D37+32&\":$AS$\"&$D37+32),Data!$AI$30:$AS$30,K$16))/(INDEX(Data!$L$33:$L$82,$D37,1)),\"\")","v":3.5909090909090908},{"$f":"IFERROR((SUMIFS(INDIRECT(\"Data!$AI$\"&$D37+32&\":$AS$\"&$D37+32),Data!$AI$30:$AS$30,L$16))/(INDEX(Data!$M$33:$M$82,$D37,1)),\"\")","v":3.7352941176470589},{"$f":"IFERROR((SUMIFS(INDIRECT(\"Data!$AI$\"&$D37+32&\":$AS$\"&$D37+32),Data!$AI$30:$AS$30,M$16))/(INDEX(Data!$N$33:$N$82,$D37,1)),\"\")","v":5.2222222222222223},{"$f":"IFERROR((SUM(INDIRECT(\"Data!$AI$\"&$D37+32&\":$AS$\"&$D37+32)))/(INDEX(Data!$K$33:$K$82,$D37,1)+INDEX(Data!$L$33:$L$82,$D37,1)+INDEX(Data!$M$33:$M$82,$D37,1)+INDEX(Data!$N$33:$N$82,$D37,1)),\"\")","v":3.7338709677419355}]
[null,{"$f":"'Report A'!$B39","v":"2014-07-08"},{"$f":"'Report A'!$C39","v":"Tuesday"},{"$f":"'Report A'!$D39","v":8},{"$f":"IFERROR(IF($G$15=\"ALL\",SUMIFS(INDIRECT(\"Data!$AI$\"&$D38+32&\":$AS$\"&$D38+32),Data!$AI$30:$AS$30,E$16),SUMIFS(INDIRECT(\"Data!$AI$\"&$D38+32&\":$AS$\"&$D38+32),Data!$AI$30:$AS$30,E$16,Data!$AI$31:$AS$31,$G$15)),\"\")","v":0},{"$f":"IFERROR(IF($G$15=\"ALL\",SUMIFS(INDIRECT(\"Data!$AI$\"&$D38+32&\":$AS$\"&$D38+32),Data!$AI$30:$AS$30,F$16),SUMIFS(INDIRECT(\"Data!$AI$\"&$D38+32&\":$AS$\"&$D38+32),Data!$AI$30:$AS$30,F$16,Data!$AI$31:$AS$31,$G$15)),\"\")","v":3},{"$f":"IFERROR(IF($G$15=\"ALL\",SUMIFS(INDIRECT(\"Data!$AI$\"&$D38+32&\":$AS$\"&$D38+32),Data!$AI$30:$AS$30,G$16),SUMIFS(INDIRECT(\"Data!$AI$\"&$D38+32&\":$AS$\"&$D38+32),Data!$AI$30:$AS$30,G$16,Data!$AI$31:$AS$31,$G$15)),\"\")","v":0},{"$f":"IFERROR(IF($G$15=\"ALL\",SUMIFS(INDIRECT(\"Data!$AI$\"&$D38+32&\":$AS$\"&$D38+32),Data!$AI$30:$AS$30,H$16),SUMIFS(INDIRECT(\"Data!$AI$\"&$D38+32&\":$AS$\"&$D38+32),Data!$AI$30:$AS$30,H$16,Data!$AI$31:$AS$31,$G$15)),\"\")","v":0},3,{"$f":"IFERROR((SUMIFS(INDIRECT(\"Data!$AI$\"&$D38+32&\":$AS$\"&$D38+32),Data!$AI$30:$AS$30,J$16))/(INDEX(Data!$K$33:$K$82,$D38,1)),\"\")","v":3.7777777777777777},{"$f":"IFERROR((SUMIFS(INDIRECT(\"Data!$AI$\"&$D38+32&\":$AS$\"&$D38+32),Data!$AI$30:$AS$30,K$16))/(INDEX(Data!$L$33:$L$82,$D38,1)),\"\")","v":3.0625},{"$f":"IFERROR((SUMIFS(INDIRECT(\"Data!$AI$\"&$D38+32&\":$AS$\"&$D38+32),Data!$AI$30:$AS$30,L$16))/(INDEX(Data!$M$33:$M$82,$D38,1)),\"\")","v":3.3559322033898304},{"$f":"IFERROR((SUMIFS(INDIRECT(\"Data!$AI$\"&$D38+32&\":$AS$\"&$D38+32),Data!$AI$30:$AS$30,M$16))/(INDEX(Data!$N$33:$N$82,$D38,1)),\"\")","v":5.2727272727272725},{"$f":"IFERROR((SUM(INDIRECT(\"Data!$AI$\"&$D38+32&\":$AS$\"&$D38+32)))/(INDEX(Data!$K$33:$K$82,$D38,1)+INDEX(Data!$L$33:$L$82,$D38,1)+INDEX(Data!$M$33:$M$82,$D38,1)+INDEX(Data!$N$33:$N$82,$D38,1)),\"\")","v":3.5684210526315789}]
[null,{"$f":"'Report A'!$B40","v":"2014-07-09"},{"$f":"'Report A'!$C40","v":"Wednesday"},{"$f":"'Report A'!$D40","v":9},{"$f":"IFERROR(IF($G$15=\"ALL\",SUMIFS(INDIRECT(\"Data!$AI$\"&$D39+32&\":$AS$\"&$D39+32),Data!$AI$30:$AS$30,E$16),SUMIFS(INDIRECT(\"Data!$AI$\"&$D39+32&\":$AS$\"&$D39+32),Data!$AI$30:$AS$30,E$16,Data!$AI$31:$AS$31,$G$15)),\"\")","v":0},{"$f":"IFERROR(IF($G$15=\"ALL\",SUMIFS(INDIRECT(\"Data!$AI$\"&$D39+32&\":$AS$\"&$D39+32),Data!$AI$30:$AS$30,F$16),SUMIFS(INDIRECT(\"Data!$AI$\"&$D39+32&\":$AS$\"&$D39+32),Data!$AI$30:$AS$30,F$16,Data!$AI$31:$AS$31,$G$15)),\"\")","v":13},{"$f":"IFERROR(IF($G$15=\"ALL\",SUMIFS(INDIRECT(\"Data!$AI$\"&$D39+32&\":$AS$\"&$D39+32),Data!$AI$30:$AS$30,G$16),SUMIFS(INDIRECT(\"Data!$AI$\"&$D39+32&\":$AS$\"&$D39+32),Data!$AI$30:$AS$30,G$16,Data!$AI$31:$AS$31,$G$15)),\"\")","v":0},{"$f":"IFERROR(IF($G$15=\"ALL\",SUMIFS(INDIRECT(\"Data!$AI$\"&$D39+32&\":$AS$\"&$D39+32),Data!$AI$30:$AS$30,H$16),SUMIFS(INDIRECT(\"Data!$AI$\"&$D39+32&\":$AS$\"&$D39+32),Data!$AI$30:$AS$30,H$16,Data!$AI$31:$AS$31,$G$15)),\"\")","v":0},13,{"$f":"IFERROR((SUMIFS(INDIRECT(\"Data!$AI$\"&$D39+32&\":$AS$\"&$D39+32),Data!$AI$30:$AS$30,J$16))/(INDEX(Data!$K$33:$K$82,$D39,1)),\"\")","v":2.7826086956521738},{"$f":"IFERROR((SUMIFS(INDIRECT(\"Data!$AI$\"&$D39+32&\":$AS$\"&$D39+32),Data!$AI$30:$AS$30,K$16))/(INDEX(Data!$L$33:$L$82,$D39,1)),\"\")","v":4.0588235294117645},{"$f":"IFERROR((SUMIFS(INDIRECT(\"Data!$AI$\"&$D39+32&\":$AS$\"&$D39+32),Data!$AI$30:$AS$30,L$16))/(INDEX(Data!$M$33:$M$82,$D39,1)),\"\")","v":3.3888888888888888},{"$f":"IFERROR((SUMIFS(INDIRECT(\"Data!$AI$\"&$D39+32&\":$AS$\"&$D39+32),Data!$AI$30:$AS$30,M$16))/(INDEX(Data!$N$33:$N$82,$D39,1)),\"\")","v":4},{"$f":"IFERROR((SUM(INDIRECT(\"Data!$AI$\"&$D39+32&\":$AS$\"&$D39+32)))/(INDEX(Data!$K$33:$K$82,$D39,1)+INDEX(Data!$L$33:$L$82,$D39,1)+INDEX(Data!$M$33:$M$82,$D39,1)+INDEX(Data!$N$33:$N$82,$D39,1)),\"\")","v":3.4230769230769229}]
[null,{"$f":"'Report A'!$B41","v":"2014-07-10"},{"$f":"'Report A'!$C41","v":"Thursday"},{"$f":"'Report A'!$D41","v":10},{"$f":"IFERROR(IF($G$15=\"ALL\",SUMIFS(INDIRECT(\"Data!$AI$\"&$D40+32&\":$AS$\"&$D40+32),Data!$AI$30:$AS$30,E$16),SUMIFS(INDIRECT(\"Data!$AI$\"&$D40+32&\":$AS$\"&$D40+32),Data!$AI$30:$AS$30,E$16,Data!$AI$31:$AS$31,$G$15)),\"\")","v":0},{"$f":"IFERROR(IF($G$15=\"ALL\",SUMIFS(INDIRECT(\"Data!$AI$\"&$D40+32&\":$AS$\"&$D40+32),Data!$AI$30:$AS$30,F$16),SUMIFS(INDIRECT(\"Data!$AI$\"&$D40+32&\":$AS$\"&$D40+32),Data!$AI$30:$AS$30,F$16,Data!$AI$31:$AS$31,$G$15)),\"\")","v":19},{"$f":"IFERROR(IF($G$15=\"ALL\",SUMIFS(INDIRECT(\"Data!$AI$\"&$D40+32&\":$AS$\"&$D40+32),Data!$AI$30:$AS$30,G$16),SUMIFS(INDIRECT(\"Data!$AI$\"&$D40+32&\":$AS$\"&$D40+32),Data!$AI$30:$AS$30,G$16,Data!$AI$31:$AS$31,$G$15)),\"\")","v":0},{"$f":"IFERROR(IF($G$15=\"ALL\",SUMIFS(INDIRECT(\"Data!$AI$\"&$D40+32&\":$AS$\"&$D40+32),Data!$AI$30:$AS$30,H$16),SUMIFS(INDIRECT(\"Data!$AI$\"&$D40+32&\":$AS$\"&$D40+32),Data!$AI$30:$AS$30,H$16,Data!$AI$31:$AS$31,$G$15)),\"\")","v":0},19,{"$f":"IFERROR((SUMIFS(INDIRECT(\"Data!$AI$\"&$D40+32&\":$AS$\"&$D40+32),Data!$AI$30:$AS$30,J$16))/(INDEX(Data!$K$33:$K$82,$D40,1)),\"\")","v":2.8461538461538463},{"$f":"IFERROR((SUMIFS(INDIRECT(\"Data!$AI$\"&$D40+32&\":$AS$\"&$D40+32),Data!$AI$30:$AS$30,K$16))/(INDEX(Data!$L$33:$L$82,$D40,1)),\"\")","v":5},{"$f":"IFERROR((SUMIFS(INDIRECT(\"Data!$AI$\"&$D40+32&\":$AS$\"&$D40+32),Data!$AI$30:$AS$30,L$16))/(INDEX(Data!$M$33:$M$82,$D40,1)),\"\")","v":3.6031746031746033},{"$f":"IFERROR((SUMIFS(INDIRECT(\"Data!$AI$\"&$D40+32&\":$AS$\"&$D40+32),Data!$AI$30:$AS$30,M$16))/(INDEX(Data!$N$33:$N$82,$D40,1)),\"\")","v":3.75},{"$f":"IFERROR((SUM(INDIRECT(\"Data!$AI$\"&$D40+32&\":$AS$\"&$D40+32)))/(INDEX(Data!$K$33:$K$82,$D40,1)+INDEX(Data!$L$33:$L$82,$D40,1)+INDEX(Data!$M$33:$M$82,$D40,1)+INDEX(Data!$N$33:$N$82,$D40,1)),\"\")","v":3.6703296703296702}]
[null,{"$f":"'Report A'!$B42","v":"2014-07-11"},{"$f":"'Report A'!$C42","v":"Friday"},{"$f":"'Report A'!$D42","v":11},{"$f":"IFERROR(IF($G$15=\"ALL\",SUMIFS(INDIRECT(\"Data!$AI$\"&$D41+32&\":$AS$\"&$D41+32),Data!$AI$30:$AS$30,E$16),SUMIFS(INDIRECT(\"Data!$AI$\"&$D41+32&\":$AS$\"&$D41+32),Data!$AI$30:$AS$30,E$16,Data!$AI$31:$AS$31,$G$15)),\"\")","v":0},{"$f":"IFERROR(IF($G$15=\"ALL\",SUMIFS(INDIRECT(\"Data!$AI$\"&$D41+32&\":$AS$\"&$D41+32),Data!$AI$30:$AS$30,F$16),SUMIFS(INDIRECT(\"Data!$AI$\"&$D41+32&\":$AS$\"&$D41+32),Data!$AI$30:$AS$30,F$16,Data!$AI$31:$AS$31,$G$15)),\"\")","v":0},{"$f":"IFERROR(IF($G$15=\"ALL\",SUMIFS(INDIRECT(\"Data!$AI$\"&$D41+32&\":$AS$\"&$D41+32),Data!$AI$30:$AS$30,G$16),SUMIFS(INDIRECT(\"Data!$AI$\"&$D41+32&\":$AS$\"&$D41+32),Data!$AI$30:$AS$30,G$16,Data!$AI$31:$AS$31,$G$15)),\"\")","v":0},{"$f":"IFERROR(IF($G$15=\"ALL\",SUMIFS(INDIRECT(\"Data!$AI$\"&$D41+32&\":$AS$\"&$D41+32),Data!$AI$30:$AS$30,H$16),SUMIFS(INDIRECT(\"Data!$AI$\"&$D41+32&\":$AS$\"&$D41+32),Data!$AI$30:$AS$30,H$16,Data!$AI$31:$AS$31,$G$15)),\"\")","v":0},0,{"$f":"IFERROR((SUMIFS(INDIRECT(\"Data!$AI$\"&$D41+32&\":$AS$\"&$D41+32),Data!$AI$30:$AS$30,J$16))/(INDEX(Data!$K$33:$K$82,$D41,1)),\"\")","v":5.625},{"$f":"IFERROR((SUMIFS(INDIRECT(\"Data!$AI$\"&$D41+32&\":$AS$\"&$D41+32),Data!$AI$30:$AS$30,K$16))/(INDEX(Data!$L$33:$L$82,$D41,1)),\"\")","v":4.6500000000000004},{"$f":"IFERROR((SUMIFS(INDIRECT(\"Data!$AI$\"&$D41+32&\":$AS$\"&$D41+32),Data!$AI$30:$AS$30,L$16))/(INDEX(Data!$M$33:$M$82,$D41,1)),\"\")","v":3.2916666666666665},{"$f":"IFERROR((SUMIFS(INDIRECT(\"Data!$AI$\"&$D41+32&\":$AS$\"&$D41+32),Data!$AI$30:$AS$30,M$16))/(INDEX(Data!$N$33:$N$82,$D41,1)),\"\")","v":2.7777777777777777},{"$f":"IFERROR((SUM(INDIRECT(\"Data!$AI$\"&$D41+32&\":$AS$\"&$D41+32)))/(INDEX(Data!$K$33:$K$82,$D41,1)+INDEX(Data!$L$33:$L$82,$D41,1)+INDEX(Data!$M$33:$M$82,$D41,1)+INDEX(Data!$N$33:$N$82,$D41,1)),\"\")","v":4.0693069306930694}]
[null,{"$f":"'Report A'!$B43","v":"2014-07-12"},{"$f":"'Report A'!$C43","v":"Saturday"},{"$f":"'Report A'!$D43","v":12},{"$f":"IFERROR(IF($G$15=\"ALL\",SUMIFS(INDIRECT(\"Data!$AI$\"&$D42+32&\":$AS$\"&$D42+32),Data!$AI$30:$AS$30,E$16),SUMIFS(INDIRECT(\"Data!$AI$\"&$D42+32&\":$AS$\"&$D42+32),Data!$AI$30:$AS$30,E$16,Data!$AI$31:$AS$31,$G$15)),\"\")","v":0},{"$f":"IFERROR(IF($G$15=\"ALL\",SUMIFS(INDIRECT(\"Data!$AI$\"&$D42+32&\":$AS$\"&$D42+32),Data!$AI$30:$AS$30,F$16),SUMIFS(INDIRECT(\"Data!$AI$\"&$D42+32&\":$AS$\"&$D42+32),Data!$AI$30:$AS$30,F$16,Data!$AI$31:$AS$31,$G$15)),\"\")","v":0},{"$f":"IFERROR(IF($G$15=\"ALL\",SUMIFS(INDIRECT(\"Data!$AI$\"&$D42+32&\":$AS$\"&$D42+32),Data!$AI$30:$AS$30,G$16),SUMIFS(INDIRECT(\"Data!$AI$\"&$D42+32&\":$AS$\"&$D42+32),Data!$AI$30:$AS$30,G$16,Data!$AI$31:$AS$31,$G$15)),\"\")","v":0},{"$f":"IFERROR(IF($G$15=\"ALL\",SUMIFS(INDIRECT(\"Data!$AI$\"&$D42+32&\":$AS$\"&$D42+32),Data!$AI$30:$AS$30,H$16),SUMIFS(INDIRECT(\"Data!$AI$\"&$D42+32&\":$AS$\"&$D42+32),Data!$AI$30:$AS$30,H$16,Data!$AI$31:$AS$31,$G$15)),\"\")","v":0},0,{"$f":"IFERROR((SUMIFS(INDIRECT(\"Data!$AI$\"&$D42+32&\":$AS$\"&$D42+32),Data!$AI$30:$AS$30,J$16))/(INDEX(Data!$K$33:$K$82,$D42,1)),\"\")","v":3.6969696969696968},{"$f":"IFERROR((SUMIFS(INDIRECT(\"Data!$AI$\"&$D42+32&\":$AS$\"&$D42+32),Data!$AI$30:$AS$30,K$16))/(INDEX(Data!$L$33:$L$82,$D42,1)),\"\")","v":3.8421052631578947},{"$f":"IFERROR((SUMIFS(INDIRECT(\"Data!$AI$\"&$D42+32&\":$AS$\"&$D42+32),Data!$AI$30:$AS$30,L$16))/(INDEX(Data!$M$33:$M$82,$D42,1)),\"\")","v":3.8985507246376812},{"$f":"IFERROR((SUMIFS(INDIRECT(\"Data!$AI$\"&$D42+32&\":$AS$\"&$D42+32),Data!$AI$30:$AS$30,M$16))/(INDEX(Data!$N$33:$N$82,$D42,1)),\"\")","v":3.3846153846153846},{"$f":"IFERROR((SUM(INDIRECT(\"Data!$AI$\"&$D42+32&\":$AS$\"&$D42+32)))/(INDEX(Data!$K$33:$K$82,$D42,1)+INDEX(Data!$L$33:$L$82,$D42,1)+INDEX(Data!$M$33:$M$82,$D42,1)+INDEX(Data!$N$33:$N$82,$D42,1)),\"\")","v":3.8023255813953489}]
[null,{"$f":"'Report A'!$B44","v":"2014-07-13"},{"$f":"'Report A'!$C44","v":"Sunday"},{"$f":"'Report A'!$D44","v":13},{"$f":"IFERROR(IF($G$15=\"ALL\",SUMIFS(INDIRECT(\"Data!$AI$\"&$D43+32&\":$AS$\"&$D43+32),Data!$AI$30:$AS$30,E$16),SUMIFS(INDIRECT(\"Data!$AI$\"&$D43+32&\":$AS$\"&$D43+32),Data!$AI$30:$AS$30,E$16,Data!$AI$31:$AS$31,$G$15)),\"\")","v":0},{"$f":"IFERROR(IF($G$15=\"ALL\",SUMIFS(INDIRECT(\"Data!$AI$\"&$D43+32&\":$AS$\"&$D43+32),Data!$AI$30:$AS$30,F$16),SUMIFS(INDIRECT(\"Data!$AI$\"&$D43+32&\":$AS$\"&$D43+32),Data!$AI$30:$AS$30,F$16,Data!$AI$31:$AS$31,$G$15)),\"\")","v":0},{"$f":"IFERROR(IF($G$15=\"ALL\",SUMIFS(INDIRECT(\"Data!$AI$\"&$D43+32&\":$AS$\"&$D43+32),Data!$AI$30:$AS$30,G$16),SUMIFS(INDIRECT(\"Data!$AI$\"&$D43+32&\":$AS$\"&$D43+32),Data!$AI$30:$AS$30,G$16,Data!$AI$31:$AS$31,$G$15)),\"\")","v":0},{"$f":"IFERROR(IF($G$15=\"ALL\",SUMIFS(INDIRECT(\"Data!$AI$\"&$D43+32&\":$AS$\"&$D43+32),Data!$AI$30:$AS$30,H$16),SUMIFS(INDIRECT(\"Data!$AI$\"&$D43+32&\":$AS$\"&$D43+32),Data!$AI$30:$AS$30,H$16,Data!$AI$31:$AS$31,$G$15)),\"\")","v":0},0,{"$f":"IFERROR((SUMIFS(INDIRECT(\"Data!$AI$\"&$D43+32&\":$AS$\"&$D43+32),Data!$AI$30:$AS$30,J$16))/(INDEX(Data!$K$33:$K$82,$D43,1)),\"\")","v":3.1304347826086958},{"$f":"IFERROR((SUMIFS(INDIRECT(\"Data!$AI$\"&$D43+32&\":$AS$\"&$D43+32),Data!$AI$30:$AS$30,K$16))/(INDEX(Data!$L$33:$L$82,$D43,1)),\"\")","v":3.4791666666666665},{"$f":"IFERROR((SUMIFS(INDIRECT(\"Data!$AI$\"&$D43+32&\":$AS$\"&$D43+32),Data!$AI$30:$AS$30,L$16))/(INDEX(Data!$M$33:$M$82,$D43,1)),\"\")","v":3.1896551724137931},{"$f":"IFERROR((SUMIFS(INDIRECT(\"Data!$AI$\"&$D43+32&\":$AS$\"&$D43+32),Data!$AI$30:$AS$30,M$16))/(INDEX(Data!$N$33:$N$82,$D43,1)),\"\")","v":4.5555555555555554},{"$f":"IFERROR((SUM(INDIRECT(\"Data!$AI$\"&$D43+32&\":$AS$\"&$D43+32)))/(INDEX(Data!$K$33:$K$82,$D43,1)+INDEX(Data!$L$33:$L$82,$D43,1)+INDEX(Data!$M$33:$M$82,$D43,1)+INDEX(Data!$N$33:$N$82,$D43,1)),\"\")","v":3.3695652173913042}]
[null,{"$f":"'Report A'!$B45","v":"2014-07-14"},{"$f":"'Report A'!$C45","v":"Monday"},{"$f":"'Report A'!$D45","v":14},{"$f":"IFERROR(IF($G$15=\"ALL\",SUMIFS(INDIRECT(\"Data!$AI$\"&$D44+32&\":$AS$\"&$D44+32),Data!$AI$30:$AS$30,E$16),SUMIFS(INDIRECT(\"Data!$AI$\"&$D44+32&\":$AS$\"&$D44+32),Data!$AI$30:$AS$30,E$16,Data!$AI$31:$AS$31,$G$15)),\"\")","v":0},{"$f":"IFERROR(IF($G$15=\"ALL\",SUMIFS(INDIRECT(\"Data!$AI$\"&$D44+32&\":$AS$\"&$D44+32),Data!$AI$30:$AS$30,F$16),SUMIFS(INDIRECT(\"Data!$AI$\"&$D44+32&\":$AS$\"&$D44+32),Data!$AI$30:$AS$30,F$16,Data!$AI$31:$AS$31,$G$15)),\"\")","v":14},{"$f":"IFERROR(IF($G$15=\"ALL\",SUMIFS(INDIRECT(\"Data!$AI$\"&$D44+32&\":$AS$\"&$D44+32),Data!$AI$30:$AS$30,G$16),SUMIFS(INDIRECT(\"Data!$AI$\"&$D44+32&\":$AS$\"&$D44+32),Data!$AI$30:$AS$30,G$16,Data!$AI$31:$AS$31,$G$15)),\"\")","v":0},{"$f":"IFERROR(IF($G$15=\"ALL\",SUMIFS(INDIRECT(\"Data!$AI$\"&$D44+32&\":$AS$\"&$D44+32),Data!$AI$30:$AS$30,H$16),SUMIFS(INDIRECT(\"Data!$AI$\"&$D44+32&\":$AS$\"&$D44+32),Data!$AI$30:$AS$30,H$16,Data!$AI$31:$AS$31,$G$15)),\"\")","v":0},14,{"$f":"IFERROR((SUMIFS(INDIRECT(\"Data!$AI$\"&$D44+32&\":$AS$\"&$D44+32),Data!$AI$30:$AS$30,J$16))/(INDEX(Data!$K$33:$K$82,$D44,1)),\"\")","v":3.263157894736842},{"$f":"IFERROR((SUMIFS(INDIRECT(\"Data!$AI$\"&$D44+32&\":$AS$\"&$D44+32),Data!$AI$30:$AS$30,K$16))/(INDEX(Data!$L$33:$L$82,$D44,1)),\"\")","v":3.4761904761904763},{"$f":"IFERROR((SUMIFS(INDIRECT(\"Data!$AI$\"&$D44+32&\":$AS$\"&$D44+32),Data!$AI$30:$AS$30,L$16))/(INDEX(Data!$M$33:$M$82,$D44,1)),\"\")","v":3.903225806451613},{"$f":"IFERROR((SUMIFS(INDIRECT(\"Data!$AI$\"&$D44+32&\":$AS$\"&$D44+32),Data!$AI$30:$AS$30,M$16))/(INDEX(Data!$N$33:$N$82,$D44,1)),\"\")","v":5.333333333333333},{"$f":"IFERROR((SUM(INDIRECT(\"Data!$AI$\"&$D44+32&\":$AS$\"&$D44+32)))/(INDEX(Data!$K$33:$K$82,$D44,1)+INDEX(Data!$L$33:$L$82,$D44,1)+INDEX(Data!$M$33:$M$82,$D44,1)+INDEX(Data!$N$33:$N$82,$D44,1)),\"\")","v":3.7870370370370372}]
[null,{"$f":"'Report A'!$B46","v":"2014-07-15"},{"$f":"'Report A'!$C46","v":"Tuesday"},{"$f":"'Report A'!$D46","v":15},{"$f":"IFERROR(IF($G$15=\"ALL\",SUMIFS(INDIRECT(\"Data!$AI$\"&$D45+32&\":$AS$\"&$D45+32),Data!$AI$30:$AS$30,E$16),SUMIFS(INDIRECT(\"Data!$AI$\"&$D45+32&\":$AS$\"&$D45+32),Data!$AI$30:$AS$30,E$16,Data!$AI$31:$AS$31,$G$15)),\"\")","v":0},{"$f":"IFERROR(IF($G$15=\"ALL\",SUMIFS(INDIRECT(\"Data!$AI$\"&$D45+32&\":$AS$\"&$D45+32),Data!$AI$30:$AS$30,F$16),SUMIFS(INDIRECT(\"Data!$AI$\"&$D45+32&\":$AS$\"&$D45+32),Data!$AI$30:$AS$30,F$16,Data!$AI$31:$AS$31,$G$15)),\"\")","v":4},{"$f":"IFERROR(IF($G$15=\"ALL\",SUMIFS(INDIRECT(\"Data!$AI$\"&$D45+32&\":$AS$\"&$D45+32),Data!$AI$30:$AS$30,G$16),SUMIFS(INDIRECT(\"Data!$AI$\"&$D45+32&\":$AS$\"&$D45+32),Data!$AI$30:$AS$30,G$16,Data!$AI$31:$AS$31,$G$15)),\"\")","v":0},{"$f":"IFERROR(IF($G$15=\"ALL\",SUMIFS(INDIRECT(\"Data!$AI$\"&$D45+32&\":$AS$\"&$D45+32),Data!$AI$30:$AS$30,H$16),SUMIFS(INDIRECT(\"Data!$AI$\"&$D45+32&\":$AS$\"&$D45+32),Data!$AI$30:$AS$30,H$16,Data!$AI$31:$AS$31,$G$15)),\"\")","v":0},4,{"$f":"IFERROR((SUMIFS(INDIRECT(\"Data!$AI$\"&$D45+32&\":$AS$\"&$D45+32),Data!$AI$30:$AS$30,J$16))/(INDEX(Data!$K$33:$K$82,$D45,1)),\"\")","v":3.1666666666666665},{"$f":"IFERROR((SUMIFS(INDIRECT(\"Data!$AI$\"&$D45+32&\":$AS$\"&$D45+32),Data!$AI$30:$AS$30,K$16))/(INDEX(Data!$L$33:$L$82,$D45,1)),\"\")","v":2.9},{"$f":"IFERROR((SUMIFS(INDIRECT(\"Data!$AI$\"&$D45+32&\":$AS$\"&$D45+32),Data!$AI$30:$AS$30,L$16))/(INDEX(Data!$M$33:$M$82,$D45,1)),\"\")","v":3.4666666666666668},{"$f":"IFERROR((SUMIFS(INDIRECT(\"Data!$AI$\"&$D45+32&\":$AS$\"&$D45+32),Data!$AI$30:$AS$30,M$16))/(INDEX(Data!$N$33:$N$82,$D45,1)),\"\")","v":5.75},{"$f":"IFERROR((SUM(INDIRECT(\"Data!$AI$\"&$D45+32&\":$AS$\"&$D45+32)))/(INDEX(Data!$K$33:$K$82,$D45,1)+INDEX(Data!$L$33:$L$82,$D45,1)+INDEX(Data!$M$33:$M$82,$D45,1)+INDEX(Data!$N$33:$N$82,$D45,1)),\"\")","v":3.3048780487804876}]
[null,{"$f":"'Report A'!$B47","v":"2014-07-16"},{"$f":"'Report A'!$C47","v":"Wednesday"},{"$f":"'Report A'!$D47","v":16},{"$f":"IFERROR(IF($G$15=\"ALL\",SUMIFS(INDIRECT(\"Data!$AI$\"&$D46+32&\":$AS$\"&$D46+32),Data!$AI$30:$AS$30,E$16),SUMIFS(INDIRECT(\"Data!$AI$\"&$D46+32&\":$AS$\"&$D46+32),Data!$AI$30:$AS$30,E$16,Data!$AI$31:$AS$31,$G$15)),\"\")","v":0},{"$f":"IFERROR(IF($G$15=\"ALL\",SUMIFS(INDIRECT(\"Data!$AI$\"&$D46+32&\":$AS$\"&$D46+32),Data!$AI$30:$AS$30,F$16),SUMIFS(INDIRECT(\"Data!$AI$\"&$D46+32&\":$AS$\"&$D46+32),Data!$AI$30:$AS$30,F$16,Data!$AI$31:$AS$31,$G$15)),\"\")","v":6},{"$f":"IFERROR(IF($G$15=\"ALL\",SUMIFS(INDIRECT(\"Data!$AI$\"&$D46+32&\":$AS$\"&$D46+32),Data!$AI$30:$AS$30,G$16),SUMIFS(INDIRECT(\"Data!$AI$\"&$D46+32&\":$AS$\"&$D46+32),Data!$AI$30:$AS$30,G$16,Data!$AI$31:$AS$31,$G$15)),\"\")","v":0},{"$f":"IFERROR(IF($G$15=\"ALL\",SUMIFS(INDIRECT(\"Data!$AI$\"&$D46+32&\":$AS$\"&$D46+32),Data!$AI$30:$AS$30,H$16),SUMIFS(INDIRECT(\"Data!$AI$\"&$D46+32&\":$AS$\"&$D46+32),Data!$AI$30:$AS$30,H$16,Data!$AI$31:$AS$31,$G$15)),\"\")","v":0},6,{"$f":"IFERROR((SUMIFS(INDIRECT(\"Data!$AI$\"&$D46+32&\":$AS$\"&$D46+32),Data!$AI$30:$AS$30,J$16))/(INDEX(Data!$K$33:$K$82,$D46,1)),\"\")","v":3.2941176470588234},{"$f":"IFERROR((SUMIFS(INDIRECT(\"Data!$AI$\"&$D46+32&\":$AS$\"&$D46+32),Data!$AI$30:$AS$30,K$16))/(INDEX(Data!$L$33:$L$82,$D46,1)),\"\")","v":4.4210526315789478},{"$f":"IFERROR((SUMIFS(INDIRECT(\"Data!$AI$\"&$D46+32&\":$AS$\"&$D46+32),Data!$AI$30:$AS$30,L$16))/(INDEX(Data!$M$33:$M$82,$D46,1)),\"\")","v":3.0256410256410255},{"$f":"IFERROR((SUMIFS(INDIRECT(\"Data!$AI$\"&$D46+32&\":$AS$\"&$D46+32),Data!$AI$30:$AS$30,M$16))/(INDEX(Data!$N$33:$N$82,$D46,1)),\"\")","v":6},{"$f":"IFERROR((SUM(INDIRECT(\"Data!$AI$\"&$D46+32&\":$AS$\"&$D46+32)))/(INDEX(Data!$K$33:$K$82,$D46,1)+INDEX(Data!$L$33:$L$82,$D46,1)+INDEX(Data!$M$33:$M$82,$D46,1)+INDEX(Data!$N$33:$N$82,$D46,1)),\"\")","v":3.7142857142857144}]
[null,{"$f":"'Report A'!$B48","v":"2014-07-17"},{"$f":"'Report A'!$C48","v":"Thursday"},{"$f":"'Report A'!$D48","v":17},{"$f":"IFERROR(IF($G$15=\"ALL\",SUMIFS(INDIRECT(\"Data!$AI$\"&$D47+32&\":$AS$\"&$D47+32),Data!$AI$30:$AS$30,E$16),SUMIFS(INDIRECT(\"Data!$AI$\"&$D47+32&\":$AS$\"&$D47+32),Data!$AI$30:$AS$30,E$16,Data!$AI$31:$AS$31,$G$15)),\"\")","v":0},{"$f":"IFERROR(IF($G$15=\"ALL\",SUMIFS(INDIRECT(\"Data!$AI$\"&$D47+32&\":$AS$\"&$D47+32),Data!$AI$30:$AS$30,F$16),SUMIFS(INDIRECT(\"Data!$AI$\"&$D47+32&\":$AS$\"&$D47+32),Data!$AI$30:$AS$30,F$16,Data!$AI$31:$AS$31,$G$15)),\"\")","v":28},{"$f":"IFERROR(IF($G$15=\"ALL\",SUMIFS(INDIRECT(\"Data!$AI$\"&$D47+32&\":$AS$\"&$D47+32),Data!$AI$30:$AS$30,G$16),SUMIFS(INDIRECT(\"Data!$AI$\"&$D47+32&\":$AS$\"&$D47+32),Data!$AI$30:$AS$30,G$16,Data!$AI$31:$AS$31,$G$15)),\"\")","v":0},{"$f":"IFERROR(IF($G$15=\"ALL\",SUMIFS(INDIRECT(\"Data!$AI$\"&$D47+32&\":$AS$\"&$D47+32),Data!$AI$30:$AS$30,H$16),SUMIFS(INDIRECT(\"Data!$AI$\"&$D47+32&\":$AS$\"&$D47+32),Data!$AI$30:$AS$30,H$16,Data!$AI$31:$AS$31,$G$15)),\"\")","v":0},28,{"$f":"IFERROR((SUMIFS(INDIRECT(\"Data!$AI$\"&$D47+32&\":$AS$\"&$D47+32),Data!$AI$30:$AS$30,J$16))/(INDEX(Data!$K$33:$K$82,$D47,1)),\"\")","v":3.25},{"$f":"IFERROR((SUMIFS(INDIRECT(\"Data!$AI$\"&$D47+32&\":$AS$\"&$D47+32),Data!$AI$30:$AS$30,K$16))/(INDEX(Data!$L$33:$L$82,$D47,1)),\"\")","v":4.8571428571428568},{"$f":"IFERROR((SUMIFS(INDIRECT(\"Data!$AI$\"&$D47+32&\":$AS$\"&$D47+32),Data!$AI$30:$AS$30,L$16))/(INDEX(Data!$M$33:$M$82,$D47,1)),\"\")","v":3.1951219512195124},{"$f":"IFERROR((SUMIFS(INDIRECT(\"Data!$AI$\"&$D47+32&\":$AS$\"&$D47+32),Data!$AI$30:$AS$30,M$16))/(INDEX(Data!$N$33:$N$82,$D47,1)),\"\")","v":4.8571428571428568},{"$f":"IFERROR((SUM(INDIRECT(\"Data!$AI$\"&$D47+32&\":$AS$\"&$D47+32)))/(INDEX(Data!$K$33:$K$82,$D47,1)+INDEX(Data!$L$33:$L$82,$D47,1)+INDEX(Data!$M$33:$M$82,$D47,1)+INDEX(Data!$N$33:$N$82,$D47,1)),\"\")","v":3.7529411764705882}]
[null,{"$f":"'Report A'!$B49","v":"2014-07-18"},{"$f":"'Report A'!$C49","v":"Friday"},{"$f":"'Report A'!$D49","v":18},{"$f":"IFERROR(IF($G$15=\"ALL\",SUMIFS(INDIRECT(\"Data!$AI$\"&$D48+32&\":$AS$\"&$D48+32),Data!$AI$30:$AS$30,E$16),SUMIFS(INDIRECT(\"Data!$AI$\"&$D48+32&\":$AS$\"&$D48+32),Data!$AI$30:$AS$30,E$16,Data!$AI$31:$AS$31,$G$15)),\"\")","v":0},{"$f":"IFERROR(IF($G$15=\"ALL\",SUMIFS(INDIRECT(\"Data!$AI$\"&$D48+32&\":$AS$\"&$D48+32),Data!$AI$30:$AS$30,F$16),SUMIFS(INDIRECT(\"Data!$AI$\"&$D48+32&\":$AS$\"&$D48+32),Data!$AI$30:$AS$30,F$16,Data!$AI$31:$AS$31,$G$15)),\"\")","v":0},{"$f":"IFERROR(IF($G$15=\"ALL\",SUMIFS(INDIRECT(\"Data!$AI$\"&$D48+32&\":$AS$\"&$D48+32),Data!$AI$30:$AS$30,G$16),SUMIFS(INDIRECT(\"Data!$AI$\"&$D48+32&\":$AS$\"&$D48+32),Data!$AI$30:$AS$30,G$16,Data!$AI$31:$AS$31,$G$15)),\"\")","v":0},{"$f":"IFERROR(IF($G$15=\"ALL\",SUMIFS(INDIRECT(\"Data!$AI$\"&$D48+32&\":$AS$\"&$D48+32),Data!$AI$30:$AS$30,H$16),SUMIFS(INDIRECT(\"Data!$AI$\"&$D48+32&\":$AS$\"&$D48+32),Data!$AI$30:$AS$30,H$16,Data!$AI$31:$AS$31,$G$15)),\"\")","v":0},0,{"$f":"IFERROR((SUMIFS(INDIRECT(\"Data!$AI$\"&$D48+32&\":$AS$\"&$D48+32),Data!$AI$30:$AS$30,J$16))/(INDEX(Data!$K$33:$K$82,$D48,1)),\"\")","v":3.7407407407407409},{"$f":"IFERROR((SUMIFS(INDIRECT(\"Data!$AI$\"&$D48+32&\":$AS$\"&$D48+32),Data!$AI$30:$AS$30,K$16))/(INDEX(Data!$L$33:$L$82,$D48,1)),\"\")","v":3.4117647058823528},{"$f":"IFERROR((SUMIFS(INDIRECT(\"Data!$AI$\"&$D48+32&\":$AS$\"&$D48+32),Data!$AI$30:$AS$30,L$16))/(INDEX(Data!$M$33:$M$82,$D48,1)),\"\")","v":3.890625},{"$f":"IFERROR((SUMIFS(INDIRECT(\"Data!$AI$\"&$D48+32&\":$AS$\"&$D48+32),Data!$AI$30:$AS$30,M$16))/(INDEX(Data!$N$33:$N$82,$D48,1)),\"\")","v":2.6},{"$f":"IFERROR((SUM(INDIRECT(\"Data!$AI$\"&$D48+32&\":$AS$\"&$D48+32)))/(INDEX(Data!$K$33:$K$82,$D48,1)+INDEX(Data!$L$33:$L$82,$D48,1)+INDEX(Data!$M$33:$M$82,$D48,1)+INDEX(Data!$N$33:$N$82,$D48,1)),\"\")","v":3.7256637168141591}]
[null,{"$f":"'Report A'!$B50","v":"2014-07-19"},{"$f":"'Report A'!$C50","v":"Saturday"},{"$f":"'Report A'!$D50","v":19},{"$f":"IFERROR(IF($G$15=\"ALL\",SUMIFS(INDIRECT(\"Data!$AI$\"&$D49+32&\":$AS$\"&$D49+32),Data!$AI$30:$AS$30,E$16),SUMIFS(INDIRECT(\"Data!$AI$\"&$D49+32&\":$AS$\"&$D49+32),Data!$AI$30:$AS$30,E$16,Data!$AI$31:$AS$31,$G$15)),\"\")","v":0},{"$f":"IFERROR(IF($G$15=\"ALL\",SUMIFS(INDIRECT(\"Data!$AI$\"&$D49+32&\":$AS$\"&$D49+32),Data!$AI$30:$AS$30,F$16),SUMIFS(INDIRECT(\"Data!$AI$\"&$D49+32&\":$AS$\"&$D49+32),Data!$AI$30:$AS$30,F$16,Data!$AI$31:$AS$31,$G$15)),\"\")","v":0},{"$f":"IFERROR(IF($G$15=\"ALL\",SUMIFS(INDIRECT(\"Data!$AI$\"&$D49+32&\":$AS$\"&$D49+32),Data!$AI$30:$AS$30,G$16),SUMIFS(INDIRECT(\"Data!$AI$\"&$D49+32&\":$AS$\"&$D49+32),Data!$AI$30:$AS$30,G$16,Data!$AI$31:$AS$31,$G$15)),\"\")","v":0},{"$f":"IFERROR(IF($G$15=\"ALL\",SUMIFS(INDIRECT(\"Data!$AI$\"&$D49+32&\":$AS$\"&$D49+32),Data!$AI$30:$AS$30,H$16),SUMIFS(INDIRECT(\"Data!$AI$\"&$D49+32&\":$AS$\"&$D49+32),Data!$AI$30:$AS$30,H$16,Data!$AI$31:$AS$31,$G$15)),\"\")","v":0},0,{"$f":"IFERROR((SUMIFS(INDIRECT(\"Data!$AI$\"&$D49+32&\":$AS$\"&$D49+32),Data!$AI$30:$AS$30,J$16))/(INDEX(Data!$K$33:$K$82,$D49,1)),\"\")","v":3.1764705882352939},{"$f":"IFERROR((SUMIFS(INDIRECT(\"Data!$AI$\"&$D49+32&\":$AS$\"&$D49+32),Data!$AI$30:$AS$30,K$16))/(INDEX(Data!$L$33:$L$82,$D49,1)),\"\")","v":3.2641509433962264},{"$f":"IFERROR((SUMIFS(INDIRECT(\"Data!$AI$\"&$D49+32&\":$AS$\"&$D49+32),Data!$AI$30:$AS$30,L$16))/(INDEX(Data!$M$33:$M$82,$D49,1)),\"\")","v":4},{"$f":"IFERROR((SUMIFS(INDIRECT(\"Data!$AI$\"&$D49+32&\":$AS$\"&$D49+32),Data!$AI$30:$AS$30,M$16))/(INDEX(Data!$N$33:$N$82,$D49,1)),\"\")","v":4.1875},{"$f":"IFERROR((SUM(INDIRECT(\"Data!$AI$\"&$D49+32&\":$AS$\"&$D49+32)))/(INDEX(Data!$K$33:$K$82,$D49,1)+INDEX(Data!$L$33:$L$82,$D49,1)+INDEX(Data!$M$33:$M$82,$D49,1)+INDEX(Data!$N$33:$N$82,$D49,1)),\"\")","v":3.6424581005586592}]
[null,{"$f":"'Report A'!$B51","v":"2014-07-20"},{"$f":"'Report A'!$C51","v":"Sunday"},{"$f":"'Report A'!$D51","v":20},{"$f":"IFERROR(IF($G$15=\"ALL\",SUMIFS(INDIRECT(\"Data!$AI$\"&$D50+32&\":$AS$\"&$D50+32),Data!$AI$30:$AS$30,E$16),SUMIFS(INDIRECT(\"Data!$AI$\"&$D50+32&\":$AS$\"&$D50+32),Data!$AI$30:$AS$30,E$16,Data!$AI$31:$AS$31,$G$15)),\"\")","v":0},{"$f":"IFERROR(IF($G$15=\"ALL\",SUMIFS(INDIRECT(\"Data!$AI$\"&$D50+32&\":$AS$\"&$D50+32),Data!$AI$30:$AS$30,F$16),SUMIFS(INDIRECT(\"Data!$AI$\"&$D50+32&\":$AS$\"&$D50+32),Data!$AI$30:$AS$30,F$16,Data!$AI$31:$AS$31,$G$15)),\"\")","v":0},{"$f":"IFERROR(IF($G$15=\"ALL\",SUMIFS(INDIRECT(\"Data!$AI$\"&$D50+32&\":$AS$\"&$D50+32),Data!$AI$30:$AS$30,G$16),SUMIFS(INDIRECT(\"Data!$AI$\"&$D50+32&\":$AS$\"&$D50+32),Data!$AI$30:$AS$30,G$16,Data!$AI$31:$AS$31,$G$15)),\"\")","v":0},{"$f":"IFERROR(IF($G$15=\"ALL\",SUMIFS(INDIRECT(\"Data!$AI$\"&$D50+32&\":$AS$\"&$D50+32),Data!$AI$30:$AS$30,H$16),SUMIFS(INDIRECT(\"Data!$AI$\"&$D50+32&\":$AS$\"&$D50+32),Data!$AI$30:$AS$30,H$16,Data!$AI$31:$AS$31,$G$15)),\"\")","v":0},0,{"$f":"IFERROR((SUMIFS(INDIRECT(\"Data!$AI$\"&$D50+32&\":$AS$\"&$D50+32),Data!$AI$30:$AS$30,J$16))/(INDEX(Data!$K$33:$K$82,$D50,1)),\"\")","v":3.1944444444444446},{"$f":"IFERROR((SUMIFS(INDIRECT(\"Data!$AI$\"&$D50+32&\":$AS$\"&$D50+32),Data!$AI$30:$AS$30,K$16))/(INDEX(Data!$L$33:$L$82,$D50,1)),\"\")","v":3.1568627450980391},{"$f":"IFERROR((SUMIFS(INDIRECT(\"Data!$AI$\"&$D50+32&\":$AS$\"&$D50+32),Data!$AI$30:$AS$30,L$16))/(INDEX(Data!$M$33:$M$82,$D50,1)),\"\")","v":3.1590909090909092},{"$f":"IFERROR((SUMIFS(INDIRECT(\"Data!$AI$\"&$D50+32&\":$AS$\"&$D50+32),Data!$AI$30:$AS$30,M$16))/(INDEX(Data!$N$33:$N$82,$D50,1)),\"\")","v":4.2727272727272725},{"$f":"IFERROR((SUM(INDIRECT(\"Data!$AI$\"&$D50+32&\":$AS$\"&$D50+32)))/(INDEX(Data!$K$33:$K$82,$D50,1)+INDEX(Data!$L$33:$L$82,$D50,1)+INDEX(Data!$M$33:$M$82,$D50,1)+INDEX(Data!$N$33:$N$82,$D50,1)),\"\")","v":3.2535211267605635}]
[null,{"$f":"'Report A'!$B52","v":"2014-07-21"},{"$f":"'Report A'!$C52","v":"Monday"},{"$f":"'Report A'!$D52","v":21},{"$f":"IFERROR(IF($G$15=\"ALL\",SUMIFS(INDIRECT(\"Data!$AI$\"&$D51+32&\":$AS$\"&$D51+32),Data!$AI$30:$AS$30,E$16),SUMIFS(INDIRECT(\"Data!$AI$\"&$D51+32&\":$AS$\"&$D51+32),Data!$AI$30:$AS$30,E$16,Data!$AI$31:$AS$31,$G$15)),\"\")","v":0},{"$f":"IFERROR(IF($G$15=\"ALL\",SUMIFS(INDIRECT(\"Data!$AI$\"&$D51+32&\":$AS$\"&$D51+32),Data!$AI$30:$AS$30,F$16),SUMIFS(INDIRECT(\"Data!$AI$\"&$D51+32&\":$AS$\"&$D51+32),Data!$AI$30:$AS$30,F$16,Data!$AI$31:$AS$31,$G$15)),\"\")","v":21},{"$f":"IFERROR(IF($G$15=\"ALL\",SUMIFS(INDIRECT(\"Data!$AI$\"&$D51+32&\":$AS$\"&$D51+32),Data!$AI$30:$AS$30,G$16),SUMIFS(INDIRECT(\"Data!$AI$\"&$D51+32&\":$AS$\"&$D51+32),Data!$AI$30:$AS$30,G$16,Data!$AI$31:$AS$31,$G$15)),\"\")","v":0},{"$f":"IFERROR(IF($G$15=\"ALL\",SUMIFS(INDIRECT(\"Data!$AI$\"&$D51+32&\":$AS$\"&$D51+32),Data!$AI$30:$AS$30,H$16),SUMIFS(INDIRECT(\"Data!$AI$\"&$D51+32&\":$AS$\"&$D51+32),Data!$AI$30:$AS$30,H$16,Data!$AI$31:$AS$31,$G$15)),\"\")","v":0},21,{"$f":"IFERROR((SUMIFS(INDIRECT(\"Data!$AI$\"&$D51+32&\":$AS$\"&$D51+32),Data!$AI$30:$AS$30,J$16))/(INDEX(Data!$K$33:$K$82,$D51,1)),\"\")","v":3.15},{"$f":"IFERROR((SUMIFS(INDIRECT(\"Data!$AI$\"&$D51+32&\":$AS$\"&$D51+32),Data!$AI$30:$AS$30,K$16))/(INDEX(Data!$L$33:$L$82,$D51,1)),\"\")","v":4.3888888888888893},{"$f":"IFERROR((SUMIFS(INDIRECT(\"Data!$AI$\"&$D51+32&\":$AS$\"&$D51+32),Data!$AI$30:$AS$30,L$16))/(INDEX(Data!$M$33:$M$82,$D51,1)),\"\")","v":2.6206896551724137},{"$f":"IFERROR((SUMIFS(INDIRECT(\"Data!$AI$\"&$D51+32&\":$AS$\"&$D51+32),Data!$AI$30:$AS$30,M$16))/(INDEX(Data!$N$33:$N$82,$D51,1)),\"\")","v":4.8181818181818183},{"$f":"IFERROR((SUM(INDIRECT(\"Data!$AI$\"&$D51+32&\":$AS$\"&$D51+32)))/(INDEX(Data!$K$33:$K$82,$D51,1)+INDEX(Data!$L$33:$L$82,$D51,1)+INDEX(Data!$M$33:$M$82,$D51,1)+INDEX(Data!$N$33:$N$82,$D51,1)),\"\")","v":3.4743589743589745}]
[null,{"$f":"'Report A'!$B53","v":"2014-07-22"},{"$f":"'Report A'!$C53","v":"Tuesday"},{"$f":"'Report A'!$D53","v":22},{"$f":"IFERROR(IF($G$15=\"ALL\",SUMIFS(INDIRECT(\"Data!$AI$\"&$D52+32&\":$AS$\"&$D52+32),Data!$AI$30:$AS$30,E$16),SUMIFS(INDIRECT(\"Data!$AI$\"&$D52+32&\":$AS$\"&$D52+32),Data!$AI$30:$AS$30,E$16,Data!$AI$31:$AS$31,$G$15)),\"\")","v":0},{"$f":"IFERROR(IF($G$15=\"ALL\",SUMIFS(INDIRECT(\"Data!$AI$\"&$D52+32&\":$AS$\"&$D52+32),Data!$AI$30:$AS$30,F$16),SUMIFS(INDIRECT(\"Data!$AI$\"&$D52+32&\":$AS$\"&$D52+32),Data!$AI$30:$AS$30,F$16,Data!$AI$31:$AS$31,$G$15)),\"\")","v":3},{"$f":"IFERROR(IF($G$15=\"ALL\",SUMIFS(INDIRECT(\"Data!$AI$\"&$D52+32&\":$AS$\"&$D52+32),Data!$AI$30:$AS$30,G$16),SUMIFS(INDIRECT(\"Data!$AI$\"&$D52+32&\":$AS$\"&$D52+32),Data!$AI$30:$AS$30,G$16,Data!$AI$31:$AS$31,$G$15)),\"\")","v":0},{"$f":"IFERROR(IF($G$15=\"ALL\",SUMIFS(INDIRECT(\"Data!$AI$\"&$D52+32&\":$AS$\"&$D52+32),Data!$AI$30:$AS$30,H$16),SUMIFS(INDIRECT(\"Data!$AI$\"&$D52+32&\":$AS$\"&$D52+32),Data!$AI$30:$AS$30,H$16,Data!$AI$31:$AS$31,$G$15)),\"\")","v":0},3,{"$f":"IFERROR((SUMIFS(INDIRECT(\"Data!$AI$\"&$D52+32&\":$AS$\"&$D52+32),Data!$AI$30:$AS$30,J$16))/(INDEX(Data!$K$33:$K$82,$D52,1)),\"\")","v":3.0625},{"$f":"IFERROR((SUMIFS(INDIRECT(\"Data!$AI$\"&$D52+32&\":$AS$\"&$D52+32),Data!$AI$30:$AS$30,K$16))/(INDEX(Data!$L$33:$L$82,$D52,1)),\"\")","v":2.9444444444444446},{"$f":"IFERROR((SUMIFS(INDIRECT(\"Data!$AI$\"&$D52+32&\":$AS$\"&$D52+32),Data!$AI$30:$AS$30,L$16))/(INDEX(Data!$M$33:$M$82,$D52,1)),\"\")","v":3.263157894736842},{"$f":"IFERROR((SUMIFS(INDIRECT(\"Data!$AI$\"&$D52+32&\":$AS$\"&$D52+32),Data!$AI$30:$AS$30,M$16))/(INDEX(Data!$N$33:$N$82,$D52,1)),\"\")","v":4.333333333333333},{"$f":"IFERROR((SUM(INDIRECT(\"Data!$AI$\"&$D52+32&\":$AS$\"&$D52+32)))/(INDEX(Data!$K$33:$K$82,$D52,1)+INDEX(Data!$L$33:$L$82,$D52,1)+INDEX(Data!$M$33:$M$82,$D52,1)+INDEX(Data!$N$33:$N$82,$D52,1)),\"\")","v":3.3095238095238093}]
[null,{"$f":"'Report A'!$B54","v":"2014-07-23"},{"$f":"'Report A'!$C54","v":"Wednesday"},{"$f":"'Report A'!$D54","v":23},{"$f":"IFERROR(IF($G$15=\"ALL\",SUMIFS(INDIRECT(\"Data!$AI$\"&$D53+32&\":$AS$\"&$D53+32),Data!$AI$30:$AS$30,E$16),SUMIFS(INDIRECT(\"Data!$AI$\"&$D53+32&\":$AS$\"&$D53+32),Data!$AI$30:$AS$30,E$16,Data!$AI$31:$AS$31,$G$15)),\"\")","v":0},{"$f":"IFERROR(IF($G$15=\"ALL\",SUMIFS(INDIRECT(\"Data!$AI$\"&$D53+32&\":$AS$\"&$D53+32),Data!$AI$30:$AS$30,F$16),SUMIFS(INDIRECT(\"Data!$AI$\"&$D53+32&\":$AS$\"&$D53+32),Data!$AI$30:$AS$30,F$16,Data!$AI$31:$AS$31,$G$15)),\"\")","v":8},{"$f":"IFERROR(IF($G$15=\"ALL\",SUMIFS(INDIRECT(\"Data!$AI$\"&$D53+32&\":$AS$\"&$D53+32),Data!$AI$30:$AS$30,G$16),SUMIFS(INDIRECT(\"Data!$AI$\"&$D53+32&\":$AS$\"&$D53+32),Data!$AI$30:$AS$30,G$16,Data!$AI$31:$AS$31,$G$15)),\"\")","v":0},{"$f":"IFERROR(IF($G$15=\"ALL\",SUMIFS(INDIRECT(\"Data!$AI$\"&$D53+32&\":$AS$\"&$D53+32),Data!$AI$30:$AS$30,H$16),SUMIFS(INDIRECT(\"Data!$AI$\"&$D53+32&\":$AS$\"&$D53+32),Data!$AI$30:$AS$30,H$16,Data!$AI$31:$AS$31,$G$15)),\"\")","v":0},8,{"$f":"IFERROR((SUMIFS(INDIRECT(\"Data!$AI$\"&$D53+32&\":$AS$\"&$D53+32),Data!$AI$30:$AS$30,J$16))/(INDEX(Data!$K$33:$K$82,$D53,1)),\"\")","v":3.8571428571428572},{"$f":"IFERROR((SUMIFS(INDIRECT(\"Data!$AI$\"&$D53+32&\":$AS$\"&$D53+32),Data!$AI$30:$AS$30,K$16))/(INDEX(Data!$L$33:$L$82,$D53,1)),\"\")","v":3.0454545454545454},{"$f":"IFERROR((SUMIFS(INDIRECT(\"Data!$AI$\"&$D53+32&\":$AS$\"&$D53+32),Data!$AI$30:$AS$30,L$16))/(INDEX(Data!$M$33:$M$82,$D53,1)),\"\")","v":3.08},{"$f":"IFERROR((SUMIFS(INDIRECT(\"Data!$AI$\"&$D53+32&\":$AS$\"&$D53+32),Data!$AI$30:$AS$30,M$16))/(INDEX(Data!$N$33:$N$82,$D53,1)),\"\")","v":5.333333333333333},{"$f":"IFERROR((SUM(INDIRECT(\"Data!$AI$\"&$D53+32&\":$AS$\"&$D53+32)))/(INDEX(Data!$K$33:$K$82,$D53,1)+INDEX(Data!$L$33:$L$82,$D53,1)+INDEX(Data!$M$33:$M$82,$D53,1)+INDEX(Data!$N$33:$N$82,$D53,1)),\"\")","v":3.5142857142857142}]
[null,{"$f":"'Report A'!$B55","v":"2014-07-24"},{"$f":"'Report A'!$C55","v":"Thursday"},{"$f":"'Report A'!$D55","v":24},{"$f":"IFERROR(IF($G$15=\"ALL\",SUMIFS(INDIRECT(\"Data!$AI$\"&$D54+32&\":$AS$\"&$D54+32),Data!$AI$30:$AS$30,E$16),SUMIFS(INDIRECT(\"Data!$AI$\"&$D54+32&\":$AS$\"&$D54+32),Data!$AI$30:$AS$30,E$16,Data!$AI$31:$AS$31,$G$15)),\"\")","v":0},{"$f":"IFERROR(IF($G$15=\"ALL\",SUMIFS(INDIRECT(\"Data!$AI$\"&$D54+32&\":$AS$\"&$D54+32),Data!$AI$30:$AS$30,F$16),SUMIFS(INDIRECT(\"Data!$AI$\"&$D54+32&\":$AS$\"&$D54+32),Data!$AI$30:$AS$30,F$16,Data!$AI$31:$AS$31,$G$15)),\"\")","v":8},{"$f":"IFERROR(IF($G$15=\"ALL\",SUMIFS(INDIRECT(\"Data!$AI$\"&$D54+32&\":$AS$\"&$D54+32),Data!$AI$30:$AS$30,G$16),SUMIFS(INDIRECT(\"Data!$AI$\"&$D54+32&\":$AS$\"&$D54+32),Data!$AI$30:$AS$30,G$16,Data!$AI$31:$AS$31,$G$15)),\"\")","v":0},{"$f":"IFERROR(IF($G$15=\"ALL\",SUMIFS(INDIRECT(\"Data!$AI$\"&$D54+32&\":$AS$\"&$D54+32),Data!$AI$30:$AS$30,H$16),SUMIFS(INDIRECT(\"Data!$AI$\"&$D54+32&\":$AS$\"&$D54+32),Data!$AI$30:$AS$30,H$16,Data!$AI$31:$AS$31,$G$15)),\"\")","v":0},8,{"$f":"IFERROR((SUMIFS(INDIRECT(\"Data!$AI$\"&$D54+32&\":$AS$\"&$D54+32),Data!$AI$30:$AS$30,J$16))/(INDEX(Data!$K$33:$K$82,$D54,1)),\"\")","v":4.7058823529411766},{"$f":"IFERROR((SUMIFS(INDIRECT(\"Data!$AI$\"&$D54+32&\":$AS$\"&$D54+32),Data!$AI$30:$AS$30,K$16))/(INDEX(Data!$L$33:$L$82,$D54,1)),\"\")","v":3.4285714285714284},{"$f":"IFERROR((SUMIFS(INDIRECT(\"Data!$AI$\"&$D54+32&\":$AS$\"&$D54+32),Data!$AI$30:$AS$30,L$16))/(INDEX(Data!$M$33:$M$82,$D54,1)),\"\")","v":3.3142857142857145},{"$f":"IFERROR((SUMIFS(INDIRECT(\"Data!$AI$\"&$D54+32&\":$AS$\"&$D54+32),Data!$AI$30:$AS$30,M$16))/(INDEX(Data!$N$33:$N$82,$D54,1)),\"\")","v":4.666666666666667},{"$f":"IFERROR((SUM(INDIRECT(\"Data!$AI$\"&$D54+32&\":$AS$\"&$D54+32)))/(INDEX(Data!$K$33:$K$82,$D54,1)+INDEX(Data!$L$33:$L$82,$D54,1)+INDEX(Data!$M$33:$M$82,$D54,1)+INDEX(Data!$N$33:$N$82,$D54,1)),\"\")","v":3.7468354430379747}]
[null,{"$f":"'Report A'!$B56","v":"2014-07-25"},{"$f":"'Report A'!$C56","v":"Friday"},{"$f":"'Report A'!$D56","v":25},{"$f":"IFERROR(IF($G$15=\"ALL\",SUMIFS(INDIRECT(\"Data!$AI$\"&$D55+32&\":$AS$\"&$D55+32),Data!$AI$30:$AS$30,E$16),SUMIFS(INDIRECT(\"Data!$AI$\"&$D55+32&\":$AS$\"&$D55+32),Data!$AI$30:$AS$30,E$16,Data!$AI$31:$AS$31,$G$15)),\"\")","v":0},{"$f":"IFERROR(IF($G$15=\"ALL\",SUMIFS(INDIRECT(\"Data!$AI$\"&$D55+32&\":$AS$\"&$D55+32),Data!$AI$30:$AS$30,F$16),SUMIFS(INDIRECT(\"Data!$AI$\"&$D55+32&\":$AS$\"&$D55+32),Data!$AI$30:$AS$30,F$16,Data!$AI$31:$AS$31,$G$15)),\"\")","v":0},{"$f":"IFERROR(IF($G$15=\"ALL\",SUMIFS(INDIRECT(\"Data!$AI$\"&$D55+32&\":$AS$\"&$D55+32),Data!$AI$30:$AS$30,G$16),SUMIFS(INDIRECT(\"Data!$AI$\"&$D55+32&\":$AS$\"&$D55+32),Data!$AI$30:$AS$30,G$16,Data!$AI$31:$AS$31,$G$15)),\"\")","v":0},{"$f":"IFERROR(IF($G$15=\"ALL\",SUMIFS(INDIRECT(\"Data!$AI$\"&$D55+32&\":$AS$\"&$D55+32),Data!$AI$30:$AS$30,H$16),SUMIFS(INDIRECT(\"Data!$AI$\"&$D55+32&\":$AS$\"&$D55+32),Data!$AI$30:$AS$30,H$16,Data!$AI$31:$AS$31,$G$15)),\"\")","v":0},0,{"$f":"IFERROR((SUMIFS(INDIRECT(\"Data!$AI$\"&$D55+32&\":$AS$\"&$D55+32),Data!$AI$30:$AS$30,J$16))/(INDEX(Data!$K$33:$K$82,$D55,1)),\"\")","v":3.5217391304347827},{"$f":"IFERROR((SUMIFS(INDIRECT(\"Data!$AI$\"&$D55+32&\":$AS$\"&$D55+32),Data!$AI$30:$AS$30,K$16))/(INDEX(Data!$L$33:$L$82,$D55,1)),\"\")","v":3.9130434782608696},{"$f":"IFERROR((SUMIFS(INDIRECT(\"Data!$AI$\"&$D55+32&\":$AS$\"&$D55+32),Data!$AI$30:$AS$30,L$16))/(INDEX(Data!$M$33:$M$82,$D55,1)),\"\")","v":3.5714285714285716},{"$f":"IFERROR((SUMIFS(INDIRECT(\"Data!$AI$\"&$D55+32&\":$AS$\"&$D55+32),Data!$AI$30:$AS$30,M$16))/(INDEX(Data!$N$33:$N$82,$D55,1)),\"\")","v":3.1666666666666665},{"$f":"IFERROR((SUM(INDIRECT(\"Data!$AI$\"&$D55+32&\":$AS$\"&$D55+32)))/(INDEX(Data!$K$33:$K$82,$D55,1)+INDEX(Data!$L$33:$L$82,$D55,1)+INDEX(Data!$M$33:$M$82,$D55,1)+INDEX(Data!$N$33:$N$82,$D55,1)),\"\")","v":3.613861386138614}]
[null,{"$f":"'Report A'!$B57","v":"2014-07-26"},{"$f":"'Report A'!$C57","v":"Saturday"},{"$f":"'Report A'!$D57","v":26},{"$f":"IFERROR(IF($G$15=\"ALL\",SUMIFS(INDIRECT(\"Data!$AI$\"&$D56+32&\":$AS$\"&$D56+32),Data!$AI$30:$AS$30,E$16),SUMIFS(INDIRECT(\"Data!$AI$\"&$D56+32&\":$AS$\"&$D56+32),Data!$AI$30:$AS$30,E$16,Data!$AI$31:$AS$31,$G$15)),\"\")","v":0},{"$f":"IFERROR(IF($G$15=\"ALL\",SUMIFS(INDIRECT(\"Data!$AI$\"&$D56+32&\":$AS$\"&$D56+32),Data!$AI$30:$AS$30,F$16),SUMIFS(INDIRECT(\"Data!$AI$\"&$D56+32&\":$AS$\"&$D56+32),Data!$AI$30:$AS$30,F$16,Data!$AI$31:$AS$31,$G$15)),\"\")","v":0},{"$f":"IFERROR(IF($G$15=\"ALL\",SUMIFS(INDIRECT(\"Data!$AI$\"&$D56+32&\":$AS$\"&$D56+32),Data!$AI$30:$AS$30,G$16),SUMIFS(INDIRECT(\"Data!$AI$\"&$D56+32&\":$AS$\"&$D56+32),Data!$AI$30:$AS$30,G$16,Data!$AI$31:$AS$31,$G$15)),\"\")","v":0},{"$f":"IFERROR(IF($G$15=\"ALL\",SUMIFS(INDIRECT(\"Data!$AI$\"&$D56+32&\":$AS$\"&$D56+32),Data!$AI$30:$AS$30,H$16),SUMIFS(INDIRECT(\"Data!$AI$\"&$D56+32&\":$AS$\"&$D56+32),Data!$AI$30:$AS$30,H$16,Data!$AI$31:$AS$31,$G$15)),\"\")","v":0},0,{"$f":"IFERROR((SUMIFS(INDIRECT(\"Data!$AI$\"&$D56+32&\":$AS$\"&$D56+32),Data!$AI$30:$AS$30,J$16))/(INDEX(Data!$K$33:$K$82,$D56,1)),\"\")","v":3.8666666666666667},{"$f":"IFERROR((SUMIFS(INDIRECT(\"Data!$AI$\"&$D56+32&\":$AS$\"&$D56+32),Data!$AI$30:$AS$30,K$16))/(INDEX(Data!$L$33:$L$82,$D56,1)),\"\")","v":3.5686274509803924},{"$f":"IFERROR((SUMIFS(INDIRECT(\"Data!$AI$\"&$D56+32&\":$AS$\"&$D56+32),Data!$AI$30:$AS$30,L$16))/(INDEX(Data!$M$33:$M$82,$D56,1)),\"\")","v":4.2771084337349397},{"$f":"IFERROR((SUMIFS(INDIRECT(\"Data!$AI$\"&$D56+32&\":$AS$\"&$D56+32),Data!$AI$30:$AS$30,M$16))/(INDEX(Data!$N$33:$N$82,$D56,1)),\"\")","v":5.5555555555555554},{"$f":"IFERROR((SUM(INDIRECT(\"Data!$AI$\"&$D56+32&\":$AS$\"&$D56+32)))/(INDEX(Data!$K$33:$K$82,$D56,1)+INDEX(Data!$L$33:$L$82,$D56,1)+INDEX(Data!$M$33:$M$82,$D56,1)+INDEX(Data!$N$33:$N$82,$D56,1)),\"\")","v":4.0478723404255321}]
[null,{"$f":"'Report A'!$B58","v":"2014-07-27"},{"$f":"'Report A'!$C58","v":"Sunday +"},{"$f":"'Report A'!$D58","v":27},{"$f":"IFERROR(IF($G$15=\"ALL\",SUMIFS(INDIRECT(\"Data!$AI$\"&$D57+32&\":$AS$\"&$D57+32),Data!$AI$30:$AS$30,E$16),SUMIFS(INDIRECT(\"Data!$AI$\"&$D57+32&\":$AS$\"&$D57+32),Data!$AI$30:$AS$30,E$16,Data!$AI$31:$AS$31,$G$15)),\"\")","v":0},{"$f":"IFERROR(IF($G$15=\"ALL\",SUMIFS(INDIRECT(\"Data!$AI$\"&$D57+32&\":$AS$\"&$D57+32),Data!$AI$30:$AS$30,F$16),SUMIFS(INDIRECT(\"Data!$AI$\"&$D57+32&\":$AS$\"&$D57+32),Data!$AI$30:$AS$30,F$16,Data!$AI$31:$AS$31,$G$15)),\"\")","v":0},{"$f":"IFERROR(IF($G$15=\"ALL\",SUMIFS(INDIRECT(\"Data!$AI$\"&$D57+32&\":$AS$\"&$D57+32),Data!$AI$30:$AS$30,G$16),SUMIFS(INDIRECT(\"Data!$AI$\"&$D57+32&\":$AS$\"&$D57+32),Data!$AI$30:$AS$30,G$16,Data!$AI$31:$AS$31,$G$15)),\"\")","v":0},{"$f":"IFERROR(IF($G$15=\"ALL\",SUMIFS(INDIRECT(\"Data!$AI$\"&$D57+32&\":$AS$\"&$D57+32),Data!$AI$30:$AS$30,H$16),SUMIFS(INDIRECT(\"Data!$AI$\"&$D57+32&\":$AS$\"&$D57+32),Data!$AI$30:$AS$30,H$16,Data!$AI$31:$AS$31,$G$15)),\"\")","v":0},0,{"$f":"IFERROR((SUMIFS(INDIRECT(\"Data!$AI$\"&$D57+32&\":$AS$\"&$D57+32),Data!$AI$30:$AS$30,J$16))/(INDEX(Data!$K$33:$K$82,$D57,1)),\"\")","v":4.2978723404255321},{"$f":"IFERROR((SUMIFS(INDIRECT(\"Data!$AI$\"&$D57+32&\":$AS$\"&$D57+32),Data!$AI$30:$AS$30,K$16))/(INDEX(Data!$L$33:$L$82,$D57,1)),\"\")","v":3.8936170212765959},{"$f":"IFERROR((SUMIFS(INDIRECT(\"Data!$AI$\"&$D57+32&\":$AS$\"&$D57+32),Data!$AI$30:$AS$30,L$16))/(INDEX(Data!$M$33:$M$82,$D57,1)),\"\")","v":3.8674698795180724},{"$f":"IFERROR((SUMIFS(INDIRECT(\"Data!$AI$\"&$D57+32&\":$AS$\"&$D57+32),Data!$AI$30:$AS$30,M$16))/(INDEX(Data!$N$33:$N$82,$D57,1)),\"\")","v":4.9333333333333336},{"$f":"IFERROR((SUM(INDIRECT(\"Data!$AI$\"&$D57+32&\":$AS$\"&$D57+32)))/(INDEX(Data!$K$33:$K$82,$D57,1)+INDEX(Data!$L$33:$L$82,$D57,1)+INDEX(Data!$M$33:$M$82,$D57,1)+INDEX(Data!$N$33:$N$82,$D57,1)),\"\")","v":4.0625}]
[null,{"$f":"'Report A'!$B59","v":"2014-07-28"},{"$f":"'Report A'!$C59","v":"Monday ++"},{"$f":"'Report A'!$D59","v":28},{"$f":"IFERROR(IF($G$15=\"ALL\",SUMIFS(INDIRECT(\"Data!$AI$\"&$D58+32&\":$AS$\"&$D58+32),Data!$AI$30:$AS$30,E$16),SUMIFS(INDIRECT(\"Data!$AI$\"&$D58+32&\":$AS$\"&$D58+32),Data!$AI$30:$AS$30,E$16,Data!$AI$31:$AS$31,$G$15)),\"\")","v":0},{"$f":"IFERROR(IF($G$15=\"ALL\",SUMIFS(INDIRECT(\"Data!$AI$\"&$D58+32&\":$AS$\"&$D58+32),Data!$AI$30:$AS$30,F$16),SUMIFS(INDIRECT(\"Data!$AI$\"&$D58+32&\":$AS$\"&$D58+32),Data!$AI$30:$AS$30,F$16,Data!$AI$31:$AS$31,$G$15)),\"\")","v":0},{"$f":"IFERROR(IF($G$15=\"ALL\",SUMIFS(INDIRECT(\"Data!$AI$\"&$D58+32&\":$AS$\"&$D58+32),Data!$AI$30:$AS$30,G$16),SUMIFS(INDIRECT(\"Data!$AI$\"&$D58+32&\":$AS$\"&$D58+32),Data!$AI$30:$AS$30,G$16,Data!$AI$31:$AS$31,$G$15)),\"\")","v":0},{"$f":"IFERROR(IF($G$15=\"ALL\",SUMIFS(INDIRECT(\"Data!$AI$\"&$D58+32&\":$AS$\"&$D58+32),Data!$AI$30:$AS$30,H$16),SUMIFS(INDIRECT(\"Data!$AI$\"&$D58+32&\":$AS$\"&$D58+32),Data!$AI$30:$AS$30,H$16,Data!$AI$31:$AS$31,$G$15)),\"\")","v":0},0,{"$f":"IFERROR((SUMIFS(INDIRECT(\"Data!$AI$\"&$D58+32&\":$AS$\"&$D58+32),Data!$AI$30:$AS$30,J$16))/(INDEX(Data!$K$33:$K$82,$D58,1)),\"\")","v":4.4782608695652177},{"$f":"IFERROR((SUMIFS(INDIRECT(\"Data!$AI$\"&$D58+32&\":$AS$\"&$D58+32),Data!$AI$30:$AS$30,K$16))/(INDEX(Data!$L$33:$L$82,$D58,1)),\"\")","v":4.3913043478260869},{"$f":"IFERROR((SUMIFS(INDIRECT(\"Data!$AI$\"&$D58+32&\":$AS$\"&$D58+32),Data!$AI$30:$AS$30,L$16))/(INDEX(Data!$M$33:$M$82,$D58,1)),\"\")","v":4.1447368421052628},{"$f":"IFERROR((SUMIFS(INDIRECT(\"Data!$AI$\"&$D58+32&\":$AS$\"&$D58+32),Data!$AI$30:$AS$30,M$16))/(INDEX(Data!$N$33:$N$82,$D58,1)),\"\")","v":1.1111111111111112},{"$f":"IFERROR((SUM(INDIRECT(\"Data!$AI$\"&$D58+32&\":$AS$\"&$D58+32)))/(INDEX(Data!$K$33:$K$82,$D58,1)+INDEX(Data!$L$33:$L$82,$D58,1)+INDEX(Data!$M$33:$M$82,$D58,1)+INDEX(Data!$N$33:$N$82,$D58,1)),\"\")","v":4.1412429378531073}]
[null,{"$f":"'Report A'!$B60","v":"2014-07-29"},{"$f":"'Report A'!$C60","v":"Tuesday ++"},{"$f":"'Report A'!$D60","v":29},{"$f":"IFERROR(IF($G$15=\"ALL\",SUMIFS(INDIRECT(\"Data!$AI$\"&$D59+32&\":$AS$\"&$D59+32),Data!$AI$30:$AS$30,E$16),SUMIFS(INDIRECT(\"Data!$AI$\"&$D59+32&\":$AS$\"&$D59+32),Data!$AI$30:$AS$30,E$16,Data!$AI$31:$AS$31,$G$15)),\"\")","v":0},{"$f":"IFERROR(IF($G$15=\"ALL\",SUMIFS(INDIRECT(\"Data!$AI$\"&$D59+32&\":$AS$\"&$D59+32),Data!$AI$30:$AS$30,F$16),SUMIFS(INDIRECT(\"Data!$AI$\"&$D59+32&\":$AS$\"&$D59+32),Data!$AI$30:$AS$30,F$16,Data!$AI$31:$AS$31,$G$15)),\"\")","v":0},{"$f":"IFERROR(IF($G$15=\"ALL\",SUMIFS(INDIRECT(\"Data!$AI$\"&$D59+32&\":$AS$\"&$D59+32),Data!$AI$30:$AS$30,G$16),SUMIFS(INDIRECT(\"Data!$AI$\"&$D59+32&\":$AS$\"&$D59+32),Data!$AI$30:$AS$30,G$16,Data!$AI$31:$AS$31,$G$15)),\"\")","v":0},{"$f":"IFERROR(IF($G$15=\"ALL\",SUMIFS(INDIRECT(\"Data!$AI$\"&$D59+32&\":$AS$\"&$D59+32),Data!$AI$30:$AS$30,H$16),SUMIFS(INDIRECT(\"Data!$AI$\"&$D59+32&\":$AS$\"&$D59+32),Data!$AI$30:$AS$30,H$16,Data!$AI$31:$AS$31,$G$15)),\"\")","v":0},0,{"$f":"IFERROR((SUMIFS(INDIRECT(\"Data!$AI$\"&$D59+32&\":$AS$\"&$D59+32),Data!$AI$30:$AS$30,J$16))/(INDEX(Data!$K$33:$K$82,$D59,1)),\"\")","v":4.6304347826086953},{"$f":"IFERROR((SUMIFS(INDIRECT(\"Data!$AI$\"&$D59+32&\":$AS$\"&$D59+32),Data!$AI$30:$AS$30,K$16))/(INDEX(Data!$L$33:$L$82,$D59,1)),\"\")","v":3.3043478260869565},{"$f":"IFERROR((SUMIFS(INDIRECT(\"Data!$AI$\"&$D59+32&\":$AS$\"&$D59+32),Data!$AI$30:$AS$30,L$16))/(INDEX(Data!$M$33:$M$82,$D59,1)),\"\")","v":3.5270270270270272},{"$f":"IFERROR((SUMIFS(INDIRECT(\"Data!$AI$\"&$D59+32&\":$AS$\"&$D59+32),Data!$AI$30:$AS$30,M$16))/(INDEX(Data!$N$33:$N$82,$D59,1)),\"\")","v":3.5555555555555554},{"$f":"IFERROR((SUM(INDIRECT(\"Data!$AI$\"&$D59+32&\":$AS$\"&$D59+32)))/(INDEX(Data!$K$33:$K$82,$D59,1)+INDEX(Data!$L$33:$L$82,$D59,1)+INDEX(Data!$M$33:$M$82,$D59,1)+INDEX(Data!$N$33:$N$82,$D59,1)),\"\")","v":3.76}]
[null,{"$f":"'Report A'!$B61","v":"2014-07-30"},{"$f":"'Report A'!$C61","v":"Wednesday"},{"$f":"'Report A'!$D61","v":30},{"$f":"IFERROR(IF($G$15=\"ALL\",SUMIFS(INDIRECT(\"Data!$AI$\"&$D60+32&\":$AS$\"&$D60+32),Data!$AI$30:$AS$30,E$16),SUMIFS(INDIRECT(\"Data!$AI$\"&$D60+32&\":$AS$\"&$D60+32),Data!$AI$30:$AS$30,E$16,Data!$AI$31:$AS$31,$G$15)),\"\")","v":0},{"$f":"IFERROR(IF($G$15=\"ALL\",SUMIFS(INDIRECT(\"Data!$AI$\"&$D60+32&\":$AS$\"&$D60+32),Data!$AI$30:$AS$30,F$16),SUMIFS(INDIRECT(\"Data!$AI$\"&$D60+32&\":$AS$\"&$D60+32),Data!$AI$30:$AS$30,F$16,Data!$AI$31:$AS$31,$G$15)),\"\")","v":66},{"$f":"IFERROR(IF($G$15=\"ALL\",SUMIFS(INDIRECT(\"Data!$AI$\"&$D60+32&\":$AS$\"&$D60+32),Data!$AI$30:$AS$30,G$16),SUMIFS(INDIRECT(\"Data!$AI$\"&$D60+32&\":$AS$\"&$D60+32),Data!$AI$30:$AS$30,G$16,Data!$AI$31:$AS$31,$G$15)),\"\")","v":0},{"$f":"IFERROR(IF($G$15=\"ALL\",SUMIFS(INDIRECT(\"Data!$AI$\"&$D60+32&\":$AS$\"&$D60+32),Data!$AI$30:$AS$30,H$16),SUMIFS(INDIRECT(\"Data!$AI$\"&$D60+32&\":$AS$\"&$D60+32),Data!$AI$30:$AS$30,H$16,Data!$AI$31:$AS$31,$G$15)),\"\")","v":0},66,{"$f":"IFERROR((SUMIFS(INDIRECT(\"Data!$AI$\"&$D60+32&\":$AS$\"&$D60+32),Data!$AI$30:$AS$30,J$16))/(INDEX(Data!$K$33:$K$82,$D60,1)),\"\")","v":4.6190476190476186},{"$f":"IFERROR((SUMIFS(INDIRECT(\"Data!$AI$\"&$D60+32&\":$AS$\"&$D60+32),Data!$AI$30:$AS$30,K$16))/(INDEX(Data!$L$33:$L$82,$D60,1)),\"\")","v":4.8510638297872344},{"$f":"IFERROR((SUMIFS(INDIRECT(\"Data!$AI$\"&$D60+32&\":$AS$\"&$D60+32),Data!$AI$30:$AS$30,L$16))/(INDEX(Data!$M$33:$M$82,$D60,1)),\"\")","v":3.4509803921568629},{"$f":"IFERROR((SUMIFS(INDIRECT(\"Data!$AI$\"&$D60+32&\":$AS$\"&$D60+32),Data!$AI$30:$AS$30,M$16))/(INDEX(Data!$N$33:$N$82,$D60,1)),\"\")","v":6},{"$f":"IFERROR((SUM(INDIRECT(\"Data!$AI$\"&$D60+32&\":$AS$\"&$D60+32)))/(INDEX(Data!$K$33:$K$82,$D60,1)+INDEX(Data!$L$33:$L$82,$D60,1)+INDEX(Data!$M$33:$M$82,$D60,1)+INDEX(Data!$N$33:$N$82,$D60,1)),\"\")","v":4.3866666666666667}]
[null,{"$f":"'Report A'!$B62","v":"2014-07-31"},{"$f":"'Report A'!$C62","v":"Thursday"},{"$f":"'Report A'!$D62","v":31},{"$f":"IFERROR(IF($G$15=\"ALL\",SUMIFS(INDIRECT(\"Data!$AI$\"&$D61+32&\":$AS$\"&$D61+32),Data!$AI$30:$AS$30,E$16),SUMIFS(INDIRECT(\"Data!$AI$\"&$D61+32&\":$AS$\"&$D61+32),Data!$AI$30:$AS$30,E$16,Data!$AI$31:$AS$31,$G$15)),\"\")","v":0},{"$f":"IFERROR(IF($G$15=\"ALL\",SUMIFS(INDIRECT(\"Data!$AI$\"&$D61+32&\":$AS$\"&$D61+32),Data!$AI$30:$AS$30,F$16),SUMIFS(INDIRECT(\"Data!$AI$\"&$D61+32&\":$AS$\"&$D61+32),Data!$AI$30:$AS$30,F$16,Data!$AI$31:$AS$31,$G$15)),\"\")","v":40},{"$f":"IFERROR(IF($G$15=\"ALL\",SUMIFS(INDIRECT(\"Data!$AI$\"&$D61+32&\":$AS$\"&$D61+32),Data!$AI$30:$AS$30,G$16),SUMIFS(INDIRECT(\"Data!$AI$\"&$D61+32&\":$AS$\"&$D61+32),Data!$AI$30:$AS$30,G$16,Data!$AI$31:$AS$31,$G$15)),\"\")","v":0},{"$f":"IFERROR(IF($G$15=\"ALL\",SUMIFS(INDIRECT(\"Data!$AI$\"&$D61+32&\":$AS$\"&$D61+32),Data!$AI$30:$AS$30,H$16),SUMIFS(INDIRECT(\"Data!$AI$\"&$D61+32&\":$AS$\"&$D61+32),Data!$AI$30:$AS$30,H$16,Data!$AI$31:$AS$31,$G$15)),\"\")","v":0},40,{"$f":"IFERROR((SUMIFS(INDIRECT(\"Data!$AI$\"&$D61+32&\":$AS$\"&$D61+32),Data!$AI$30:$AS$30,J$16))/(INDEX(Data!$K$33:$K$82,$D61,1)),\"\")","v":4.4090909090909092},{"$f":"IFERROR((SUMIFS(INDIRECT(\"Data!$AI$\"&$D61+32&\":$AS$\"&$D61+32),Data!$AI$30:$AS$30,K$16))/(INDEX(Data!$L$33:$L$82,$D61,1)),\"\")","v":4.625},{"$f":"IFERROR((SUMIFS(INDIRECT(\"Data!$AI$\"&$D61+32&\":$AS$\"&$D61+32),Data!$AI$30:$AS$30,L$16))/(INDEX(Data!$M$33:$M$82,$D61,1)),\"\")","v":4.2285714285714286},{"$f":"IFERROR((SUMIFS(INDIRECT(\"Data!$AI$\"&$D61+32&\":$AS$\"&$D61+32),Data!$AI$30:$AS$30,M$16))/(INDEX(Data!$N$33:$N$82,$D61,1)),\"\")","v":5.6},{"$f":"IFERROR((SUM(INDIRECT(\"Data!$AI$\"&$D61+32&\":$AS$\"&$D61+32)))/(INDEX(Data!$K$33:$K$82,$D61,1)+INDEX(Data!$L$33:$L$82,$D61,1)+INDEX(Data!$M$33:$M$82,$D61,1)+INDEX(Data!$N$33:$N$82,$D61,1)),\"\")","v":4.5193798449612403}]

{"sheet":"Report D","index":5,"n_rows":59,"n_cols":11,"rows_kept":59,"cut":false,"hidden":false,"merged":[]}
[]
[]
[null,null,"MONTHLY SALES REPORTING BY OUTLET"]
[]
[]
[null,"SUBJECT","REPORT D : AVERAGE SALES PER ROOM AND AVERAGE SALES PER PAX"]
[]
[null,"OUTLET",{"$f":"Data!$C$8","v":"TSU"}]
[]
[null,"MONTH / YEAR",{"$f":"Data!$C$10","v":"July 2014"}]
[]
[null,"MENU"]
[]
[null,"DATE","DAY","ROW","AVERAGE SALES PER ROOM",null,null,"AVERAGE SALES PER PAX",null,null,"CHART : AVERAGE SALES PER ROOM AND AVERAGE SALES PER PAX"]
[null,null,null,null,"A.M.","P.M.","TOTAL","A.M.","P.M.","TOTAL"]
[]
[null,null,null,null,"( RM )","( RM )","( RM )","( RM )","( RM )","( RM )"]
[null,"SUMMARY FOR MONTH",null,null,null,null,null,null,null,null,"LEGEND"]
[null,"AVERAGE SALES",null,null,{"$f":"IFERROR(SUM(E$29:E$59)/COUNTIF($D$29:$D$59,\">0\"),\"\")","v":65.518780726752922},{"$f":"IFERROR(SUM(F$29:F$59)/COUNTIF($D$29:$D$59,\">0\"),\"\")","v":80.614614562196167},72.543159896623479,17.500203033620899,21.995445097096923,19.537794915026421]
[null,"HIGHEST SALES",null,null,{"$f":"IFERROR(IF(LARGE(E$29:E$59,1)>0,LARGE(E$29:E$59,1),\"NIL\"),\"NIL\")","v":104.22499999999999},{"$f":"IFERROR(IF(LARGE(F$29:F$59,1)>0,LARGE(F$29:F$59,1),\"NIL\"),\"NIL\")","v":138.51014492753623},112.02920353982302,22.557608695652174,36.47786259541985,30.069596199524945]
[null,"LOWEST SALES",null,null,{"$f":"IFERROR(IF(LARGE(E$29:E$59,COUNTIF(E$29:E$59,\">0\"))<>E$20,LARGE(E$29:E$59,COUNTIF(E$29:E$59,\">0\")),\"NIL\"),\"NIL\")","v":41.120588235294115},37.200000000000003,43.909259259259265,11.753791469194313,9.2321167883211697,11.594621026894867]
[null,"AVERAGE FOR ","MONDAY",null,{"$f":"IFERROR(SUMIF($C$29:$C$59,\"Monday*\",E$29:E$59)/COUNTIF($C$29:$C$59,\"Monday*\"),\"\")","v":61.687021459175227},{"$f":"IFERROR(SUMIF($C$29:$C$59,\"Monday*\",F$29:F$59)/COUNTIF($C$29:$C$59,\"Monday*\"),\"\")","v":68.080461229946522},64.071455949104262,16.306799252303946,18.438053645500091,16.740497120018873]
[null,null,"TUESDAY",null,{"$f":"IFERROR(SUMIF($C$29:$C$59,\"Tuesday*\",E$29:E$59)/COUNTIF($C$29:$C$59,\"Tuesday*\"),\"\")","v":58.503264550879635},{"$f":"IFERROR(SUMIF($C$29:$C$59,\"Tuesday*\",F$29:F$59)/COUNTIF($C$29:$C$59,\"Tuesday*\"),\"\")","v":67.272442222979009},62.387403524331901,17.235292830681605,18.872791536852077,17.958314864039799]
[null,null,"WEDNESDAY",null,{"$f":"IFERROR(SUMIF($C$29:$C$59,\"Wednesday*\",E$29:E$59)/COUNTIF($C$29:$C$59,\"Wednesday*\"),\"\")","v":44.571222690387017},{"$f":"IFERROR(SUMIF($C$29:$C$59,\"Wednesday*\",F$29:F$59)/COUNTIF($C$29:$C$59,\"Wednesday*\"),\"\")","v":49.397071410689122},46.28957984316154,11.87637077293016,14.369457195122475,12.823657011695508]
[null,null,"THURSDAY",null,{"$f":"IFERROR(SUMIF($C$29:$C$59,\"Thursday*\",E$29:E$59)/COUNTIF($C$29:$C$59,\"Thursday*\"),\"\")","v":68.733472448011909},{"$f":"IFERROR(SUMIF($C$29:$C$59,\"Thursday*\",F$29:F$59)/COUNTIF($C$29:$C$59,\"Thursday*\"),\"\")","v":75.811713608476836},68.95973006030836,17.02525808669818,20.168005835271661,17.702584472555973]
[null,null,"FRIDAY",null,{"$f":"IFERROR(SUMIF($C$29:$C$59,\"Friday*\",E$29:E$59)/COUNTIF($C$29:$C$59,\"Friday*\"),\"\")","v":81.435088932806323},{"$f":"IFERROR(SUMIF($C$29:$C$59,\"Friday*\",F$29:F$59)/COUNTIF($C$29:$C$59,\"Friday*\"),\"\")","v":111.78253796546703},99.208807991311559,19.958533134222062,32.121509056074373,26.481075552979227]
[null,null,"SATURDAY",null,{"$f":"IFERROR(SUMIF($C$29:$C$59,\"Saturday*\",E$29:E$59)/COUNTIF($C$29:$C$59,\"Saturday*\"),\"\")","v":77.463284243295021},{"$f":"IFERROR(SUMIF($C$29:$C$59,\"Saturday*\",F$29:F$59)/COUNTIF($C$29:$C$59,\"Saturday*\"),\"\")","v":121.85879923921979},99.602880130497638,20.916370666109039,30.310479059509102,25.774533352346594]
[null,null,"SUNDAY",null,{"$f":"IFERROR(SUMIF($C$29:$C$59,\"Sunday*\",E$29:E$59)/COUNTIF($C$29:$C$59,\"Sunday*\"),\"\")","v":72.425206385460413},{"$f":"IFERROR(SUMIF($C$29:$C$59,\"Sunday*\",F$29:F$59)/COUNTIF($C$29:$C$59,\"Sunday*\"),\"\")","v":82.43993036970555},77.280453343166286,20.773718345039494,22.831839532359844,21.816109130745964]
[null,{"$f":"'Report A'!$B32","v":"2014-07-01"},{"$f":"'Report A'!$C32","v":"Tuesday"},{"$f":"'Report A'!$D32","v":1},{"$f":"IFERROR('Report A'!$H32/(INDEX(Data!$K$33:$K$82,$D29,1)+INDEX(Data!$L$33:$L$82,$D29,1)),\"\")","v":57.139393939393933},{"$f":"IFERROR('Report A'!$I32/(INDEX(Data!$M$33:$M$82,$D29,1)+INDEX(Data!$N$33:$N$82,$D29,1)),\"\")","v":47.506818181818183},{"$f":"IFERROR('Report A'!$J32/(INDEX(Data!$K$33:$K$82,$D29,1)+INDEX(Data!$L$33:$L$82,$D29,1)+INDEX(Data!$M$33:$M$82,$D29,1)+INDEX(Data!$N$33:$N$82,$D29,1)),\"\")","v":51.635064935064939},{"$f":"IFERROR('Report A'!$H32/(SUM(INDIRECT(\"Data!$AI$\"&$D29+32&\":$AN$\"&$D29+32))),\"\")","v":16.255172413793101},{"$f":"IFERROR('Report A'!$I32/(SUM(INDIRECT(\"Data!$AO$\"&$D29+32&\":$AS$\"&$D29+32))),\"\")","v":14.123648648648651},{"$f":"IFERROR('Report A'!$J32/(SUM(INDIRECT(\"Data!$AI$\"&$D29+32&\":$AS$\"&$D29+32))),\"\")","v":15.060227272727273}]
[null,{"$f":"'Report A'!$B33","v":"2014-07-02"},{"$f":"'Report A'!$C33","v":"Wednesday"},{"$f":"'Report A'!$D33","v":2},{"$f":"IFERROR('Report A'!$H33/(INDEX(Data!$K$33:$K$82,$D30,1)+INDEX(Data!$L$33:$L$82,$D30,1)),\"\")","v":60.921875},{"$f":"IFERROR('Report A'!$I33/(INDEX(Data!$M$33:$M$82,$D30,1)+INDEX(Data!$N$33:$N$82,$D30,1)),\"\")","v":51.592307692307699},{"$f":"IFERROR('Report A'!$J33/(INDEX(Data!$K$33:$K$82,$D30,1)+INDEX(Data!$L$33:$L$82,$D30,1)+INDEX(Data!$M$33:$M$82,$D30,1)+INDEX(Data!$N$33:$N$82,$D30,1)),\"\")","v":55.797183098591553},{"$f":"IFERROR('Report A'!$H33/(SUM(INDIRECT(\"Data!$AI$\"&$D30+32&\":$AN$\"&$D30+32))),\"\")","v":15.849593495934959},{"$f":"IFERROR('Report A'!$I33/(SUM(INDIRECT(\"Data!$AO$\"&$D30+32&\":$AS$\"&$D30+32))),\"\")","v":18.982075471698113},{"$f":"IFERROR('Report A'!$J33/(SUM(INDIRECT(\"Data!$AI$\"&$D30+32&\":$AS$\"&$D30+32))),\"\")","v":17.299563318777295}]
[null,{"$f":"'Report A'!$B34","v":"2014-07-03"},{"$f":"'Report A'!$C34","v":"Thursday"},{"$f":"'Report A'!$D34","v":3},{"$f":"IFERROR('Report A'!$H34/(INDEX(Data!$K$33:$K$82,$D31,1)+INDEX(Data!$L$33:$L$82,$D31,1)),\"\")","v":71.143749999999997},{"$f":"IFERROR('Report A'!$I34/(INDEX(Data!$M$33:$M$82,$D31,1)+INDEX(Data!$N$33:$N$82,$D31,1)),\"\")","v":48.381355932203391},{"$f":"IFERROR('Report A'!$J34/(INDEX(Data!$K$33:$K$82,$D31,1)+INDEX(Data!$L$33:$L$82,$D31,1)+INDEX(Data!$M$33:$M$82,$D31,1)+INDEX(Data!$N$33:$N$82,$D31,1)),\"\")","v":56.385714285714293},{"$f":"IFERROR('Report A'!$H34/(SUM(INDIRECT(\"Data!$AI$\"&$D31+32&\":$AN$\"&$D31+32))),\"\")","v":18.359677419354838},{"$f":"IFERROR('Report A'!$I34/(SUM(INDIRECT(\"Data!$AO$\"&$D31+32&\":$AS$\"&$D31+32))),\"\")","v":12.465065502183407},{"$f":"IFERROR('Report A'!$J34/(SUM(INDIRECT(\"Data!$AI$\"&$D31+32&\":$AS$\"&$D31+32))),\"\")","v":14.535694050991502}]
[null,{"$f":"'Report A'!$B35","v":"2014-07-04"},{"$f":"'Report A'!$C35","v":"Friday"},{"$f":"'Report A'!$D35","v":4},{"$f":"IFERROR('Report A'!$H35/(INDEX(Data!$K$33:$K$82,$D32,1)+INDEX(Data!$L$33:$L$82,$D32,1)),\"\")","v":70.61090909090909},{"$f":"IFERROR('Report A'!$I35/(INDEX(Data!$M$33:$M$82,$D32,1)+INDEX(Data!$N$33:$N$82,$D32,1)),\"\")","v":101.25072463768115},{"$f":"IFERROR('Report A'!$J35/(INDEX(Data!$K$33:$K$82,$D32,1)+INDEX(Data!$L$33:$L$82,$D32,1)+INDEX(Data!$M$33:$M$82,$D32,1)+INDEX(Data!$N$33:$N$82,$D32,1)),\"\")","v":87.660483870967738},{"$f":"IFERROR('Report A'!$H35/(SUM(INDIRECT(\"Data!$AI$\"&$D32+32&\":$AN$\"&$D32+32))),\"\")","v":18.581818181818182},{"$f":"IFERROR('Report A'!$I35/(SUM(INDIRECT(\"Data!$AO$\"&$D32+32&\":$AS$\"&$D32+32))),\"\")","v":30.113362068965515},{"$f":"IFERROR('Report A'!$J35/(SUM(INDIRECT(\"Data!$AI$\"&$D32+32&\":$AS$\"&$D32+32))),\"\")","v":24.64829931972789}]
[null,{"$f":"'Report A'!$B36","v":"2014-07-05"},{"$f":"'Report A'!$C36","v":"Saturday"},{"$f":"'Report A'!$D36","v":5},{"$f":"IFERROR('Report A'!$H36/(INDEX(Data!$K$33:$K$82,$D33,1)+INDEX(Data!$L$33:$L$82,$D33,1)),\"\")","v":89.091250000000002},{"$f":"IFERROR('Report A'!$I36/(INDEX(Data!$M$33:$M$82,$D33,1)+INDEX(Data!$N$33:$N$82,$D33,1)),\"\")","v":117.26067415730336},{"$f":"IFERROR('Report A'!$J36/(INDEX(Data!$K$33:$K$82,$D33,1)+INDEX(Data!$L$33:$L$82,$D33,1)+INDEX(Data!$M$33:$M$82,$D33,1)+INDEX(Data!$N$33:$N$82,$D33,1)),\"\")","v":103.92603550295858},{"$f":"IFERROR('Report A'!$H36/(SUM(INDIRECT(\"Data!$AI$\"&$D33+32&\":$AN$\"&$D33+32))),\"\")","v":21.930153846153846},{"$f":"IFERROR('Report A'!$I36/(SUM(INDIRECT(\"Data!$AO$\"&$D33+32&\":$AS$\"&$D33+32))),\"\")","v":30.337790697674414},{"$f":"IFERROR('Report A'!$J36/(SUM(INDIRECT(\"Data!$AI$\"&$D33+32&\":$AS$\"&$D33+32))),\"\")","v":26.253363228699552}]
[null,{"$f":"'Report A'!$B37","v":"2014-07-06"},{"$f":"'Report A'!$C37","v":"Sunday"},{"$f":"'Report A'!$D37","v":6},{"$f":"IFERROR('Report A'!$H37/(INDEX(Data!$K$33:$K$82,$D34,1)+INDEX(Data!$L$33:$L$82,$D34,1)),\"\")","v":73.425301204819277},{"$f":"IFERROR('Report A'!$I37/(INDEX(Data!$M$33:$M$82,$D34,1)+INDEX(Data!$N$33:$N$82,$D34,1)),\"\")","v":67.482352941176472},{"$f":"IFERROR('Report A'!$J37/(INDEX(Data!$K$33:$K$82,$D34,1)+INDEX(Data!$L$33:$L$82,$D34,1)+INDEX(Data!$M$33:$M$82,$D34,1)+INDEX(Data!$N$33:$N$82,$D34,1)),\"\")","v":71.163432835820899},{"$f":"IFERROR('Report A'!$H37/(SUM(INDIRECT(\"Data!$AI$\"&$D34+32&\":$AN$\"&$D34+32))),\"\")","v":22.001083032490975},{"$f":"IFERROR('Report A'!$I37/(SUM(INDIRECT(\"Data!$AO$\"&$D34+32&\":$AS$\"&$D34+32))),\"\")","v":19.12},{"$f":"IFERROR('Report A'!$J37/(SUM(INDIRECT(\"Data!$AI$\"&$D34+32&\":$AS$\"&$D34+32))),\"\")","v":20.866301969365427}]
[null,{"$f":"'Report A'!$B38","v":"2014-07-07"},{"$f":"'Report A'!$C38","v":"Monday"},{"$f":"'Report A'!$D38","v":7},{"$f":"IFERROR('Report A'!$H38/(INDEX(Data!$K$33:$K$82,$D35,1)+INDEX(Data!$L$33:$L$82,$D35,1)),\"\")","v":59.014893617021272},{"$f":"IFERROR('Report A'!$I38/(INDEX(Data!$M$33:$M$82,$D35,1)+INDEX(Data!$N$33:$N$82,$D35,1)),\"\")","v":53.072727272727271},{"$f":"IFERROR('Report A'!$J38/(INDEX(Data!$K$33:$K$82,$D35,1)+INDEX(Data!$L$33:$L$82,$D35,1)+INDEX(Data!$M$33:$M$82,$D35,1)+INDEX(Data!$N$33:$N$82,$D35,1)),\"\")","v":55.324999999999996},{"$f":"IFERROR('Report A'!$H38/(SUM(INDIRECT(\"Data!$AI$\"&$D35+32&\":$AN$\"&$D35+32))),\"\")","v":17.121604938271602},{"$f":"IFERROR('Report A'!$I38/(SUM(INDIRECT(\"Data!$AO$\"&$D35+32&\":$AS$\"&$D35+32))),\"\")","v":13.576744186046511},{"$f":"IFERROR('Report A'!$J38/(SUM(INDIRECT(\"Data!$AI$\"&$D35+32&\":$AS$\"&$D35+32))),\"\")","v":14.817062634989199}]
[null,{"$f":"'Report A'!$B39","v":"2014-07-08"},{"$f":"'Report A'!$C39","v":"Tuesday"},{"$f":"'Report A'!$D39","v":8},{"$f":"IFERROR('Report A'!$H39/(INDEX(Data!$K$33:$K$82,$D36,1)+INDEX(Data!$L$33:$L$82,$D36,1)),\"\")","v":67.900000000000006},{"$f":"IFERROR('Report A'!$I39/(INDEX(Data!$M$33:$M$82,$D36,1)+INDEX(Data!$N$33:$N$82,$D36,1)),\"\")","v":49.692857142857143},{"$f":"IFERROR('Report A'!$J39/(INDEX(Data!$K$33:$K$82,$D36,1)+INDEX(Data!$L$33:$L$82,$D36,1)+INDEX(Data!$M$33:$M$82,$D36,1)+INDEX(Data!$N$33:$N$82,$D36,1)),\"\")","v":54.484210526315792},{"$f":"IFERROR('Report A'!$H39/(SUM(INDIRECT(\"Data!$AI$\"&$D36+32&\":$AN$\"&$D36+32))),\"\")","v":20.451807228915662},{"$f":"IFERROR('Report A'!$I39/(SUM(INDIRECT(\"Data!$AO$\"&$D36+32&\":$AS$\"&$D36+32))),\"\")","v":13.587890625},{"$f":"IFERROR('Report A'!$J39/(SUM(INDIRECT(\"Data!$AI$\"&$D36+32&\":$AS$\"&$D36+32))),\"\")","v":15.268436578171091}]
[null,{"$f":"'Report A'!$B40","v":"2014-07-09"},{"$f":"'Report A'!$C40","v":"Wednesday"},{"$f":"'Report A'!$D40","v":9},{"$f":"IFERROR('Report A'!$H40/(INDEX(Data!$K$33:$K$82,$D37,1)+INDEX(Data!$L$33:$L$82,$D37,1)),\"\")","v":56},{"$f":"IFERROR('Report A'!$I40/(INDEX(Data!$M$33:$M$82,$D37,1)+INDEX(Data!$N$33:$N$82,$D37,1)),\"\")","v":46.810937500000001},{"$f":"IFERROR('Report A'!$J40/(INDEX(Data!$K$33:$K$82,$D37,1)+INDEX(Data!$L$33:$L$82,$D37,1)+INDEX(Data!$M$33:$M$82,$D37,1)+INDEX(Data!$N$33:$N$82,$D37,1)),\"\")","v":50.345192307692301},{"$f":"IFERROR('Report A'!$H40/(SUM(INDIRECT(\"Data!$AI$\"&$D37+32&\":$AN$\"&$D37+32))),\"\")","v":16.842105263157894},{"$f":"IFERROR('Report A'!$I40/(SUM(INDIRECT(\"Data!$AO$\"&$D37+32&\":$AS$\"&$D37+32))),\"\")","v":13.434529147982063},{"$f":"IFERROR('Report A'!$J40/(SUM(INDIRECT(\"Data!$AI$\"&$D37+32&\":$AS$\"&$D37+32))),\"\")","v":14.70758426966292}]
[null,{"$f":"'Report A'!$B41","v":"2014-07-10"},{"$f":"'Report A'!$C41","v":"Thursday"},{"$f":"'Report A'!$D41","v":10},{"$f":"IFERROR('Report A'!$H41/(INDEX(Data!$K$33:$K$82,$D38,1)+INDEX(Data!$L$33:$L$82,$D38,1)),\"\")","v":86.470833333333346},{"$f":"IFERROR('Report A'!$I41/(INDEX(Data!$M$33:$M$82,$D38,1)+INDEX(Data!$N$33:$N$82,$D38,1)),\"\")","v":41.492537313432834},{"$f":"IFERROR('Report A'!$J41/(INDEX(Data!$K$33:$K$82,$D38,1)+INDEX(Data!$L$33:$L$82,$D38,1)+INDEX(Data!$M$33:$M$82,$D38,1)+INDEX(Data!$N$33:$N$82,$D38,1)),\"\")","v":53.354945054945055},{"$f":"IFERROR('Report A'!$H41/(SUM(INDIRECT(\"Data!$AI$\"&$D38+32&\":$AN$\"&$D38+32))),\"\")","v":22.557608695652174},{"$f":"IFERROR('Report A'!$I41/(SUM(INDIRECT(\"Data!$AO$\"&$D38+32&\":$AS$\"&$D38+32))),\"\")","v":11.487603305785123},{"$f":"IFERROR('Report A'!$J41/(SUM(INDIRECT(\"Data!$AI$\"&$D38+32&\":$AS$\"&$D38+32))),\"\")","v":14.536826347305389}]
[null,{"$f":"'Report A'!$B42","v":"2014-07-11"},{"$f":"'Report A'!$C42","v":"Friday"},{"$f":"'Report A'!$D42","v":11},{"$f":"IFERROR('Report A'!$H42/(INDEX(Data!$K$33:$K$82,$D39,1)+INDEX(Data!$L$33:$L$82,$D39,1)),\"\")","v":104.22499999999999},{"$f":"IFERROR('Report A'!$I42/(INDEX(Data!$M$33:$M$82,$D39,1)+INDEX(Data!$N$33:$N$82,$D39,1)),\"\")","v":110.99473684210528},{"$f":"IFERROR('Report A'!$J42/(INDEX(Data!$K$33:$K$82,$D39,1)+INDEX(Data!$L$33:$L$82,$D39,1)+INDEX(Data!$M$33:$M$82,$D39,1)+INDEX(Data!$N$33:$N$82,$D39,1)),\"\")","v":108.04554455445545},{"$f":"IFERROR('Report A'!$H42/(SUM(INDIRECT(\"Data!$AI$\"&$D39+32&\":$AN$\"&$D39+32))),\"\")","v":20.113596491228069},{"$f":"IFERROR('Report A'!$I42/(SUM(INDIRECT(\"Data!$AO$\"&$D39+32&\":$AS$\"&$D39+32))),\"\")","v":34.572131147540986},{"$f":"IFERROR('Report A'!$J42/(SUM(INDIRECT(\"Data!$AI$\"&$D39+32&\":$AS$\"&$D39+32))),\"\")","v":26.551338199513381}]
[null,{"$f":"'Report A'!$B43","v":"2014-07-12"},{"$f":"'Report A'!$C43","v":"Saturday"},{"$f":"'Report A'!$D43","v":12},{"$f":"IFERROR('Report A'!$H43/(INDEX(Data!$K$33:$K$82,$D40,1)+INDEX(Data!$L$33:$L$82,$D40,1)),\"\")","v":72.267777777777766},{"$f":"IFERROR('Report A'!$I43/(INDEX(Data!$M$33:$M$82,$D40,1)+INDEX(Data!$N$33:$N$82,$D40,1)),\"\")","v":125.47560975609755},{"$f":"IFERROR('Report A'!$J43/(INDEX(Data!$K$33:$K$82,$D40,1)+INDEX(Data!$L$33:$L$82,$D40,1)+INDEX(Data!$M$33:$M$82,$D40,1)+INDEX(Data!$N$33:$N$82,$D40,1)),\"\")","v":97.634302325581388},{"$f":"IFERROR('Report A'!$H43/(SUM(INDIRECT(\"Data!$AI$\"&$D40+32&\":$AN$\"&$D40+32))),\"\")","v":19.073607038123164},{"$f":"IFERROR('Report A'!$I43/(SUM(INDIRECT(\"Data!$AO$\"&$D40+32&\":$AS$\"&$D40+32))),\"\")","v":32.87220447284345},{"$f":"IFERROR('Report A'!$J43/(SUM(INDIRECT(\"Data!$AI$\"&$D40+32&\":$AS$\"&$D40+32))),\"\")","v":25.677522935779816}]
[null,{"$f":"'Report A'!$B44","v":"2014-07-13"},{"$f":"'Report A'!$C44","v":"Sunday"},{"$f":"'Report A'!$D44","v":13},{"$f":"IFERROR('Report A'!$H44/(INDEX(Data!$K$33:$K$82,$D41,1)+INDEX(Data!$L$33:$L$82,$D41,1)),\"\")","v":74.518309859154925},{"$f":"IFERROR('Report A'!$I44/(INDEX(Data!$M$33:$M$82,$D41,1)+INDEX(Data!$N$33:$N$82,$D41,1)),\"\")","v":72.623880597014931},{"$f":"IFERROR('Report A'!$J44/(INDEX(Data!$K$33:$K$82,$D41,1)+INDEX(Data!$L$33:$L$82,$D41,1)+INDEX(Data!$M$33:$M$82,$D41,1)+INDEX(Data!$N$33:$N$82,$D41,1)),\"\")","v":73.59855072463769},{"$f":"IFERROR('Report A'!$H44/(SUM(INDIRECT(\"Data!$AI$\"&$D41+32&\":$AN$\"&$D41+32))),\"\")","v":22.137238493723849},{"$f":"IFERROR('Report A'!$I44/(SUM(INDIRECT(\"Data!$AO$\"&$D41+32&\":$AS$\"&$D41+32))),\"\")","v":21.530088495575221},{"$f":"IFERROR('Report A'!$J44/(SUM(INDIRECT(\"Data!$AI$\"&$D41+32&\":$AS$\"&$D41+32))),\"\")","v":21.84215053763441}]
[null,{"$f":"'Report A'!$B45","v":"2014-07-14"},{"$f":"'Report A'!$C45","v":"Monday"},{"$f":"'Report A'!$D45","v":14},{"$f":"IFERROR('Report A'!$H45/(INDEX(Data!$K$33:$K$82,$D42,1)+INDEX(Data!$L$33:$L$82,$D42,1)),\"\")","v":55.314999999999998},{"$f":"IFERROR('Report A'!$I45/(INDEX(Data!$M$33:$M$82,$D42,1)+INDEX(Data!$N$33:$N$82,$D42,1)),\"\")","v":37.200000000000003},{"$f":"IFERROR('Report A'!$J45/(INDEX(Data!$K$33:$K$82,$D42,1)+INDEX(Data!$L$33:$L$82,$D42,1)+INDEX(Data!$M$33:$M$82,$D42,1)+INDEX(Data!$N$33:$N$82,$D42,1)),\"\")","v":43.909259259259265},{"$f":"IFERROR('Report A'!$H45/(SUM(INDIRECT(\"Data!$AI$\"&$D42+32&\":$AN$\"&$D42+32))),\"\")","v":16.389629629629628},{"$f":"IFERROR('Report A'!$I45/(SUM(INDIRECT(\"Data!$AO$\"&$D42+32&\":$AS$\"&$D42+32))),\"\")","v":9.2321167883211697},{"$f":"IFERROR('Report A'!$J45/(SUM(INDIRECT(\"Data!$AI$\"&$D42+32&\":$AS$\"&$D42+32))),\"\")","v":11.594621026894867}]
[null,{"$f":"'Report A'!$B46","v":"2014-07-15"},{"$f":"'Report A'!$C46","v":"Tuesday"},{"$f":"'Report A'!$D46","v":15},{"$f":"IFERROR('Report A'!$H46/(INDEX(Data!$K$33:$K$82,$D43,1)+INDEX(Data!$L$33:$L$82,$D43,1)),\"\")","v":48.154166666666669},{"$f":"IFERROR('Report A'!$I46/(INDEX(Data!$M$33:$M$82,$D43,1)+INDEX(Data!$N$33:$N$82,$D43,1)),\"\")","v":75.211764705882359},{"$f":"IFERROR('Report A'!$J46/(INDEX(Data!$K$33:$K$82,$D43,1)+INDEX(Data!$L$33:$L$82,$D43,1)+INDEX(Data!$M$33:$M$82,$D43,1)+INDEX(Data!$N$33:$N$82,$D43,1)),\"\")","v":59.373170731707319},{"$f":"IFERROR('Report A'!$H46/(SUM(INDIRECT(\"Data!$AI$\"&$D43+32&\":$AN$\"&$D43+32))),\"\")","v":16.051388888888891},{"$f":"IFERROR('Report A'!$I46/(SUM(INDIRECT(\"Data!$AO$\"&$D43+32&\":$AS$\"&$D43+32))),\"\")","v":20.135433070866142},{"$f":"IFERROR('Report A'!$J46/(SUM(INDIRECT(\"Data!$AI$\"&$D43+32&\":$AS$\"&$D43+32))),\"\")","v":17.965313653136533}]
[null,{"$f":"'Report A'!$B47","v":"2014-07-16"},{"$f":"'Report A'!$C47","v":"Wednesday"},{"$f":"'Report A'!$D47","v":16},{"$f":"IFERROR('Report A'!$H47/(INDEX(Data!$K$33:$K$82,$D44,1)+INDEX(Data!$L$33:$L$82,$D44,1)),\"\")","v":0},{"$f":"IFERROR('Report A'!$I47/(INDEX(Data!$M$33:$M$82,$D44,1)+INDEX(Data!$N$33:$N$82,$D44,1)),\"\")","v":0},{"$f":"IFERROR('Report A'!$J47/(INDEX(Data!$K$33:$K$82,$D44,1)+INDEX(Data!$L$33:$L$82,$D44,1)+INDEX(Data!$M$33:$M$82,$D44,1)+INDEX(Data!$N$33:$N$82,$D44,1)),\"\")","v":0},{"$f":"IFERROR('Report A'!$H47/(SUM(INDIRECT(\"Data!$AI$\"&$D44+32&\":$AN$\"&$D44+32))),\"\")","v":0},{"$f":"IFERROR('Report A'!$I47/(SUM(INDIRECT(\"Data!$AO$\"&$D44+32&\":$AS$\"&$D44+32))),\"\")","v":0},{"$f":"IFERROR('Report A'!$J47/(SUM(INDIRECT(\"Data!$AI$\"&$D44+32&\":$AS$\"&$D44+32))),\"\")","v":0}]
[null,{"$f":"'Report A'!$B48","v":"2014-07-17"},{"$f":"'Report A'!$C48","v":"Thursday"},{"$f":"'Report A'!$D48","v":17},{"$f":"IFERROR('Report A'!$H48/(INDEX(Data!$K$33:$K$82,$D45,1)+INDEX(Data!$L$33:$L$82,$D45,1)),\"\")","v":63.827027027027022},{"$f":"IFERROR('Report A'!$I48/(INDEX(Data!$M$33:$M$82,$D45,1)+INDEX(Data!$N$33:$N$82,$D45,1)),\"\")","v":94.358333333333334},{"$f":"IFERROR('Report A'!$J48/(INDEX(Data!$K$33:$K$82,$D45,1)+INDEX(Data!$L$33:$L$82,$D45,1)+INDEX(Data!$M$33:$M$82,$D45,1)+INDEX(Data!$N$33:$N$82,$D45,1)),\"\")","v":81.068235294117642},{"$f":"IFERROR('Report A'!$H48/(SUM(INDIRECT(\"Data!$AI$\"&$D45+32&\":$AN$\"&$D45+32))),\"\")","v":15.335064935064935},{"$f":"IFERROR('Report A'!$I48/(SUM(INDIRECT(\"Data!$AO$\"&$D45+32&\":$AS$\"&$D45+32))),\"\")","v":27.449696969696969},{"$f":"IFERROR('Report A'!$J48/(SUM(INDIRECT(\"Data!$AI$\"&$D45+32&\":$AS$\"&$D45+32))),\"\")","v":21.601253918495296}]
[null,{"$f":"'Report A'!$B49","v":"2014-07-18"},{"$f":"'Report A'!$C49","v":"Friday"},{"$f":"'Report A'!$D49","v":18},{"$f":"IFERROR('Report A'!$H49/(INDEX(Data!$K$33:$K$82,$D46,1)+INDEX(Data!$L$33:$L$82,$D46,1)),\"\")","v":70.502272727272725},{"$f":"IFERROR('Report A'!$I49/(INDEX(Data!$M$33:$M$82,$D46,1)+INDEX(Data!$N$33:$N$82,$D46,1)),\"\")","v":138.51014492753623},{"$f":"IFERROR('Report A'!$J49/(INDEX(Data!$K$33:$K$82,$D46,1)+INDEX(Data!$L$33:$L$82,$D46,1)+INDEX(Data!$M$33:$M$82,$D46,1)+INDEX(Data!$N$33:$N$82,$D46,1)),\"\")","v":112.02920353982302},{"$f":"IFERROR('Report A'!$H49/(SUM(INDIRECT(\"Data!$AI$\"&$D46+32&\":$AN$\"&$D46+32))),\"\")","v":19.510062893081759},{"$f":"IFERROR('Report A'!$I49/(SUM(INDIRECT(\"Data!$AO$\"&$D46+32&\":$AS$\"&$D46+32))),\"\")","v":36.47786259541985},{"$f":"IFERROR('Report A'!$J49/(SUM(INDIRECT(\"Data!$AI$\"&$D46+32&\":$AS$\"&$D46+32))),\"\")","v":30.069596199524945}]
[null,{"$f":"'Report A'!$B50","v":"2014-07-19"},{"$f":"'Report A'!$C50","v":"Saturday"},{"$f":"'Report A'!$D50","v":19},{"$f":"IFERROR('Report A'!$H50/(INDEX(Data!$K$33:$K$82,$D47,1)+INDEX(Data!$L$33:$L$82,$D47,1)),\"\")","v":65.548275862068976},{"$f":"IFERROR('Report A'!$I50/(INDEX(Data!$M$33:$M$82,$D47,1)+INDEX(Data!$N$33:$N$82,$D47,1)),\"\")","v":117.4945652173913},{"$f":"IFERROR('Report A'!$J50/(INDEX(Data!$K$33:$K$82,$D47,1)+INDEX(Data!$L$33:$L$82,$D47,1)+INDEX(Data!$M$33:$M$82,$D47,1)+INDEX(Data!$N$33:$N$82,$D47,1)),\"\")","v":92.246927374301677},{"$f":"IFERROR('Report A'!$H50/(SUM(INDIRECT(\"Data!$AI$\"&$D47+32&\":$AN$\"&$D47+32))),\"\")","v":20.294306049822065},{"$f":"IFERROR('Report A'!$I50/(SUM(INDIRECT(\"Data!$AO$\"&$D47+32&\":$AS$\"&$D47+32))),\"\")","v":29.136118598382751},{"$f":"IFERROR('Report A'!$J50/(SUM(INDIRECT(\"Data!$AI$\"&$D47+32&\":$AS$\"&$D47+32))),\"\")","v":25.325460122699386}]
[null,{"$f":"'Report A'!$B51","v":"2014-07-20"},{"$f":"'Report A'!$C51","v":"Sunday"},{"$f":"'Report A'!$D51","v":20},{"$f":"IFERROR('Report A'!$H51/(INDEX(Data!$K$33:$K$82,$D48,1)+INDEX(Data!$L$33:$L$82,$D48,1)),\"\")","v":61.154022988505744},{"$f":"IFERROR('Report A'!$I51/(INDEX(Data!$M$33:$M$82,$D48,1)+INDEX(Data!$N$33:$N$82,$D48,1)),\"\")","v":76.13818181818182},{"$f":"IFERROR('Report A'!$J51/(INDEX(Data!$K$33:$K$82,$D48,1)+INDEX(Data!$L$33:$L$82,$D48,1)+INDEX(Data!$M$33:$M$82,$D48,1)+INDEX(Data!$N$33:$N$82,$D48,1)),\"\")","v":66.957746478873233},{"$f":"IFERROR('Report A'!$H51/(SUM(INDIRECT(\"Data!$AI$\"&$D48+32&\":$AN$\"&$D48+32))),\"\")","v":19.276811594202897},{"$f":"IFERROR('Report A'!$I51/(SUM(INDIRECT(\"Data!$AO$\"&$D48+32&\":$AS$\"&$D48+32))),\"\")","v":22.513978494623657},{"$f":"IFERROR('Report A'!$J51/(SUM(INDIRECT(\"Data!$AI$\"&$D48+32&\":$AS$\"&$D48+32))),\"\")","v":20.580086580086579}]
[null,{"$f":"'Report A'!$B52","v":"2014-07-21"},{"$f":"'Report A'!$C52","v":"Monday"},{"$f":"'Report A'!$D52","v":21},{"$f":"IFERROR('Report A'!$H52/(INDEX(Data!$K$33:$K$82,$D49,1)+INDEX(Data!$L$33:$L$82,$D49,1)),\"\")","v":44.092105263157897},{"$f":"IFERROR('Report A'!$I52/(INDEX(Data!$M$33:$M$82,$D49,1)+INDEX(Data!$N$33:$N$82,$D49,1)),\"\")","v":68.614999999999995},{"$f":"IFERROR('Report A'!$J52/(INDEX(Data!$K$33:$K$82,$D49,1)+INDEX(Data!$L$33:$L$82,$D49,1)+INDEX(Data!$M$33:$M$82,$D49,1)+INDEX(Data!$N$33:$N$82,$D49,1)),\"\")","v":56.667948717948725},{"$f":"IFERROR('Report A'!$H52/(SUM(INDIRECT(\"Data!$AI$\"&$D49+32&\":$AN$\"&$D49+32))),\"\")","v":11.799295774647888},{"$f":"IFERROR('Report A'!$I52/(SUM(INDIRECT(\"Data!$AO$\"&$D49+32&\":$AS$\"&$D49+32))),\"\")","v":21.27596899224806},{"$f":"IFERROR('Report A'!$J52/(SUM(INDIRECT(\"Data!$AI$\"&$D49+32&\":$AS$\"&$D49+32))),\"\")","v":16.310332103321034}]
[null,{"$f":"'Report A'!$B53","v":"2014-07-22"},{"$f":"'Report A'!$C53","v":"Tuesday"},{"$f":"'Report A'!$D53","v":22},{"$f":"IFERROR('Report A'!$H53/(INDEX(Data!$K$33:$K$82,$D50,1)+INDEX(Data!$L$33:$L$82,$D50,1)),\"\")","v":41.120588235294115},{"$f":"IFERROR('Report A'!$I53/(INDEX(Data!$M$33:$M$82,$D50,1)+INDEX(Data!$N$33:$N$82,$D50,1)),\"\")","v":90.35799999999999},{"$f":"IFERROR('Report A'!$J53/(INDEX(Data!$K$33:$K$82,$D50,1)+INDEX(Data!$L$33:$L$82,$D50,1)+INDEX(Data!$M$33:$M$82,$D50,1)+INDEX(Data!$N$33:$N$82,$D50,1)),\"\")","v":70.428571428571431},{"$f":"IFERROR('Report A'!$H53/(SUM(INDIRECT(\"Data!$AI$\"&$D50+32&\":$AN$\"&$D50+32))),\"\")","v":13.706862745098038},{"$f":"IFERROR('Report A'!$I53/(SUM(INDIRECT(\"Data!$AO$\"&$D50+32&\":$AS$\"&$D50+32))),\"\")","v":25.669886363636362},{"$f":"IFERROR('Report A'!$J53/(SUM(INDIRECT(\"Data!$AI$\"&$D50+32&\":$AS$\"&$D50+32))),\"\")","v":21.280575539568346}]
[null,{"$f":"'Report A'!$B54","v":"2014-07-23"},{"$f":"'Report A'!$C54","v":"Wednesday"},{"$f":"'Report A'!$D54","v":23},{"$f":"IFERROR('Report A'!$H54/(INDEX(Data!$K$33:$K$82,$D51,1)+INDEX(Data!$L$33:$L$82,$D51,1)),\"\")","v":50.202777777777776},{"$f":"IFERROR('Report A'!$I54/(INDEX(Data!$M$33:$M$82,$D51,1)+INDEX(Data!$N$33:$N$82,$D51,1)),\"\")","v":75.85588235294118},{"$f":"IFERROR('Report A'!$J54/(INDEX(Data!$K$33:$K$82,$D51,1)+INDEX(Data!$L$33:$L$82,$D51,1)+INDEX(Data!$M$33:$M$82,$D51,1)+INDEX(Data!$N$33:$N$82,$D51,1)),\"\")","v":62.662857142857135},{"$f":"IFERROR('Report A'!$H54/(SUM(INDIRECT(\"Data!$AI$\"&$D51+32&\":$AN$\"&$D51+32))),\"\")","v":14.936363636363636},{"$f":"IFERROR('Report A'!$I54/(SUM(INDIRECT(\"Data!$AO$\"&$D51+32&\":$AS$\"&$D51+32))),\"\")","v":20.6328},{"$f":"IFERROR('Report A'!$J54/(SUM(INDIRECT(\"Data!$AI$\"&$D51+32&\":$AS$\"&$D51+32))),\"\")","v":17.830894308943087}]
[null,{"$f":"'Report A'!$B55","v":"2014-07-24"},{"$f":"'Report A'!$C55","v":"Thursday"},{"$f":"'Report A'!$D55","v":24},{"$f":"IFERROR('Report A'!$H55/(INDEX(Data!$K$33:$K$82,$D52,1)+INDEX(Data!$L$33:$L$82,$D52,1)),\"\")","v":62.907894736842103},{"$f":"IFERROR('Report A'!$I55/(INDEX(Data!$M$33:$M$82,$D52,1)+INDEX(Data!$N$33:$N$82,$D52,1)),\"\")","v":100.74634146341464},{"$f":"IFERROR('Report A'!$J55/(INDEX(Data!$K$33:$K$82,$D52,1)+INDEX(Data!$L$33:$L$82,$D52,1)+INDEX(Data!$M$33:$M$82,$D52,1)+INDEX(Data!$N$33:$N$82,$D52,1)),\"\")","v":82.545569620253175},{"$f":"IFERROR('Report A'!$H55/(SUM(INDIRECT(\"Data!$AI$\"&$D52+32&\":$AN$\"&$D52+32))),\"\")","v":15.726973684210526},{"$f":"IFERROR('Report A'!$I55/(SUM(INDIRECT(\"Data!$AO$\"&$D52+32&\":$AS$\"&$D52+32))),\"\")","v":28.684722222222224},{"$f":"IFERROR('Report A'!$J55/(SUM(INDIRECT(\"Data!$AI$\"&$D52+32&\":$AS$\"&$D52+32))),\"\")","v":22.030743243243244}]
[null,{"$f":"'Report A'!$B56","v":"2014-07-25"},{"$f":"'Report A'!$C56","v":"Friday"},{"$f":"'Report A'!$D56","v":25},{"$f":"IFERROR('Report A'!$H56/(INDEX(Data!$K$33:$K$82,$D53,1)+INDEX(Data!$L$33:$L$82,$D53,1)),\"\")","v":80.402173913043484},{"$f":"IFERROR('Report A'!$I56/(INDEX(Data!$M$33:$M$82,$D53,1)+INDEX(Data!$N$33:$N$82,$D53,1)),\"\")","v":96.374545454545455},{"$f":"IFERROR('Report A'!$J56/(INDEX(Data!$K$33:$K$82,$D53,1)+INDEX(Data!$L$33:$L$82,$D53,1)+INDEX(Data!$M$33:$M$82,$D53,1)+INDEX(Data!$N$33:$N$82,$D53,1)),\"\")","v":89.100000000000009},{"$f":"IFERROR('Report A'!$H56/(SUM(INDIRECT(\"Data!$AI$\"&$D53+32&\":$AN$\"&$D53+32))),\"\")","v":21.628654970760234},{"$f":"IFERROR('Report A'!$I56/(SUM(INDIRECT(\"Data!$AO$\"&$D53+32&\":$AS$\"&$D53+32))),\"\")","v":27.322680412371135},{"$f":"IFERROR('Report A'!$J56/(SUM(INDIRECT(\"Data!$AI$\"&$D53+32&\":$AS$\"&$D53+32))),\"\")","v":24.655068493150686}]
[null,{"$f":"'Report A'!$B57","v":"2014-07-26"},{"$f":"'Report A'!$C57","v":"Saturday"},{"$f":"'Report A'!$D57","v":26},{"$f":"IFERROR('Report A'!$H57/(INDEX(Data!$K$33:$K$82,$D54,1)+INDEX(Data!$L$33:$L$82,$D54,1)),\"\")","v":82.94583333333334},{"$f":"IFERROR('Report A'!$I57/(INDEX(Data!$M$33:$M$82,$D54,1)+INDEX(Data!$N$33:$N$82,$D54,1)),\"\")","v":127.20434782608697},{"$f":"IFERROR('Report A'!$J57/(INDEX(Data!$K$33:$K$82,$D54,1)+INDEX(Data!$L$33:$L$82,$D54,1)+INDEX(Data!$M$33:$M$82,$D54,1)+INDEX(Data!$N$33:$N$82,$D54,1)),\"\")","v":104.60425531914895},{"$f":"IFERROR('Report A'!$H57/(SUM(INDIRECT(\"Data!$AI$\"&$D54+32&\":$AN$\"&$D54+32))),\"\")","v":22.367415730337079},{"$f":"IFERROR('Report A'!$I57/(SUM(INDIRECT(\"Data!$AO$\"&$D54+32&\":$AS$\"&$D54+32))),\"\")","v":28.895802469135806},{"$f":"IFERROR('Report A'!$J57/(SUM(INDIRECT(\"Data!$AI$\"&$D54+32&\":$AS$\"&$D54+32))),\"\")","v":25.841787122207624}]
[null,{"$f":"'Report A'!$B58","v":"2014-07-27"},{"$f":"'Report A'!$C58","v":"Sunday +"},{"$f":"'Report A'!$D58","v":27},{"$f":"IFERROR('Report A'!$H58/(INDEX(Data!$K$33:$K$82,$D55,1)+INDEX(Data!$L$33:$L$82,$D55,1)),\"\")","v":80.603191489361706},{"$f":"IFERROR('Report A'!$I58/(INDEX(Data!$M$33:$M$82,$D55,1)+INDEX(Data!$N$33:$N$82,$D55,1)),\"\")","v":113.51530612244898},{"$f":"IFERROR('Report A'!$J58/(INDEX(Data!$K$33:$K$82,$D55,1)+INDEX(Data!$L$33:$L$82,$D55,1)+INDEX(Data!$M$33:$M$82,$D55,1)+INDEX(Data!$N$33:$N$82,$D55,1)),\"\")","v":97.402083333333337},{"$f":"IFERROR('Report A'!$H58/(SUM(INDIRECT(\"Data!$AI$\"&$D55+32&\":$AN$\"&$D55+32))),\"\")","v":19.67974025974026},{"$f":"IFERROR('Report A'!$I58/(SUM(INDIRECT(\"Data!$AO$\"&$D55+32&\":$AS$\"&$D55+32))),\"\")","v":28.163291139240506},{"$f":"IFERROR('Report A'!$J58/(SUM(INDIRECT(\"Data!$AI$\"&$D55+32&\":$AS$\"&$D55+32))),\"\")","v":23.975897435897437}]
[null,{"$f":"'Report A'!$B59","v":"2014-07-28"},{"$f":"'Report A'!$C59","v":"Monday ++"},{"$f":"'Report A'!$D59","v":28},{"$f":"IFERROR('Report A'!$H59/(INDEX(Data!$K$33:$K$82,$D56,1)+INDEX(Data!$L$33:$L$82,$D56,1)),\"\")","v":88.326086956521735},{"$f":"IFERROR('Report A'!$I59/(INDEX(Data!$M$33:$M$82,$D56,1)+INDEX(Data!$N$33:$N$82,$D56,1)),\"\")","v":113.43411764705881},{"$f":"IFERROR('Report A'!$J59/(INDEX(Data!$K$33:$K$82,$D56,1)+INDEX(Data!$L$33:$L$82,$D56,1)+INDEX(Data!$M$33:$M$82,$D56,1)+INDEX(Data!$N$33:$N$82,$D56,1)),\"\")","v":100.38361581920904},{"$f":"IFERROR('Report A'!$H59/(SUM(INDIRECT(\"Data!$AI$\"&$D56+32&\":$AN$\"&$D56+32))),\"\")","v":19.916666666666668},{"$f":"IFERROR('Report A'!$I59/(SUM(INDIRECT(\"Data!$AO$\"&$D56+32&\":$AS$\"&$D56+32))),\"\")","v":29.667384615384613},{"$f":"IFERROR('Report A'!$J59/(SUM(INDIRECT(\"Data!$AI$\"&$D56+32&\":$AS$\"&$D56+32))),\"\")","v":24.239972714870397}]
[null,{"$f":"'Report A'!$B60","v":"2014-07-29"},{"$f":"'Report A'!$C60","v":"Tuesday ++"},{"$f":"'Report A'!$D60","v":29},{"$f":"IFERROR('Report A'!$H60/(INDEX(Data!$K$33:$K$82,$D57,1)+INDEX(Data!$L$33:$L$82,$D57,1)),\"\")","v":78.202173913043481},{"$f":"IFERROR('Report A'!$I60/(INDEX(Data!$M$33:$M$82,$D57,1)+INDEX(Data!$N$33:$N$82,$D57,1)),\"\")","v":73.592771084337343},{"$f":"IFERROR('Report A'!$J60/(INDEX(Data!$K$33:$K$82,$D57,1)+INDEX(Data!$L$33:$L$82,$D57,1)+INDEX(Data!$M$33:$M$82,$D57,1)+INDEX(Data!$N$33:$N$82,$D57,1)),\"\")","v":76.015999999999991},{"$f":"IFERROR('Report A'!$H60/(SUM(INDIRECT(\"Data!$AI$\"&$D57+32&\":$AN$\"&$D57+32))),\"\")","v":19.71123287671233},{"$f":"IFERROR('Report A'!$I60/(SUM(INDIRECT(\"Data!$AO$\"&$D57+32&\":$AS$\"&$D57+32))),\"\")","v":20.847098976109216},{"$f":"IFERROR('Report A'!$J60/(SUM(INDIRECT(\"Data!$AI$\"&$D57+32&\":$AS$\"&$D57+32))),\"\")","v":20.217021276595744}]
[null,{"$f":"'Report A'!$B61","v":"2014-07-30"},{"$f":"'Report A'!$C61","v":"Wednesday"},{"$f":"'Report A'!$D61","v":30},{"$f":"IFERROR('Report A'!$H61/(INDEX(Data!$K$33:$K$82,$D58,1)+INDEX(Data!$L$33:$L$82,$D58,1)),\"\")","v":55.731460674157304},{"$f":"IFERROR('Report A'!$I61/(INDEX(Data!$M$33:$M$82,$D58,1)+INDEX(Data!$N$33:$N$82,$D58,1)),\"\")","v":72.726229508196724},{"$f":"IFERROR('Report A'!$J61/(INDEX(Data!$K$33:$K$82,$D58,1)+INDEX(Data!$L$33:$L$82,$D58,1)+INDEX(Data!$M$33:$M$82,$D58,1)+INDEX(Data!$N$33:$N$82,$D58,1)),\"\")","v":62.642666666666678},{"$f":"IFERROR('Report A'!$H61/(SUM(INDIRECT(\"Data!$AI$\"&$D58+32&\":$AN$\"&$D58+32))),\"\")","v":11.753791469194313},{"$f":"IFERROR('Report A'!$I61/(SUM(INDIRECT(\"Data!$AO$\"&$D58+32&\":$AS$\"&$D58+32))),\"\")","v":18.797881355932205},{"$f":"IFERROR('Report A'!$J61/(SUM(INDIRECT(\"Data!$AI$\"&$D58+32&\":$AS$\"&$D58+32))),\"\")","v":14.280243161094226}]
[null,{"$f":"'Report A'!$B62","v":"2014-07-31"},{"$f":"'Report A'!$C62","v":"Thursday"},{"$f":"'Report A'!$D62","v":31},{"$f":"IFERROR('Report A'!$H62/(INDEX(Data!$K$33:$K$82,$D59,1)+INDEX(Data!$L$33:$L$82,$D59,1)),\"\")","v":59.317857142857143},{"$f":"IFERROR('Report A'!$I62/(INDEX(Data!$M$33:$M$82,$D59,1)+INDEX(Data!$N$33:$N$82,$D59,1)),\"\")","v":94.079999999999984},{"$f":"IFERROR('Report A'!$J62/(INDEX(Data!$K$33:$K$82,$D59,1)+INDEX(Data!$L$33:$L$82,$D59,1)+INDEX(Data!$M$33:$M$82,$D59,1)+INDEX(Data!$N$33:$N$82,$D59,1)),\"\")","v":71.444186046511618},{"$f":"IFERROR('Report A'!$H62/(SUM(INDIRECT(\"Data!$AI$\"&$D59+32&\":$AN$\"&$D59+32))),\"\")","v":13.146965699208442},{"$f":"IFERROR('Report A'!$I62/(SUM(INDIRECT(\"Data!$AO$\"&$D59+32&\":$AS$\"&$D59+32))),\"\")","v":20.752941176470586},{"$f":"IFERROR('Report A'!$J62/(SUM(INDIRECT(\"Data!$AI$\"&$D59+32&\":$AS$\"&$D59+32))),\"\")","v":15.808404802744423}]

{"sheet":"Report E","index":6,"n_rows":60,"n_cols":29,"rows_kept":60,"cut":false,"hidden":false,"merged":[]}
[]
[]
[null,null,"MONTHLY SALES REPORTING BY OUTLET"]
[]
[]
[null,"SUBJECT","REPORT E : PERFORMANCE OF PROMOTIONAL SALES"]
[]
[null,"OUTLET",{"$f":"Data!$C$8","v":"TSU"}]
[]
[null,"MONTH / YEAR",{"$f":"Data!$C$10","v":"July 2014"}]
[]
[null,"MENU"]
[]
[null,"DATE","DAY","ROW","TYPE 01","TYPE 02","TYPE 03","TYPE 04","TYPE 05","TYPE 06","TYPE 07","TYPE 08","TYPE 09","TYPE 10","LIST 01","LIST 02","LIST 03","LIST 04","LIST 05","LIST 06","LIST 07","LIST 08","LIST 09","CHOOSE PROMOTION",null,"Tiger (2+1) Round",null,null,{"$f":"\"CHART : PERFORMANCE OF \"&$Z$14","v":"CHART : PERFORMANCE OF Tiger (2+1) Round"}]
[null,null,null,null,null,null,null,null,null,null,null,null,null,null,"TYPE 01","TYPE 03","TYPE 05","TYPE 07","TYPE 09","LIST 01","LIST 03","LIST 05","LIST 07"]
[null,null,null,null,null,null,null,null,null,null,null,null,null,null,"TYPE 02","TYPE 04","TYPE 06","TYPE 08","TYPE 10","LIST 02","LIST 04","LIST 06","LIST 08","NOON K","HAPPY","NORMAL","MIDNIGHT","ALL"]
[null,null,null,null,"AT","AY","BD","BI","BN","BS","BX","CC","CH","CM",null,null,null,null,null,null,null,null,null,"( item )","( item )","( item )","( item )","( item )"]
[null,"SUMMARY FOR MONTH",null,null,null,null,null,null,null,null,null,null,null,null,null,null,null,null,null,null,null,null,null,null,null,null,null,null,"LEGEND"]
[null,"TOTAL SALES",null,null,null,null,null,null,null,null,null,null,null,null,null,null,null,null,null,null,null,null,null,{"$f":"SUM(X$30:X$60)","v":0},{"$f":"SUM(Y$30:Y$60)","v":0},13,0,13]
[null,"AVERAGE SALES",null,null,null,null,null,null,null,null,null,null,null,null,null,null,null,null,null,null,null,null,null,{"$f":"IFERROR(SUM(X$30:X$60)/COUNTIF($D$30:$D$60,\">0\"),\"\")","v":0},{"$f":"IFERROR(SUM(Y$30:Y$60)/COUNTIF($D$30:$D$60,\">0\"),\"\")","v":0},0.41935483870967744,0,0.41935483870967744]
[null,"HIGHEST SALES",null,null,null,null,null,null,null,null,null,null,null,null,null,null,null,null,null,null,null,null,null,{"$f":"IFERROR(IF(LARGE(X$30:X$60,1)>0,LARGE(X$30:X$60,1),\"NIL\"),\"NIL\")","v":"NIL"},{"$f":"IFERROR(IF(LARGE(Y$30:Y$60,1)>0,LARGE(Y$30:Y$60,1),\"NIL\"),\"NIL\")","v":"NIL"},5,"NIL",5]
[null,"LOWEST SALES",null,null,null,null,null,null,null,null,null,null,null,null,null,null,null,null,null,null,null,null,null,{"$f":"IFERROR(IF(LARGE(X$30:X$60,COUNTIF(X$30:X$60,\">0\"))<>X$21,LARGE(X$30:X$60,COUNTIF(X$30:X$60,\">0\")),\"NIL\"),\"NIL\")","v":"NIL"},{"$f":"IFERROR(IF(LARGE(Y$30:Y$60,COUNTIF(Y$30:Y$60,\">0\"))<>Y$21,LARGE(Y$30:Y$60,COUNTIF(Y$30:Y$60,\">0\")),\"NIL\"),\"NIL\")","v":"NIL"},{"$f":"IFERROR(IF(LARGE(Z$30:Z$60,COUNTIF(Z$30:Z$60,\">0\"))<>Z$21,LARGE(Z$30:Z$60,COUNTIF(Z$30:Z$60,\">0\")),\"NIL\"),\"NIL\")","v":1},{"$f":"IFERROR(IF(LARGE(AA$30:AA$60,COUNTIF(AA$30:AA$60,\">0\"))<>AA$21,LARGE(AA$30:AA$60,COUNTIF(AA$30:AA$60,\">0\")),\"NIL\"),\"NIL\")","v":"NIL"},{"$f":"IFERROR(IF(LARGE(AB$30:AB$60,COUNTIF(AB$30:AB$60,\">0\"))<>AB$21,LARGE(AB$30:AB$60,COUNTIF(AB$30:AB$60,\">0\")),\"NIL\"),\"NIL\")","v":1}]
[null,"AVERAGE FOR ","MONDAY",null,null,null,null,null,null,null,null,null,null,null,null,null,null,null,null,null,null,null,null,{"$f":"IFERROR(SUMIF($C$30:$C$60,\"Monday*\",X$30:X$60)/COUNTIF($C$30:$C$60,\"Monday*\"),\"\")","v":0},{"$f":"IFERROR(SUMIF($C$30:$C$60,\"Monday*\",Y$30:Y$60)/COUNTIF($C$30:$C$60,\"Monday*\"),\"\")","v":0},1.5,0,1.5]
[null,null,"TUESDAY",null,null,null,null,null,null,null,null,null,null,null,null,null,null,null,null,null,null,null,null,{"$f":"IFERROR(SUMIF($C$30:$C$60,\"Tuesday*\",X$30:X$60)/COUNTIF($C$30:$C$60,\"Tuesday*\"),\"\")","v":0},{"$f":"IFERROR(SUMIF($C$30:$C$60,\"Tuesday*\",Y$30:Y$60)/COUNTIF($C$30:$C$60,\"Tuesday*\"),\"\")","v":0},0,0,0]
[null,null,"WEDNESDAY",null,null,null,null,null,null,null,null,null,null,null,null,null,null,null,null,null,null,null,null,{"$f":"IFERROR(SUMIF($C$30:$C$60,\"Wednesday*\",X$30:X$60)/COUNTIF($C$30:$C$60,\"Wednesday*\"),\"\")","v":0},{"$f":"IFERROR(SUMIF($C$30:$C$60,\"Wednesday*\",Y$30:Y$60)/COUNTIF($C$30:$C$60,\"Wednesday*\"),\"\")","v":0},1.4,0,1.4]
[null,null,"THURSDAY",null,null,null,null,null,null,null,null,null,null,null,null,null,null,null,null,null,null,null,null,{"$f":"IFERROR(SUMIF($C$30:$C$60,\"Thursday*\",X$30:X$60)/COUNTIF($C$30:$C$60,\"Thursday*\"),\"\")","v":0},{"$f":"IFERROR(SUMIF($C$30:$C$60,\"Thursday*\",Y$30:Y$60)/COUNTIF($C$30:$C$60,\"Thursday*\"),\"\")","v":0},0,0,0]
[null,null,"FRIDAY",null,null,null,null,null,null,null,null,null,null,null,null,null,null,null,null,null,null,null,null,{"$f":"IFERROR(SUMIF($C$30:$C$60,\"Friday*\",X$30:X$60)/COUNTIF($C$30:$C$60,\"Friday*\"),\"\")","v":0},{"$f":"IFERROR(SUMIF($C$30:$C$60,\"Friday*\",Y$30:Y$60)/COUNTIF($C$30:$C$60,\"Friday*\"),\"\")","v":0},0,0,0]
[null,null,"SATURDAY",null,null,null,null,null,null,null,null,null,null,null,null,null,null,null,null,null,null,null,null,{"$f":"IFERROR(SUMIF($C$30:$C$60,\"Saturday*\",X$30:X$60)/COUNTIF($C$30:$C$60,\"Saturday*\"),\"\")","v":0},{"$f":"IFERROR(SUMIF($C$30:$C$60,\"Saturday*\",Y$30:Y$60)/COUNTIF($C$30:$C$60,\"Saturday*\"),\"\")","v":0},0,0,0]
[null,null,"SUNDAY",null,null,null,null,null,null,null,null,null,null,null,null,null,null,null,null,null,null,null,null,{"$f":"IFERROR(SUMIF($C$30:$C$60,\"Sunday*\",X$30:X$60)/COUNTIF($C$30:$C$60,\"Sunday*\"),\"\")","v":0},{"$f":"IFERROR(SUMIF($C$30:$C$60,\"Sunday*\",Y$30:Y$60)/COUNTIF($C$30:$C$60,\"Sunday*\"),\"\")","v":0},0,0,0]
[null,{"$f":"'Report A'!$B32","v":"2014-07-01"},{"$f":"'Report A'!$C32","v":"Tuesday"},{"$f":"'Report A'!$D32","v":1},{"$f":"IFERROR(INDIRECT(\"Data!\"&E$17&$D30+32),\"\")","v":"K-Lunch"},"LOK-LOK","Member 30%","Member Package","Tiger (2+1) Round","Student Member Card","Student Member Price",0,0,0,{"$f":"IFERROR(IFERROR(INDEX(($E$30:$E$60), MATCH(0, COUNTIF($O$29:O29, ($E$30:$E$60)), 0)), INDEX(($F$30:$F$60), MATCH(0, COUNTIF($O$29:O29, ($F$30:$F$60)), 0))), \"\")","v":"K-Lunch"},{"$f":"IFERROR(IFERROR(INDEX(($G$30:$G$60), MATCH(0, COUNTIF($P$29:P29, ($G$30:$G$60)), 0)), INDEX(($H$30:$H$60), MATCH(0, COUNTIF($P$29:P29, ($H$30:$H$60)), 0))), \"\")","v":"Member 30%"},{"$f":"IFERROR(IFERROR(INDEX(($I$30:$I$60), MATCH(0, COUNTIF($Q$29:Q29, ($I$30:$I$60)), 0)), INDEX(($J$30:$J$60), MATCH(0, COUNTIF($Q$29:Q29, ($J$30:$J$60)), 0))), \"\")","v":"Tiger (2+1) Round"},{"$f":"IFERROR(IFERROR(INDEX(($K$30:$K$60), MATCH(0, COUNTIF($R$29:R29, ($K$30:$K$60)), 0)), INDEX(($L$30:$L$60), MATCH(0, COUNTIF($R$29:R29, ($L$30:$L$60)), 0))), \"\")","v":"Student Member Price"},{"$f":"IFERROR(IFERROR(INDEX(($M$30:$M$60), MATCH(0, COUNTIF($S$29:S29, ($M$30:$M$60)), 0)), INDEX(($N$30:$N$60), MATCH(0, COUNTIF($S$29:S29, ($N$30:$N$60)), 0))), \"\")","v":0},{"$f":"IFERROR(IFERROR(INDEX(($O$30:$O$60), MATCH(0, COUNTIF($T$29:T29, ($O$30:$O$60)), 0)), INDEX(($P$30:$P$60), MATCH(0, COUNTIF($T$29:T29, ($P$30:$P$60)), 0))), \"\")","v":"K-Lunch"},{"$f":"IFERROR(IFERROR(INDEX(($Q$30:$Q$60), MATCH(0, COUNTIF($U$29:U29, ($Q$30:$Q$60)), 0)), INDEX(($R$30:$R$60), MATCH(0, COUNTIF($U$29:U29, ($R$30:$R$60)), 0))), \"\")","v":"Tiger (2+1) Round"},{"$f":"IFERROR(IFERROR(INDEX(($S$30:$S$60), MATCH(0, COUNTIF($V$29:V29, ($S$30:$S$60)), 0)), INDEX(($T$30:$T$60), MATCH(0, COUNTIF($V$29:V29, ($T$30:$T$60)), 0))), \"\")","v":0},{"$f":"IFERROR(IFERROR(INDEX(($U$30:$U$60), MATCH(0, COUNTIF($W$29:W29, ($U$30:$U$60)), 0)), INDEX(($V$30:$V$60), MATCH(0, COUNTIF($W$29:W29, ($V$30:$V$60)), 0))), \"\")","v":"Tiger (2+1) Round"},{"$f":"IFERROR(INDEX((Data!$AT$33:$AX$82,Data!$AY$33:$BC$82,Data!$BD$33:$BH$82,Data!$BI$33:$BM$82,Data!$BN$33:$BR$82,Data!$BS$33:$BW$82,Data!$BX$33:$CB$82,Data!$CC$33:$CG$82,Data!$CH$33:$CL$82,Data!$CM$33:$CQ$82),$D30,2,CHOOSE(MATCH($Z$14,INDIRECT(\"Data!$AT$\"&$D30+32&\":$CM$\"&$D30+32),0),1,0,0,0,0,2,0,0,0,0,3,0,0,0,0,4,0,0,0,0,5,0,0,0,0,6,0,0,0,0,7,0,0,0,0,8,0,0,0,0,9,0,0,0,0,10)),\"\")","v":0},{"$f":"IFERROR(INDEX((Data!$AT$33:$AX$82,Data!$AY$33:$BC$82,Data!$BD$33:$BH$82,Data!$BI$33:$BM$82,Data!$BN$33:$BR$82,Data!$BS$33:$BW$82,Data!$BX$33:$CB$82,Data!$CC$33:$CG$82,Data!$CH$33:$CL$82,Data!$CM$33:$CQ$82),$D30,3,CHOOSE(MATCH($Z$14,INDIRECT(\"Data!$AT$\"&$D30+32&\":$CM$\"&$D30+32),0),1,0,0,0,0,2,0,0,0,0,3,0,0,0,0,4,0,0,0,0,5,0,0,0,0,6,0,0,0,0,7,0,0,0,0,8,0,0,0,0,9,0,0,0,0,10)),\"\")","v":0},{"$f":"IFERROR(INDEX((Data!$AT$33:$AX$82,Data!$AY$33:$BC$82,Data!$BD$33:$BH$82,Data!$BI$33:$BM$82,Data!$BN$33:$BR$82,Data!$BS$33:$BW$82,Data!$BX$33:$CB$82,Data!$CC$33:$CG$82,Data!$CH$33:$CL$82,Data!$CM$33:$CQ$82),$D30,4,CHOOSE(MATCH($Z$14,INDIRECT(\"Data!$AT$\"&$D30+32&\":$CM$\"&$D30+32),0),1,0,0,0,0,2,0,0,0,0,3,0,0,0,0,4,0,0,0,0,5,0,0,0,0,6,0,0,0,0,7,0,0,0,0,8,0,0,0,0,9,0,0,0,0,10)),\"\")","v":0},{"$f":"IFERROR(INDEX((Data!$AT$33:$AX$82,Data!$AY$33:$BC$82,Data!$BD$33:$BH$82,Data!$BI$33:$BM$82,Data!$BN$33:$BR$82,Data!$BS$33:$BW$82,Data!$BX$33:$CB$82,Data!$CC$33:$CG$82,Data!$CH$33:$CL$82,Data!$CM$33:$CQ$82),$D30,5,CHOOSE(MATCH($Z$14,INDIRECT(\"Data!$AT$\"&$D30+32&\":$CM$\"&$D30+32),0),1,0,0,0,0,2,0,0,0,0,3,0,0,0,0,4,0,0,0,0,5,0,0,0,0,6,0,0,0,0,7,0,0,0,0,8,0,0,0,0,9,0,0,0,0,10)),\"\")","v":0},{"$f":"IFERROR(SUM($X30:$AA30),\"\")","v":0}]
[null,{"$f":"'Report A'!$B33","v":"2014-07-02"},{"$f":"'Report A'!$C33","v":"Wednesday"},{"$f":"'Report A'!$D33","v":2},"K-Lunch","LOK-LOK","Member 30%","Member Package","Tiger (2+1) Round","Student Member Card","Student Member Price",0,0,0,{"$f":"IFERROR(IFERROR(INDEX(($E$30:$E$60), MATCH(0, COUNTIF($O$29:O30, ($E$30:$E$60)), 0)), INDEX(($F$30:$F$60), MATCH(0, COUNTIF($O$29:O30, ($F$30:$F$60)), 0))), \"\")","v":"LOK-LOK"},{"$f":"IFERROR(IFERROR(INDEX(($G$30:$G$60), MATCH(0, COUNTIF($P$29:P30, ($G$30:$G$60)), 0)), INDEX(($H$30:$H$60), MATCH(0, COUNTIF($P$29:P30, ($H$30:$H$60)), 0))), \"\")","v":"Member Package"},{"$f":"IFERROR(IFERROR(INDEX(($I$30:$I$60), MATCH(0, COUNTIF($Q$29:Q30, ($I$30:$I$60)), 0)), INDEX(($J$30:$J$60), MATCH(0, COUNTIF($Q$29:Q30, ($J$30:$J$60)), 0))), \"\")","v":"Student Member Card"},{"$f":"IFERROR(IFERROR(INDEX(($K$30:$K$60), MATCH(0, COUNTIF($R$29:R30, ($K$30:$K$60)), 0)), INDEX(($L$30:$L$60), MATCH(0, COUNTIF($R$29:R30, ($L$30:$L$60)), 0))), \"\")","v":0},{"$f":"IFERROR(IFERROR(INDEX(($M$30:$M$60), MATCH(0, COUNTIF($S$29:S30, ($M$30:$M$60)), 0)), INDEX(($N$30:$N$60), MATCH(0, COUNTIF($S$29:S30, ($N$30:$N$60)), 0))), \"\")","v":""},{"$f":"IFERROR(IFERROR(INDEX(($O$30:$O$60), MATCH(0, COUNTIF($T$29:T30, ($O$30:$O$60)), 0)), INDEX(($P$30:$P$60), MATCH(0, COUNTIF($T$29:T30, ($P$30:$P$60)), 0))), \"\")","v":"LOK-LOK"},{"$f":"IFERROR(IFERROR(INDEX(($Q$30:$Q$60), MATCH(0, COUNTIF($U$29:U30, ($Q$30:$Q$60)), 0)), INDEX(($R$30:$R$60), MATCH(0, COUNTIF($U$29:U30, ($R$30:$R$60)), 0))), \"\")","v":"Student Member Card"},{"$f":"IFERROR(IFERROR(INDEX(($S$30:$S$60), MATCH(0, COUNTIF($V$29:V30, ($S$30:$S$60)), 0)), INDEX(($T$30:$T$60), MATCH(0, COUNTIF($V$29:V30, ($T$30:$T$60)), 0))), \"\")","v":"K-Lunch"},{"$f":"IFERROR(IFERROR(INDEX(($U$30:$U$60), MATCH(0, COUNTIF($W$29:W30, ($U$30:$U$60)), 0)), INDEX(($V$30:$V$60), MATCH(0, COUNTIF($W$29:W30, ($V$30:$V$60)), 0))), \"\")","v":"Student Member Card"},{"$f":"IFERROR(INDEX((Data!$AT$33:$AX$82,Data!$AY$33:$BC$82,Data!$BD$33:$BH$82,Data!$BI$33:$BM$82,Data!$BN$33:$BR$82,Data!$BS$33:$BW$82,Data!$BX$33:$CB$82,Data!$CC$33:$CG$82,Data!$CH$33:$CL$82,Data!$CM$33:$CQ$82),$D31,2,CHOOSE(MATCH($Z$14,INDIRECT(\"Data!$AT$\"&$D31+32&\":$CM$\"&$D31+32),0),1,0,0,0,0,2,0,0,0,0,3,0,0,0,0,4,0,0,0,0,5,0,0,0,0,6,0,0,0,0,7,0,0,0,0,8,0,0,0,0,9,0,0,0,0,10)),\"\")","v":0},{"$f":"IFERROR(INDEX((Data!$AT$33:$AX$82,Data!$AY$33:$BC$82,Data!$BD$33:$BH$82,Data!$BI$33:$BM$82,Data!$BN$33:$BR$82,Data!$BS$33:$BW$82,Data!$BX$33:$CB$82,Data!$CC$33:$CG$82,Data!$CH$33:$CL$82,Data!$CM$33:$CQ$82),$D31,3,CHOOSE(MATCH($Z$14,INDIRECT(\"Data!$AT$\"&$D31+32&\":$CM$\"&$D31+32),0),1,0,0,0,0,2,0,0,0,0,3,0,0,0,0,4,0,0,0,0,5,0,0,0,0,6,0,0,0,0,7,0,0,0,0,8,0,0,0,0,9,0,0,0,0,10)),\"\")","v":0},{"$f":"IFERROR(INDEX((Data!$AT$33:$AX$82,Data!$AY$33:$BC$82,Data!$BD$33:$BH$82,Data!$BI$33:$BM$82,Data!$BN$33:$BR$82,Data!$BS$33:$BW$82,Data!$BX$33:$CB$82,Data!$CC$33:$CG$82,Data!$CH$33:$CL$82,Data!$CM$33:$CQ$82),$D31,4,CHOOSE(MATCH($Z$14,INDIRECT(\"Data!$AT$\"&$D31+32&\":$CM$\"&$D31+32),0),1,0,0,0,0,2,0,0,0,0,3,0,0,0,0,4,0,0,0,0,5,0,0,0,0,6,0,0,0,0,7,0,0,0,0,8,0,0,0,0,9,0,0,0,0,10)),\"\")","v":1},{"$f":"IFERROR(INDEX((Data!$AT$33:$AX$82,Data!$AY$33:$BC$82,Data!$BD$33:$BH$82,Data!$BI$33:$BM$82,Data!$BN$33:$BR$82,Data!$BS$33:$BW$82,Data!$BX$33:$CB$82,Data!$CC$33:$CG$82,Data!$CH$33:$CL$82,Data!$CM$33:$CQ$82),$D31,5,CHOOSE(MATCH($Z$14,INDIRECT(\"Data!$AT$\"&$D31+32&\":$CM$\"&$D31+32),0),1,0,0,0,0,2,0,0,0,0,3,0,0,0,0,4,0,0,0,0,5,0,0,0,0,6,0,0,0,0,7,0,0,0,0,8,0,0,0,0,9,0,0,0,0,10)),\"\")","v":0},{"$f":"IFERROR(SUM($X31:$AA31),\"\")","v":1}]
[null,{"$f":"'Report A'!$B34","v":"2014-07-03"},{"$f":"'Report A'!$C34","v":"Thursday"},{"$f":"'Report A'!$D34","v":3},"K-Lunch","LOK-LOK","Member 30%","Member Package","Tiger (2+1) Round","Student Member Card","Student Member Price",0,0,0,{"$f":"IFERROR(IFERROR(INDEX(($E$30:$E$60), MATCH(0, COUNTIF($O$29:O31, ($E$30:$E$60)), 0)), INDEX(($F$30:$F$60), MATCH(0, COUNTIF($O$29:O31, ($F$30:$F$60)), 0))), \"\")","v":""},{"$f":"IFERROR(IFERROR(INDEX(($G$30:$G$60), MATCH(0, COUNTIF($P$29:P31, ($G$30:$G$60)), 0)), INDEX(($H$30:$H$60), MATCH(0, COUNTIF($P$29:P31, ($H$30:$H$60)), 0))), \"\")","v":""},{"$f":"IFERROR(IFERROR(INDEX(($I$30:$I$60), MATCH(0, COUNTIF($Q$29:Q31, ($I$30:$I$60)), 0)), INDEX(($J$30:$J$60), MATCH(0, COUNTIF($Q$29:Q31, ($J$30:$J$60)), 0))), \"\")","v":""},{"$f":"IFERROR(IFERROR(INDEX(($K$30:$K$60), MATCH(0, COUNTIF($R$29:R31, ($K$30:$K$60)), 0)), INDEX(($L$30:$L$60), MATCH(0, COUNTIF($R$29:R31, ($L$30:$L$60)), 0))), \"\")","v":""},{"$f":"IFERROR(IFERROR(INDEX(($M$30:$M$60), MATCH(0, COUNTIF($S$29:S31, ($M$30:$M$60)), 0)), INDEX(($N$30:$N$60), MATCH(0, COUNTIF($S$29:S31, ($N$30:$N$60)), 0))), \"\")","v":""},{"$f":"IFERROR(IFERROR(INDEX(($O$30:$O$60), MATCH(0, COUNTIF($T$29:T31, ($O$30:$O$60)), 0)), INDEX(($P$30:$P$60), MATCH(0, COUNTIF($T$29:T31, ($P$30:$P$60)), 0))), \"\")","v":"Member 30%"},{"$f":"IFERROR(IFERROR(INDEX(($Q$30:$Q$60), MATCH(0, COUNTIF($U$29:U31, ($Q$30:$Q$60)), 0)), INDEX(($R$30:$R$60), MATCH(0, COUNTIF($U$29:U31, ($R$30:$R$60)), 0))), \"\")","v":"Student Member Price"},{"$f":"IFERROR(IFERROR(INDEX(($S$30:$S$60), MATCH(0, COUNTIF($V$29:V31, ($S$30:$S$60)), 0)), INDEX(($T$30:$T$60), MATCH(0, COUNTIF($V$29:V31, ($T$30:$T$60)), 0))), \"\")","v":"LOK-LOK"},{"$f":"IFERROR(IFERROR(INDEX(($U$30:$U$60), MATCH(0, COUNTIF($W$29:W31, ($U$30:$U$60)), 0)), INDEX(($V$30:$V$60), MATCH(0, COUNTIF($W$29:W31, ($V$30:$V$60)), 0))), \"\")","v":"Student Member Price"},{"$f":"IFERROR(INDEX((Data!$AT$33:$AX$82,Data!$AY$33:$BC$82,Data!$BD$33:$BH$82,Data!$BI$33:$BM$82,Data!$BN$33:$BR$82,Data!$BS$33:$BW$82,Data!$BX$33:$CB$82,Data!$CC$33:$CG$82,Data!$CH$33:$CL$82,Data!$CM$33:$CQ$82),$D32,2,CHOOSE(MATCH($Z$14,INDIRECT(\"Data!$AT$\"&$D32+32&\":$CM$\"&$D32+32),0),1,0,0,0,0,2,0,0,0,0,3,0,0,0,0,4,0,0,0,0,5,0,0,0,0,6,0,0,0,0,7,0,0,0,0,8,0,0,0,0,9,0,0,0,0,10)),\"\")","v":0},{"$f":"IFERROR(INDEX((Data!$AT$33:$AX$82,Data!$AY$33:$BC$82,Data!$BD$33:$BH$82,Data!$BI$33:$BM$82,Data!$BN$33:$BR$82,Data!$BS$33:$BW$82,Data!$BX$33:$CB$82,Data!$CC$33:$CG$82,Data!$CH$33:$CL$82,Data!$CM$33:$CQ$82),$D32,3,CHOOSE(MATCH($Z$14,INDIRECT(\"Data!$AT$\"&$D32+32&\":$CM$\"&$D32+32),0),1,0,0,0,0,2,0,0,0,0,3,0,0,0,0,4,0,0,0,0,5,0,0,0,0,6,0,0,0,0,7,0,0,0,0,8,0,0,0,0,9,0,0,0,0,10)),\"\")","v":0},{"$f":"IFERROR(INDEX((Data!$AT$33:$AX$82,Data!$AY$33:$BC$82,Data!$BD$33:$BH$82,Data!$BI$33:$BM$82,Data!$BN$33:$BR$82,Data!$BS$33:$BW$82,Data!$BX$33:$CB$82,Data!$CC$33:$CG$82,Data!$CH$33:$CL$82,Data!$CM$33:$CQ$82),$D32,4,CHOOSE(MATCH($Z$14,INDIRECT(\"Data!$AT$\"&$D32+32&\":$CM$\"&$D32+32),0),1,0,0,0,0,2,0,0,0,0,3,0,0,0,0,4,0,0,0,0,5,0,0,0,0,6,0,0,0,0,7,0,0,0,0,8,0,0,0,0,9,0,0,0,0,10)),\"\")","v":0},{"$f":"IFERROR(INDEX((Data!$AT$33:$AX$82,Data!$AY$33:$BC$82,Data!$BD$33:$BH$82,Data!$BI$33:$BM$82,Data!$BN$33:$BR$82,Data!$BS$33:$BW$82,Data!$BX$33:$CB$82,Data!$CC$33:$CG$82,Data!$CH$33:$CL$82,Data!$CM$33:$CQ$82),$D32,5,CHOOSE(MATCH($Z$14,INDIRECT(\"Data!$AT$\"&$D32+32&\":$CM$\"&$D32+32),0),1,0,0,0,0,2,0,0,0,0,3,0,0,0,0,4,0,0,0,0,5,0,0,0,0,6,0,0,0,0,7,0,0,0,0,8,0,0,0,0,9,0,0,0,0,10)),\"\")","v":0},0]
[null,{"$f":"'Report A'!$B35","v":"2014-07-04"},{"$f":"'Report A'!$C35","v":"Friday"},{"$f":"'Report A'!$D35","v":4},"K-Lunch","LOK-LOK","Member 30%","Member Package","Tiger (2+1) Round","Student Member Card","Student Member Price",0,0,0,{"$f":"IFERROR(IFERROR(INDEX(($E$30:$E$60), MATCH(0, COUNTIF($O$29:O32, ($E$30:$E$60)), 0)), INDEX(($F$30:$F$60), MATCH(0, COUNTIF($O$29:O32, ($F$30:$F$60)), 0))), \"\")","v":""},{"$f":"IFERROR(IFERROR(INDEX(($G$30:$G$60), MATCH(0, COUNTIF($P$29:P32, ($G$30:$G$60)), 0)), INDEX(($H$30:$H$60), MATCH(0, COUNTIF($P$29:P32, ($H$30:$H$60)), 0))), \"\")","v":""},{"$f":"IFERROR(IFERROR(INDEX(($I$30:$I$60), MATCH(0, COUNTIF($Q$29:Q32, ($I$30:$I$60)), 0)), INDEX(($J$30:$J$60), MATCH(0, COUNTIF($Q$29:Q32, ($J$30:$J$60)), 0))), \"\")","v":""},{"$f":"IFERROR(IFERROR(INDEX(($K$30:$K$60), MATCH(0, COUNTIF($R$29:R32, ($K$30:$K$60)), 0)), INDEX(($L$30:$L$60), MATCH(0, COUNTIF($R$29:R32, ($L$30:$L$60)), 0))), \"\")","v":""},{"$f":"IFERROR(IFERROR(INDEX(($M$30:$M$60), MATCH(0, COUNTIF($S$29:S32, ($M$30:$M$60)), 0)), INDEX(($N$30:$N$60), MATCH(0, COUNTIF($S$29:S32, ($N$30:$N$60)), 0))), \"\")","v":""},{"$f":"IFERROR(IFERROR(INDEX(($O$30:$O$60), MATCH(0, COUNTIF($T$29:T32, ($O$30:$O$60)), 0)), INDEX(($P$30:$P$60), MATCH(0, COUNTIF($T$29:T32, ($P$30:$P$60)), 0))), \"\")","v":"Member Package"},{"$f":"IFERROR(IFERROR(INDEX(($Q$30:$Q$60), MATCH(0, COUNTIF($U$29:U32, ($Q$30:$Q$60)), 0)), INDEX(($R$30:$R$60), MATCH(0, COUNTIF($U$29:U32, ($R$30:$R$60)), 0))), \"\")","v":0},{"$f":"IFERROR(IFERROR(INDEX(($S$30:$S$60), MATCH(0, COUNTIF($V$29:V32, ($S$30:$S$60)), 0)), INDEX(($T$30:$T$60), MATCH(0, COUNTIF($V$29:V32, ($T$30:$T$60)), 0))), \"\")","v":"Member 30%"},{"$f":"IFERROR(IFERROR(INDEX(($U$30:$U$60), MATCH(0, COUNTIF($W$29:W32, ($U$30:$U$60)), 0)), INDEX(($V$30:$V$60), MATCH(0, COUNTIF($W$29:W32, ($V$30:$V$60)), 0))), \"\")","v":0},{"$f":"IFERROR(INDEX((Data!$AT$33:$AX$82,Data!$AY$33:$BC$82,Data!$BD$33:$BH$82,Data!$BI$33:$BM$82,Data!$BN$33:$BR$82,Data!$BS$33:$BW$82,Data!$BX$33:$CB$82,Data!$CC$33:$CG$82,Data!$CH$33:$CL$82,Data!$CM$33:$CQ$82),$D33,2,CHOOSE(MATCH($Z$14,INDIRECT(\"Data!$AT$\"&$D33+32&\":$CM$\"&$D33+32),0),1,0,0,0,0,2,0,0,0,0,3,0,0,0,0,4,0,0,0,0,5,0,0,0,0,6,0,0,0,0,7,0,0,0,0,8,0,0,0,0,9,0,0,0,0,10)),\"\")","v":0},{"$f":"IFERROR(INDEX((Data!$AT$33:$AX$82,Data!$AY$33:$BC$82,Data!$BD$33:$BH$82,Data!$BI$33:$BM$82,Data!$BN$33:$BR$82,Data!$BS$33:$BW$82,Data!$BX$33:$CB$82,Data!$CC$33:$CG$82,Data!$CH$33:$CL$82,Data!$CM$33:$CQ$82),$D33,3,CHOOSE(MATCH($Z$14,INDIRECT(\"Data!$AT$\"&$D33+32&\":$CM$\"&$D33+32),0),1,0,0,0,0,2,0,0,0,0,3,0,0,0,0,4,0,0,0,0,5,0,0,0,0,6,0,0,0,0,7,0,0,0,0,8,0,0,0,0,9,0,0,0,0,10)),\"\")","v":0},{"$f":"IFERROR(INDEX((Data!$AT$33:$AX$82,Data!$AY$33:$BC$82,Data!$BD$33:$BH$82,Data!$BI$33:$BM$82,Data!$BN$33:$BR$82,Data!$BS$33:$BW$82,Data!$BX$33:$CB$82,Data!$CC$33:$CG$82,Data!$CH$33:$CL$82,Data!$CM$33:$CQ$82),$D33,4,CHOOSE(MATCH($Z$14,INDIRECT(\"Data!$AT$\"&$D33+32&\":$CM$\"&$D33+32),0),1,0,0,0,0,2,0,0,0,0,3,0,0,0,0,4,0,0,0,0,5,0,0,0,0,6,0,0,0,0,7,0,0,0,0,8,0,0,0,0,9,0,0,0,0,10)),\"\")","v":0},{"$f":"IFERROR(INDEX((Data!$AT$33:$AX$82,Data!$AY$33:$BC$82,Data!$BD$33:$BH$82,Data!$BI$33:$BM$82,Data!$BN$33:$BR$82,Data!$BS$33:$BW$82,Data!$BX$33:$CB$82,Data!$CC$33:$CG$82,Data!$CH$33:$CL$82,Data!$CM$33:$CQ$82),$D33,5,CHOOSE(MATCH($Z$14,INDIRECT(\"Data!$AT$\"&$D33+32&\":$CM$\"&$D33+32),0),1,0,0,0,0,2,0,0,0,0,3,0,0,0,0,4,0,0,0,0,5,0,0,0,0,6,0,0,0,0,7,0,0,0,0,8,0,0,0,0,9,0,0,0,0,10)),\"\")","v":0},0]
[null,{"$f":"'Report A'!$B36","v":"2014-07-05"},{"$f":"'Report A'!$C36","v":"Saturday"},{"$f":"'Report A'!$D36","v":5},"K-Lunch","LOK-LOK","Member 30%","Member Package","Tiger (2+1) Round","Student Member Card","Student Member Price",0,0,0,{"$f":"IFERROR(IFERROR(INDEX(($E$30:$E$60), MATCH(0, COUNTIF($O$29:O33, ($E$30:$E$60)), 0)), INDEX(($F$30:$F$60), MATCH(0, COUNTIF($O$29:O33, ($F$30:$F$60)), 0))), \"\")","v":""},{"$f":"IFERROR(IFERROR(INDEX(($G$30:$G$60), MATCH(0, COUNTIF($P$29:P33, ($G$30:$G$60)), 0)), INDEX(($H$30:$H$60), MATCH(0, COUNTIF($P$29:P33, ($H$30:$H$60)), 0))), \"\")","v":""},{"$f":"IFERROR(IFERROR(INDEX(($I$30:$I$60), MATCH(0, COUNTIF($Q$29:Q33, ($I$30:$I$60)), 0)), INDEX(($J$30:$J$60), MATCH(0, COUNTIF($Q$29:Q33, ($J$30:$J$60)), 0))), \"\")","v":""},{"$f":"IFERROR(IFERROR(INDEX(($K$30:$K$60), MATCH(0, COUNTIF($R$29:R33, ($K$30:$K$60)), 0)), INDEX(($L$30:$L$60), MATCH(0, COUNTIF($R$29:R33, ($L$30:$L$60)), 0))), \"\")","v":""},{"$f":"IFERROR(IFERROR(INDEX(($M$30:$M$60), MATCH(0, COUNTIF($S$29:S33, ($M$30:$M$60)), 0)), INDEX(($N$30:$N$60), MATCH(0, COUNTIF($S$29:S33, ($N$30:$N$60)), 0))), \"\")","v":""},{"$f":"IFERROR(IFERROR(INDEX(($O$30:$O$60), MATCH(0, COUNTIF($T$29:T33, ($O$30:$O$60)), 0)), INDEX(($P$30:$P$60), MATCH(0, COUNTIF($T$29:T33, ($P$30:$P$60)), 0))), \"\")","v":""},{"$f":"IFERROR(IFERROR(INDEX(($Q$30:$Q$60), MATCH(0, COUNTIF($U$29:U33, ($Q$30:$Q$60)), 0)), INDEX(($R$30:$R$60), MATCH(0, COUNTIF($U$29:U33, ($R$30:$R$60)), 0))), \"\")","v":""},{"$f":"IFERROR(IFERROR(INDEX(($S$30:$S$60), MATCH(0, COUNTIF($V$29:V33, ($S$30:$S$60)), 0)), INDEX(($T$30:$T$60), MATCH(0, COUNTIF($V$29:V33, ($T$30:$T$60)), 0))), \"\")","v":"Member Package"},{"$f":"IFERROR(IFERROR(INDEX(($U$30:$U$60), MATCH(0, COUNTIF($W$29:W33, ($U$30:$U$60)), 0)), INDEX(($V$30:$V$60), MATCH(0, COUNTIF($W$29:W33, ($V$30:$V$60)), 0))), \"\")","v":"K-Lunch"},{"$f":"IFERROR(INDEX((Data!$AT$33:$AX$82,Data!$AY$33:$BC$82,Data!$BD$33:$BH$82,Data!$BI$33:$BM$82,Data!$BN$33:$BR$82,Data!$BS$33:$BW$82,Data!$BX$33:$CB$82,Data!$CC$33:$CG$82,Data!$CH$33:$CL$82,Data!$CM$33:$CQ$82),$D34,2,CHOOSE(MATCH($Z$14,INDIRECT(\"Data!$AT$\"&$D34+32&\":$CM$\"&$D34+32),0),1,0,0,0,0,2,0,0,0,0,3,0,0,0,0,4,0,0,0,0,5,0,0,0,0,6,0,0,0,0,7,0,0,0,0,8,0,0,0,0,9,0,0,0,0,10)),\"\")","v":0},{"$f":"IFERROR(INDEX((Data!$AT$33:$AX$82,Data!$AY$33:$BC$82,Data!$BD$33:$BH$82,Data!$BI$33:$BM$82,Data!$BN$33:$BR$82,Data!$BS$33:$BW$82,Data!$BX$33:$CB$82,Data!$CC$33:$CG$82,Data!$CH$33:$CL$82,Data!$CM$33:$CQ$82),$D34,3,CHOOSE(MATCH($Z$14,INDIRECT(\"Data!$AT$\"&$D34+32&\":$CM$\"&$D34+32),0),1,0,0,0,0,2,0,0,0,0,3,0,0,0,0,4,0,0,0,0,5,0,0,0,0,6,0,0,0,0,7,0,0,0,0,8,0,0,0,0,9,0,0,0,0,10)),\"\")","v":0},{"$f":"IFERROR(INDEX((Data!$AT$33:$AX$82,Data!$AY$33:$BC$82,Data!$BD$33:$BH$82,Data!$BI$33:$BM$82,Data!$BN$33:$BR$82,Data!$BS$33:$BW$82,Data!$BX$33:$CB$82,Data!$CC$33:$CG$82,Data!$CH$33:$CL$82,Data!$CM$33:$CQ$82),$D34,4,CHOOSE(MATCH($Z$14,INDIRECT(\"Data!$AT$\"&$D34+32&\":$CM$\"&$D34+32),0),1,0,0,0,0,2,0,0,0,0,3,0,0,0,0,4,0,0,0,0,5,0,0,0,0,6,0,0,0,0,7,0,0,0,0,8,0,0,0,0,9,0,0,0,0,10)),\"\")","v":0},{"$f":"IFERROR(INDEX((Data!$AT$33:$AX$82,Data!$AY$33:$BC$82,Data!$BD$33:$BH$82,Data!$BI$33:$BM$82,Data!$BN$33:$BR$82,Data!$BS$33:$BW$82,Data!$BX$33:$CB$82,Data!$CC$33:$CG$82,Data!$CH$33:$CL$82,Data!$CM$33:$CQ$82),$D34,5,CHOOSE(MATCH($Z$14,INDIRECT(\"Data!$AT$\"&$D34+32&\":$CM$\"&$D34+32),0),1,0,0,0,0,2,0,0,0,0,3,0,0,0,0,4,0,0,0,0,5,0,0,0,0,6,0,0,0,0,7,0,0,0,0,8,0,0,0,0,9,0,0,0,0,10)),\"\")","v":0},0]
[null,{"$f":"'Report A'!$B37","v":"2014-07-06"},{"$f":"'Report A'!$C37","v":"Sunday"},{"$f":"'Report A'!$D37","v":6},"K-Lunch","LOK-LOK","Member 30%","Member Package","Tiger (2+1) Round","Student Member Card","Student Member Price",0,0,0,{"$f":"IFERROR(IFERROR(INDEX(($E$30:$E$60), MATCH(0, COUNTIF($O$29:O34, ($E$30:$E$60)), 0)), INDEX(($F$30:$F$60), MATCH(0, COUNTIF($O$29:O34, ($F$30:$F$60)), 0))), \"\")","v":""},{"$f":"IFERROR(IFERROR(INDEX(($G$30:$G$60), MATCH(0, COUNTIF($P$29:P34, ($G$30:$G$60)), 0)), INDEX(($H$30:$H$60), MATCH(0, COUNTIF($P$29:P34, ($H$30:$H$60)), 0))), \"\")","v":""},{"$f":"IFERROR(IFERROR(INDEX(($I$30:$I$60), MATCH(0, COUNTIF($Q$29:Q34, ($I$30:$I$60)), 0)), INDEX(($J$30:$J$60), MATCH(0, COUNTIF($Q$29:Q34, ($J$30:$J$60)), 0))), \"\")","v":""},{"$f":"IFERROR(IFERROR(INDEX(($K$30:$K$60), MATCH(0, COUNTIF($R$29:R34, ($K$30:$K$60)), 0)), INDEX(($L$30:$L$60), MATCH(0, COUNTIF($R$29:R34, ($L$30:$L$60)), 0))), \"\")","v":""},{"$f":"IFERROR(IFERROR(INDEX(($M$30:$M$60), MATCH(0, COUNTIF($S$29:S34, ($M$30:$M$60)), 0)), INDEX(($N$30:$N$60), MATCH(0, COUNTIF($S$29:S34, ($N$30:$N$60)), 0))), \"\")","v":""},{"$f":"IFERROR(IFERROR(INDEX(($O$30:$O$60), MATCH(0, COUNTIF($T$29:T34, ($O$30:$O$60)), 0)), INDEX(($P$30:$P$60), MATCH(0, COUNTIF($T$29:T34, ($P$30:$P$60)), 0))), \"\")","v":""},{"$f":"IFERROR(IFERROR(INDEX(($Q$30:$Q$60), MATCH(0, COUNTIF($U$29:U34, ($Q$30:$Q$60)), 0)), INDEX(($R$30:$R$60), MATCH(0, COUNTIF($U$29:U34, ($R$30:$R$60)), 0))), \"\")","v":""},{"$f":"IFERROR(IFERROR(INDEX(($S$30:$S$60), MATCH(0, COUNTIF($V$29:V34, ($S$30:$S$60)), 0)), INDEX(($T$30:$T$60), MATCH(0, COUNTIF($V$29:V34, ($T$30:$T$60)), 0))), \"\")","v":""},{"$f":"IFERROR(IFERROR(INDEX(($U$30:$U$60), MATCH(0, COUNTIF($W$29:W34, ($U$30:$U$60)), 0)), INDEX(($V$30:$V$60), MATCH(0, COUNTIF($W$29:W34, ($V$30:$V$60)), 0))), \"\")","v":"LOK-LOK"},{"$f":"IFERROR(INDEX((Data!$AT$33:$AX$82,Data!$AY$33:$BC$82,Data!$BD$33:$BH$82,Data!$BI$33:$BM$82,Data!$BN$33:$BR$82,Data!$BS$33:$BW$82,Data!$BX$33:$CB$82,Data!$CC$33:$CG$82,Data!$CH$33:$CL$82,Data!$CM$33:$CQ$82),$D35,2,CHOOSE(MATCH($Z$14,INDIRECT(\"Data!$AT$\"&$D35+32&\":$CM$\"&$D35+32),0),1,0,0,0,0,2,0,0,0,0,3,0,0,0,0,4,0,0,0,0,5,0,0,0,0,6,0,0,0,0,7,0,0,0,0,8,0,0,0,0,9,0,0,0,0,10)),\"\")","v":0},{"$f":"IFERROR(INDEX((Data!$AT$33:$AX$82,Data!$AY$33:$BC$82,Data!$BD$33:$BH$82,Data!$BI$33:$BM$82,Data!$BN$33:$BR$82,Data!$BS$33:$BW$82,Data!$BX$33:$CB$82,Data!$CC$33:$CG$82,Data!$CH$33:$CL$82,Data!$CM$33:$CQ$82),$D35,3,CHOOSE(MATCH($Z$14,INDIRECT(\"Data!$AT$\"&$D35+32&\":$CM$\"&$D35+32),0),1,0,0,0,0,2,0,0,0,0,3,0,0,0,0,4,0,0,0,0,5,0,0,0,0,6,0,0,0,0,7,0,0,0,0,8,0,0,0,0,9,0,0,0,0,10)),\"\")","v":0},{"$f":"IFERROR(INDEX((Data!$AT$33:$AX$82,Data!$AY$33:$BC$82,Data!$BD$33:$BH$82,Data!$BI$33:$BM$82,Data!$BN$33:$BR$82,Data!$BS$33:$BW$82,Data!$BX$33:$CB$82,Data!$CC$33:$CG$82,Data!$CH$33:$CL$82,Data!$CM$33:$CQ$82),$D35,4,CHOOSE(MATCH($Z$14,INDIRECT(\"Data!$AT$\"&$D35+32&\":$CM$\"&$D35+32),0),1,0,0,0,0,2,0,0,0,0,3,0,0,0,0,4,0,0,0,0,5,0,0,0,0,6,0,0,0,0,7,0,0,0,0,8,0,0,0,0,9,0,0,0,0,10)),\"\")","v":0},{"$f":"IFERROR(INDEX((Data!$AT$33:$AX$82,Data!$AY$33:$BC$82,Data!$BD$33:$BH$82,Data!$BI$33:$BM$82,Data!$BN$33:$BR$82,Data!$BS$33:$BW$82,Data!$BX$33:$CB$82,Data!$CC$33:$CG$82,Data!$CH$33:$CL$82,Data!$CM$33:$CQ$82),$D35,5,CHOOSE(MATCH($Z$14,INDIRECT(\"Data!$AT$\"&$D35+32&\":$CM$\"&$D35+32),0),1,0,0,0,0,2,0,0,0,0,3,0,0,0,0,4,0,0,0,0,5,0,0,0,0,6,0,0,0,0,7,0,0,0,0,8,0,0,0,0,9,0,0,0,0,10)),\"\")","v":0},0]
[null,{"$f":"'Report A'!$B38","v":"2014-07-07"},{"$f":"'Report A'!$C38","v":"Monday"},{"$f":"'Report A'!$D38","v":7},"K-Lunch","LOK-LOK","Member 30%","Member Package","Tiger (2+1) Round","Student Member Card","Student Member Price",0,0,0,{"$f":"IFERROR(IFERROR(INDEX(($E$30:$E$60), MATCH(0, COUNTIF($O$29:O35, ($E$30:$E$60)), 0)), INDEX(($F$30:$F$60), MATCH(0, COUNTIF($O$29:O35, ($F$30:$F$60)), 0))), \"\")","v":""},{"$f":"IFERROR(IFERROR(INDEX(($G$30:$G$60), MATCH(0, COUNTIF($P$29:P35, ($G$30:$G$60)), 0)), INDEX(($H$30:$H$60), MATCH(0, COUNTIF($P$29:P35, ($H$30:$H$60)), 0))), \"\")","v":""},{"$f":"IFERROR(IFERROR(INDEX(($I$30:$I$60), MATCH(0, COUNTIF($Q$29:Q35, ($I$30:$I$60)), 0)), INDEX(($J$30:$J$60), MATCH(0, COUNTIF($Q$29:Q35, ($J$30:$J$60)), 0))), \"\")","v":""},{"$f":"IFERROR(IFERROR(INDEX(($K$30:$K$60), MATCH(0, COUNTIF($R$29:R35, ($K$30:$K$60)), 0)), INDEX(($L$30:$L$60), MATCH(0, COUNTIF($R$29:R35, ($L$30:$L$60)), 0))), \"\")","v":""},{"$f":"IFERROR(IFERROR(INDEX(($M$30:$M$60), MATCH(0, COUNTIF($S$29:S35, ($M$30:$M$60)), 0)), INDEX(($N$30:$N$60), MATCH(0, COUNTIF($S$29:S35, ($N$30:$N$60)), 0))), \"\")","v":""},{"$f":"IFERROR(IFERROR(INDEX(($O$30:$O$60), MATCH(0, COUNTIF($T$29:T35, ($O$30:$O$60)), 0)), INDEX(($P$30:$P$60), MATCH(0, COUNTIF($T$29:T35, ($P$30:$P$60)), 0))), \"\")","v":""},{"$f":"IFERROR(IFERROR(INDEX(($Q$30:$Q$60), MATCH(0, COUNTIF($U$29:U35, ($Q$30:$Q$60)), 0)), INDEX(($R$30:$R$60), MATCH(0, COUNTIF($U$29:U35, ($R$30:$R$60)), 0))), \"\")","v":""},{"$f":"IFERROR(IFERROR(INDEX(($S$30:$S$60), MATCH(0, COUNTIF($V$29:V35, ($S$30:$S$60)), 0)), INDEX(($T$30:$T$60), MATCH(0, COUNTIF($V$29:V35, ($T$30:$T$60)), 0))), \"\")","v":""},{"$f":"IFERROR(IFERROR(INDEX(($U$30:$U$60), MATCH(0, COUNTIF($W$29:W35, ($U$30:$U$60)), 0)), INDEX(($V$30:$V$60), MATCH(0, COUNTIF($W$29:W35, ($V$30:$V$60)), 0))), \"\")","v":"Member 30%"},{"$f":"IFERROR(INDEX((Data!$AT$33:$AX$82,Data!$AY$33:$BC$82,Data!$BD$33:$BH$82,Data!$BI$33:$BM$82,Data!$BN$33:$BR$82,Data!$BS$33:$BW$82,Data!$BX$33:$CB$82,Data!$CC$33:$CG$82,Data!$CH$33:$CL$82,Data!$CM$33:$CQ$82),$D36,2,CHOOSE(MATCH($Z$14,INDIRECT(\"Data!$AT$\"&$D36+32&\":$CM$\"&$D36+32),0),1,0,0,0,0,2,0,0,0,0,3,0,0,0,0,4,0,0,0,0,5,0,0,0,0,6,0,0,0,0,7,0,0,0,0,8,0,0,0,0,9,0,0,0,0,10)),\"\")","v":0},{"$f":"IFERROR(INDEX((Data!$AT$33:$AX$82,Data!$AY$33:$BC$82,Data!$BD$33:$BH$82,Data!$BI$33:$BM$82,Data!$BN$33:$BR$82,Data!$BS$33:$BW$82,Data!$BX$33:$CB$82,Data!$CC$33:$CG$82,Data!$CH$33:$CL$82,Data!$CM$33:$CQ$82),$D36,3,CHOOSE(MATCH($Z$14,INDIRECT(\"Data!$AT$\"&$D36+32&\":$CM$\"&$D36+32),0),1,0,0,0,0,2,0,0,0,0,3,0,0,0,0,4,0,0,0,0,5,0,0,0,0,6,0,0,0,0,7,0,0,0,0,8,0,0,0,0,9,0,0,0,0,10)),\"\")","v":0},{"$f":"IFERROR(INDEX((Data!$AT$33:$AX$82,Data!$AY$33:$BC$82,Data!$BD$33:$BH$82,Data!$BI$33:$BM$82,Data!$BN$33:$BR$82,Data!$BS$33:$BW$82,Data!$BX$33:$CB$82,Data!$CC$33:$CG$82,Data!$CH$33:$CL$82,Data!$CM$33:$CQ$82),$D36,4,CHOOSE(MATCH($Z$14,INDIRECT(\"Data!$AT$\"&$D36+32&\":$CM$\"&$D36+32),0),1,0,0,0,0,2,0,0,0,0,3,0,0,0,0,4,0,0,0,0,5,0,0,0,0,6,0,0,0,0,7,0,0,0,0,8,0,0,0,0,9,0,0,0,0,10)),\"\")","v":3},{"$f":"IFERROR(INDEX((Data!$AT$33:$AX$82,Data!$AY$33:$BC$82,Data!$BD$33:$BH$82,Data!$BI$33:$BM$82,Data!$BN$33:$BR$82,Data!$BS$33:$BW$82,Data!$BX$33:$CB$82,Data!$CC$33:$CG$82,Data!$CH$33:$CL$82,Data!$CM$33:$CQ$82),$D36,5,CHOOSE(MATCH($Z$14,INDIRECT(\"Data!$AT$\"&$D36+32&\":$CM$\"&$D36+32),0),1,0,0,0,0,2,0,0,0,0,3,0,0,0,0,4,0,0,0,0,5,0,0,0,0,6,0,0,0,0,7,0,0,0,0,8,0,0,0,0,9,0,0,0,0,10)),\"\")","v":0},3]
[null,{"$f":"'Report A'!$B39","v":"2014-07-08"},{"$f":"'Report A'!$C39","v":"Tuesday"},{"$f":"'Report A'!$D39","v":8},"K-Lunch","LOK-LOK","Member 30%","Member Package","Tiger (2+1) Round","Student Member Card","Student Member Price",0,0,0,{"$f":"IFERROR(IFERROR(INDEX(($E$30:$E$60), MATCH(0, COUNTIF($O$29:O36, ($E$30:$E$60)), 0)), INDEX(($F$30:$F$60), MATCH(0, COUNTIF($O$29:O36, ($F$30:$F$60)), 0))), \"\")","v":""},{"$f":"IFERROR(IFERROR(INDEX(($G$30:$G$60), MATCH(0, COUNTIF($P$29:P36, ($G$30:$G$60)), 0)), INDEX(($H$30:$H$60), MATCH(0, COUNTIF($P$29:P36, ($H$30:$H$60)), 0))), \"\")","v":""},{"$f":"IFERROR(IFERROR(INDEX(($I$30:$I$60), MATCH(0, COUNTIF($Q$29:Q36, ($I$30:$I$60)), 0)), INDEX(($J$30:$J$60), MATCH(0, COUNTIF($Q$29:Q36, ($J$30:$J$60)), 0))), \"\")","v":""},{"$f":"IFERROR(IFERROR(INDEX(($K$30:$K$60), MATCH(0, COUNTIF($R$29:R36, ($K$30:$K$60)), 0)), INDEX(($L$30:$L$60), MATCH(0, COUNTIF($R$29:R36, ($L$30:$L$60)), 0))), \"\")","v":""},{"$f":"IFERROR(IFERROR(INDEX(($M$30:$M$60), MATCH(0, COUNTIF($S$29:S36, ($M$30:$M$60)), 0)), INDEX(($N$30:$N$60), MATCH(0, COUNTIF($S$29:S36, ($N$30:$N$60)), 0))), \"\")","v":""},{"$f":"IFERROR(IFERROR(INDEX(($O$30:$O$60), MATCH(0, COUNTIF($T$29:T36, ($O$30:$O$60)), 0)), INDEX(($P$30:$P$60), MATCH(0, COUNTIF($T$29:T36, ($P$30:$P$60)), 0))), \"\")","v":""},{"$f":"IFERROR(IFERROR(INDEX(($Q$30:$Q$60), MATCH(0, COUNTIF($U$29:U36, ($Q$30:$Q$60)), 0)), INDEX(($R$30:$R$60), MATCH(0, COUNTIF($U$29:U36, ($R$30:$R$60)), 0))), \"\")","v":""},{"$f":"IFERROR(IFERROR(INDEX(($S$30:$S$60), MATCH(0, COUNTIF($V$29:V36, ($S$30:$S$60)), 0)), INDEX(($T$30:$T$60), MATCH(0, COUNTIF($V$29:V36, ($T$30:$T$60)), 0))), \"\")","v":""},{"$f":"IFERROR(IFERROR(INDEX(($U$30:$U$60), MATCH(0, COUNTIF($W$29:W36, ($U$30:$U$60)), 0)), INDEX(($V$30:$V$60), MATCH(0, COUNTIF($W$29:W36, ($V$30:$V$60)), 0))), \"\")","v":"Member Package"},{"$f":"IFERROR(INDEX((Data!$AT$33:$AX$82,Data!$AY$33:$BC$82,Data!$BD$33:$BH$82,Data!$BI$33:$BM$82,Data!$BN$33:$BR$82,Data!$BS$33:$BW$82,Data!$BX$33:$CB$82,Data!$CC$33:$CG$82,Data!$CH$33:$CL$82,Data!$CM$33:$CQ$82),$D37,2,CHOOSE(MATCH($Z$14,INDIRECT(\"Data!$AT$\"&$D37+32&\":$CM$\"&$D37+32),0),1,0,0,0,0,2,0,0,0,0,3,0,0,0,0,4,0,0,0,0,5,0,0,0,0,6,0,0,0,0,7,0,0,0,0,8,0,0,0,0,9,0,0,0,0,10)),\"\")","v":0},{"$f":"IFERROR(INDEX((Data!$AT$33:$AX$82,Data!$AY$33:$BC$82,Data!$BD$33:$BH$82,Data!$BI$33:$BM$82,Data!$BN$33:$BR$82,Data!$BS$33:$BW$82,Data!$BX$33:$CB$82,Data!$CC$33:$CG$82,Data!$CH$33:$CL$82,Data!$CM$33:$CQ$82),$D37,3,CHOOSE(MATCH($Z$14,INDIRECT(\"Data!$AT$\"&$D37+32&\":$CM$\"&$D37+32),0),1,0,0,0,0,2,0,0,0,0,3,0,0,0,0,4,0,0,0,0,5,0,0,0,0,6,0,0,0,0,7,0,0,0,0,8,0,0,0,0,9,0,0,0,0,10)),\"\")","v":0},{"$f":"IFERROR(INDEX((Data!$AT$33:$AX$82,Data!$AY$33:$BC$82,Data!$BD$33:$BH$82,Data!$BI$33:$BM$82,Data!$BN$33:$BR$82,Data!$BS$33:$BW$82,Data!$BX$33:$CB$82,Data!$CC$33:$CG$82,Data!$CH$33:$CL$82,Data!$CM$33:$CQ$82),$D37,4,CHOOSE(MATCH($Z$14,INDIRECT(\"Data!$AT$\"&$D37+32&\":$CM$\"&$D37+32),0),1,0,0,0,0,2,0,0,0,0,3,0,0,0,0,4,0,0,0,0,5,0,0,0,0,6,0,0,0,0,7,0,0,0,0,8,0,0,0,0,9,0,0,0,0,10)),\"\")","v":0},{"$f":"IFERROR(INDEX((Data!$AT$33:$AX$82,Data!$AY$33:$BC$82,Data!$BD$33:$BH$82,Data!$BI$33:$BM$82,Data!$BN$33:$BR$82,Data!$BS$33:$BW$82,Data!$BX$33:$CB$82,Data!$CC$33:$CG$82,Data!$CH$33:$CL$82,Data!$CM$33:$CQ$82),$D37,5,CHOOSE(MATCH($Z$14,INDIRECT(\"Data!$AT$\"&$D37+32&\":$CM$\"&$D37+32),0),1,0,0,0,0,2,0,0,0,0,3,0,0,0,0,4,0,0,0,0,5,0,0,0,0,6,0,0,0,0,7,0,0,0,0,8,0,0,0,0,9,0,0,0,0,10)),\"\")","v":0},0]
[null,{"$f":"'Report A'!$B40","v":"2014-07-09"},{"$f":"'Report A'!$C40","v":"Wednesday"},{"$f":"'Report A'!$D40","v":9},"K-Lunch","LOK-LOK","Member 30%","Member Package","Tiger (2+1) Round","Student Member Card","Student Member Price",0,0,0,{"$f":"IFERROR(IFERROR(INDEX(($E$30:$E$60), MATCH(0, COUNTIF($O$29:O37, ($E$30:$E$60)), 0)), INDEX(($F$30:$F$60), MATCH(0, COUNTIF($O$29:O37, ($F$30:$F$60)), 0))), \"\")","v":""},{"$f":"IFERROR(IFERROR(INDEX(($G$30:$G$60), MATCH(0, COUNTIF($P$29:P37, ($G$30:$G$60)), 0)), INDEX(($H$30:$H$60), MATCH(0, COUNTIF($P$29:P37, ($H$30:$H$60)), 0))), \"\")","v":""},{"$f":"IFERROR(IFERROR(INDEX(($I$30:$I$60), MATCH(0, COUNTIF($Q$29:Q37, ($I$30:$I$60)), 0)), INDEX(($J$30:$J$60), MATCH(0, COUNTIF($Q$29:Q37, ($J$30:$J$60)), 0))), \"\")","v":""},{"$f":"IFERROR(IFERROR(INDEX(($K$30:$K$60), MATCH(0, COUNTIF($R$29:R37, ($K$30:$K$60)), 0)), INDEX(($L$30:$L$60), MATCH(0, COUNTIF($R$29:R37, ($L$30:$L$60)), 0))), \"\")","v":""},{"$f":"IFERROR(IFERROR(INDEX(($M$30:$M$60), MATCH(0, COUNTIF($S$29:S37, ($M$30:$M$60)), 0)), INDEX(($N$30:$N$60), MATCH(0, COUNTIF($S$29:S37, ($N$30:$N$60)), 0))), \"\")","v":""},{"$f":"IFERROR(IFERROR(INDEX(($O$30:$O$60), MATCH(0, COUNTIF($T$29:T37, ($O$30:$O$60)), 0)), INDEX(($P$30:$P$60), MATCH(0, COUNTIF($T$29:T37, ($P$30:$P$60)), 0))), \"\")","v":""},{"$f":"IFERROR(IFERROR(INDEX(($Q$30:$Q$60), MATCH(0, COUNTIF($U$29:U37, ($Q$30:$Q$60)), 0)), INDEX(($R$30:$R$60), MATCH(0, COUNTIF($U$29:U37, ($R$30:$R$60)), 0))), \"\")","v":""},{"$f":"IFERROR(IFERROR(INDEX(($S$30:$S$60), MATCH(0, COUNTIF($V$29:V37, ($S$30:$S$60)), 0)), INDEX(($T$30:$T$60), MATCH(0, COUNTIF($V$29:V37, ($T$30:$T$60)), 0))), \"\")","v":""},{"$f":"IFERROR(IFERROR(INDEX(($U$30:$U$60), MATCH(0, COUNTIF($W$29:W37, ($U$30:$U$60)), 0)), INDEX(($V$30:$V$60), MATCH(0, COUNTIF($W$29:W37, ($V$30:$V$60)), 0))), \"\")","v":""},{"$f":"IFERROR(INDEX((Data!$AT$33:$AX$82,Data!$AY$33:$BC$82,Data!$BD$33:$BH$82,Data!$BI$33:$BM$82,Data!$BN$33:$BR$82,Data!$BS$33:$BW$82,Data!$BX$33:$CB$82,Data!$CC$33:$CG$82,Data!$CH$33:$CL$82,Data!$CM$33:$CQ$82),$D38,2,CHOOSE(MATCH($Z$14,INDIRECT(\"Data!$AT$\"&$D38+32&\":$CM$\"&$D38+32),0),1,0,0,0,0,2,0,0,0,0,3,0,0,0,0,4,0,0,0,0,5,0,0,0,0,6,0,0,0,0,7,0,0,0,0,8,0,0,0,0,9,0,0,0,0,10)),\"\")","v":0},{"$f":"IFERROR(INDEX((Data!$AT$33:$AX$82,Data!$AY$33:$BC$82,Data!$BD$33:$BH$82,Data!$BI$33:$BM$82,Data!$BN$33:$BR$82,Data!$BS$33:$BW$82,Data!$BX$33:$CB$82,Data!$CC$33:$CG$82,Data!$CH$33:$CL$82,Data!$CM$33:$CQ$82),$D38,3,CHOOSE(MATCH($Z$14,INDIRECT(\"Data!$AT$\"&$D38+32&\":$CM$\"&$D38+32),0),1,0,0,0,0,2,0,0,0,0,3,0,0,0,0,4,0,0,0,0,5,0,0,0,0,6,0,0,0,0,7,0,0,0,0,8,0,0,0,0,9,0,0,0,0,10)),\"\")","v":0},{"$f":"IFERROR(INDEX((Data!$AT$33:$AX$82,Data!$AY$33:$BC$82,Data!$BD$33:$BH$82,Data!$BI$33:$BM$82,Data!$BN$33:$BR$82,Data!$BS$33:$BW$82,Data!$BX$33:$CB$82,Data!$CC$33:$CG$82,Data!$CH$33:$CL$82,Data!$CM$33:$CQ$82),$D38,4,CHOOSE(MATCH($Z$14,INDIRECT(\"Data!$AT$\"&$D38+32&\":$CM$\"&$D38+32),0),1,0,0,0,0,2,0,0,0,0,3,0,0,0,0,4,0,0,0,0,5,0,0,0,0,6,0,0,0,0,7,0,0,0,0,8,0,0,0,0,9,0,0,0,0,10)),\"\")","v":0},{"$f":"IFERROR(INDEX((Data!$AT$33:$AX$82,Data!$AY$33:$BC$82,Data!$BD$33:$BH$82,Data!$BI$33:$BM$82,Data!$BN$33:$BR$82,Data!$BS$33:$BW$82,Data!$BX$33:$CB$82,Data!$CC$33:$CG$82,Data!$CH$33:$CL$82,Data!$CM$33:$CQ$82),$D38,5,CHOOSE(MATCH($Z$14,INDIRECT(\"Data!$AT$\"&$D38+32&\":$CM$\"&$D38+32),0),1,0,0,0,0,2,0,0,0,0,3,0,0,0,0,4,0,0,0,0,5,0,0,0,0,6,0,0,0,0,7,0,0,0,0,8,0,0,0,0,9,0,0,0,0,10)),\"\")","v":0},0]
[null,{"$f":"'Report A'!$B41","v":"2014-07-10"},{"$f":"'Report A'!$C41","v":"Thursday"},{"$f":"'Report A'!$D41","v":10},"K-Lunch","LOK-LOK","Member 30%","Member Package","Tiger (2+1) Round","Student Member Card","Student Member Price",0,0,0,{"$f":"IFERROR(IFERROR(INDEX(($E$30:$E$60), MATCH(0, COUNTIF($O$29:O38, ($E$30:$E$60)), 0)), INDEX(($F$30:$F$60), MATCH(0, COUNTIF($O$29:O38, ($F$30:$F$60)), 0))), \"\")","v":""},{"$f":"IFERROR(IFERROR(INDEX(($G$30:$G$60), MATCH(0, COUNTIF($P$29:P38, ($G$30:$G$60)), 0)), INDEX(($H$30:$H$60), MATCH(0, COUNTIF($P$29:P38, ($H$30:$H$60)), 0))), \"\")","v":""},{"$f":"IFERROR(IFERROR(INDEX(($I$30:$I$60), MATCH(0, COUNTIF($Q$29:Q38, ($I$30:$I$60)), 0)), INDEX(($J$30:$J$60), MATCH(0, COUNTIF($Q$29:Q38, ($J$30:$J$60)), 0))), \"\")","v":""},{"$f":"IFERROR(IFERROR(INDEX(($K$30:$K$60), MATCH(0, COUNTIF($R$29:R38, ($K$30:$K$60)), 0)), INDEX(($L$30:$L$60), MATCH(0, COUNTIF($R$29:R38, ($L$30:$L$60)), 0))), \"\")","v":""},{"$f":"IFERROR(IFERROR(INDEX(($M$30:$M$60), MATCH(0, COUNTIF($S$29:S38, ($M$30:$M$60)), 0)), INDEX(($N$30:$N$60), MATCH(0, COUNTIF($S$29:S38, ($N$30:$N$60)), 0))), \"\")","v":""},{"$f":"IFERROR(IFERROR(INDEX(($O$30:$O$60), MATCH(0, COUNTIF($T$29:T38, ($O$30:$O$60)), 0)), INDEX(($P$30:$P$60), MATCH(0, COUNTIF($T$29:T38, ($P$30:$P$60)), 0))), \"\")","v":""},{"$f":"IFERROR(IFERROR(INDEX(($Q$30:$Q$60), MATCH(0, COUNTIF($U$29:U38, ($Q$30:$Q$60)), 0)), INDEX(($R$30:$R$60), MATCH(0, COUNTIF($U$29:U38, ($R$30:$R$60)), 0))), \"\")","v":""},{"$f":"IFERROR(IFERROR(INDEX(($S$30:$S$60), MATCH(0, COUNTIF($V$29:V38, ($S$30:$S$60)), 0)), INDEX(($T$30:$T$60), MATCH(0, COUNTIF($V$29:V38, ($T$30:$T$60)), 0))), \"\")","v":""},{"$f":"IFERROR(IFERROR(INDEX(($U$30:$U$60), MATCH(0, COUNTIF($W$29:W38, ($U$30:$U$60)), 0)), INDEX(($V$30:$V$60), MATCH(0, COUNTIF($W$29:W38, ($V$30:$V$60)), 0))), \"\")","v":""},{"$f":"IFERROR(INDEX((Data!$AT$33:$AX$82,Data!$AY$33:$BC$82,Data!$BD$33:$BH$82,Data!$BI$33:$BM$82,Data!$BN$33:$BR$82,Data!$BS$33:$BW$82,Data!$BX$33:$CB$82,Data!$CC$33:$CG$82,Data!$CH$33:$CL$82,Data!$CM$33:$CQ$82),$D39,2,CHOOSE(MATCH($Z$14,INDIRECT(\"Data!$AT$\"&$D39+32&\":$CM$\"&$D39+32),0),1,0,0,0,0,2,0,0,0,0,3,0,0,0,0,4,0,0,0,0,5,0,0,0,0,6,0,0,0,0,7,0,0,0,0,8,0,0,0,0,9,0,0,0,0,10)),\"\")","v":0},{"$f":"IFERROR(INDEX((Data!$AT$33:$AX$82,Data!$AY$33:$BC$82,Data!$BD$33:$BH$82,Data!$BI$33:$BM$82,Data!$BN$33:$BR$82,Data!$BS$33:$BW$82,Data!$BX$33:$CB$82,Data!$CC$33:$CG$82,Data!$CH$33:$CL$82,Data!$CM$33:$CQ$82),$D39,3,CHOOSE(MATCH($Z$14,INDIRECT(\"Data!$AT$\"&$D39+32&\":$CM$\"&$D39+32),0),1,0,0,0,0,2,0,0,0,0,3,0,0,0,0,4,0,0,0,0,5,0,0,0,0,6,0,0,0,0,7,0,0,0,0,8,0,0,0,0,9,0,0,0,0,10)),\"\")","v":0},{"$f":"IFERROR(INDEX((Data!$AT$33:$AX$82,Data!$AY$33:$BC$82,Data!$BD$33:$BH$82,Data!$BI$33:$BM$82,Data!$BN$33:$BR$82,Data!$BS$33:$BW$82,Data!$BX$33:$CB$82,Data!$CC$33:$CG$82,Data!$CH$33:$CL$82,Data!$CM$33:$CQ$82),$D39,4,CHOOSE(MATCH($Z$14,INDIRECT(\"Data!$AT$\"&$D39+32&\":$CM$\"&$D39+32),0),1,0,0,0,0,2,0,0,0,0,3,0,0,0,0,4,0,0,0,0,5,0,0,0,0,6,0,0,0,0,7,0,0,0,0,8,0,0,0,0,9,0,0,0,0,10)),\"\")","v":0},{"$f":"IFERROR(INDEX((Data!$AT$33:$AX$82,Data!$AY$33:$BC$82,Data!$BD$33:$BH$82,Data!$BI$33:$BM$82,Data!$BN$33:$BR$82,Data!$BS$33:$BW$82,Data!$BX$33:$CB$82,Data!$CC$33:$CG$82,Data!$CH$33:$CL$82,Data!$CM$33:$CQ$82),$D39,5,CHOOSE(MATCH($Z$14,INDIRECT(\"Data!$AT$\"&$D39+32&\":$CM$\"&$D39+32),0),1,0,0,0,0,2,0,0,0,0,3,0,0,0,0,4,0,0,0,0,5,0,0,0,0,6,0,0,0,0,7,0,0,0,0,8,0,0,0,0,9,0,0,0,0,10)),\"\")","v":0},0]
[null,{"$f":"'Report A'!$B42","v":"2014-07-11"},{"$f":"'Report A'!$C42","v":"Friday"},{"$f":"'Report A'!$D42","v":11},{"$f":"IFERROR(INDIRECT(\"Data!\"&E$17&$D40+32),\"\")","v":"K-Lunch"},"LOK-LOK","Member 30%","Member Package","Tiger (2+1) Round","Student Member Card","Student Member Price",0,0,0,{"$f":"IFERROR(IFERROR(INDEX(($E$30:$E$60), MATCH(0, COUNTIF($O$29:O39, ($E$30:$E$60)), 0)), INDEX(($F$30:$F$60), MATCH(0, COUNTIF($O$29:O39, ($F$30:$F$60)), 0))), \"\")","v":""},{"$f":"IFERROR(IFERROR(INDEX(($G$30:$G$60), MATCH(0, COUNTIF($P$29:P39, ($G$30:$G$60)), 0)), INDEX(($H$30:$H$60), MATCH(0, COUNTIF($P$29:P39, ($H$30:$H$60)), 0))), \"\")","v":""},{"$f":"IFERROR(IFERROR(INDEX(($I$30:$I$60), MATCH(0, COUNTIF($Q$29:Q39, ($I$30:$I$60)), 0)), INDEX(($J$30:$J$60), MATCH(0, COUNTIF($Q$29:Q39, ($J$30:$J$60)), 0))), \"\")","v":""},{"$f":"IFERROR(IFERROR(INDEX(($K$30:$K$60), MATCH(0, COUNTIF($R$29:R39, ($K$30:$K$60)), 0)), INDEX(($L$30:$L$60), MATCH(0, COUNTIF($R$29:R39, ($L$30:$L$60)), 0))), \"\")","v":""},{"$f":"IFERROR(IFERROR(INDEX(($M$30:$M$60), MATCH(0, COUNTIF($S$29:S39, ($M$30:$M$60)), 0)), INDEX(($N$30:$N$60), MATCH(0, COUNTIF($S$29:S39, ($N$30:$N$60)), 0))), \"\")","v":""},{"$f":"IFERROR(IFERROR(INDEX(($O$30:$O$60), MATCH(0, COUNTIF($T$29:T39, ($O$30:$O$60)), 0)), INDEX(($P$30:$P$60), MATCH(0, COUNTIF($T$29:T39, ($P$30:$P$60)), 0))), \"\")","v":""},{"$f":"IFERROR(IFERROR(INDEX(($Q$30:$Q$60), MATCH(0, COUNTIF($U$29:U39, ($Q$30:$Q$60)), 0)), INDEX(($R$30:$R$60), MATCH(0, COUNTIF($U$29:U39, ($R$30:$R$60)), 0))), \"\")","v":""},{"$f":"IFERROR(IFERROR(INDEX(($S$30:$S$60), MATCH(0, COUNTIF($V$29:V39, ($S$30:$S$60)), 0)), INDEX(($T$30:$T$60), MATCH(0, COUNTIF($V$29:V39, ($T$30:$T$60)), 0))), \"\")","v":""},{"$f":"IFERROR(IFERROR(INDEX(($U$30:$U$60), MATCH(0, COUNTIF($W$29:W39, ($U$30:$U$60)), 0)), INDEX(($V$30:$V$60), MATCH(0, COUNTIF($W$29:W39, ($V$30:$V$60)), 0))), \"\")","v":""},{"$f":"IFERROR(INDEX((Data!$AT$33:$AX$82,Data!$AY$33:$BC$82,Data!$BD$33:$BH$82,Data!$BI$33:$BM$82,Data!$BN$33:$BR$82,Data!$BS$33:$BW$82,Data!$BX$33:$CB$82,Data!$CC$33:$CG$82,Data!$CH$33:$CL$82,Data!$CM$33:$CQ$82),$D40,2,CHOOSE(MATCH($Z$14,INDIRECT(\"Data!$AT$\"&$D40+32&\":$CM$\"&$D40+32),0),1,0,0,0,0,2,0,0,0,0,3,0,0,0,0,4,0,0,0,0,5,0,0,0,0,6,0,0,0,0,7,0,0,0,0,8,0,0,0,0,9,0,0,0,0,10)),\"\")","v":0},{"$f":"IFERROR(INDEX((Data!$AT$33:$AX$82,Data!$AY$33:$BC$82,Data!$BD$33:$BH$82,Data!$BI$33:$BM$82,Data!$BN$33:$BR$82,Data!$BS$33:$BW$82,Data!$BX$33:$CB$82,Data!$CC$33:$CG$82,Data!$CH$33:$CL$82,Data!$CM$33:$CQ$82),$D40,3,CHOOSE(MATCH($Z$14,INDIRECT(\"Data!$AT$\"&$D40+32&\":$CM$\"&$D40+32),0),1,0,0,0,0,2,0,0,0,0,3,0,0,0,0,4,0,0,0,0,5,0,0,0,0,6,0,0,0,0,7,0,0,0,0,8,0,0,0,0,9,0,0,0,0,10)),\"\")","v":0},{"$f":"IFERROR(INDEX((Data!$AT$33:$AX$82,Data!$AY$33:$BC$82,Data!$BD$33:$BH$82,Data!$BI$33:$BM$82,Data!$BN$33:$BR$82,Data!$BS$33:$BW$82,Data!$BX$33:$CB$82,Data!$CC$33:$CG$82,Data!$CH$33:$CL$82,Data!$CM$33:$CQ$82),$D40,4,CHOOSE(MATCH($Z$14,INDIRECT(\"Data!$AT$\"&$D40+32&\":$CM$\"&$D40+32),0),1,0,0,0,0,2,0,0,0,0,3,0,0,0,0,4,0,0,0,0,5,0,0,0,0,6,0,0,0,0,7,0,0,0,0,8,0,0,0,0,9,0,0,0,0,10)),\"\")","v":0},{"$f":"IFERROR(INDEX((Data!$AT$33:$AX$82,Data!$AY$33:$BC$82,Data!$BD$33:$BH$82,Data!$BI$33:$BM$82,Data!$BN$33:$BR$82,Data!$BS$33:$BW$82,Data!$BX$33:$CB$82,Data!$CC$33:$CG$82,Data!$CH$33:$CL$82,Data!$CM$33:$CQ$82),$D40,5,CHOOSE(MATCH($Z$14,INDIRECT(\"Data!$AT$\"&$D40+32&\":$CM$\"&$D40+32),0),1,0,0,0,0,2,0,0,0,0,3,0,0,0,0,4,0,0,0,0,5,0,0,0,0,6,0,0,0,0,7,0,0,0,0,8,0,0,0,0,9,0,0,0,0,10)),\"\")","v":0},0]
[null,{"$f":"'Report A'!$B43","v":"2014-07-12"},{"$f":"'Report A'!$C43","v":"Saturday"},{"$f":"'Report A'!$D43","v":12},"K-Lunch","LOK-LOK","Member 30%","Member Package","Tiger (2+1) Round","Student Member Card","Student Member Price",0,0,0,{"$f":"IFERROR(IFERROR(INDEX(($E$30:$E$60), MATCH(0, COUNTIF($O$29:O40, ($E$30:$E$60)), 0)), INDEX(($F$30:$F$60), MATCH(0, COUNTIF($O$29:O40, ($F$30:$F$60)), 0))), \"\")","v":""},{"$f":"IFERROR(IFERROR(INDEX(($G$30:$G$60), MATCH(0, COUNTIF($P$29:P40, ($G$30:$G$60)), 0)), INDEX(($H$30:$H$60), MATCH(0, COUNTIF($P$29:P40, ($H$30:$H$60)), 0))), \"\")","v":""},{"$f":"IFERROR(IFERROR(INDEX(($I$30:$I$60), MATCH(0, COUNTIF($Q$29:Q40, ($I$30:$I$60)), 0)), INDEX(($J$30:$J$60), MATCH(0, COUNTIF($Q$29:Q40, ($J$30:$J$60)), 0))), \"\")","v":""},{"$f":"IFERROR(IFERROR(INDEX(($K$30:$K$60), MATCH(0, COUNTIF($R$29:R40, ($K$30:$K$60)), 0)), INDEX(($L$30:$L$60), MATCH(0, COUNTIF($R$29:R40, ($L$30:$L$60)), 0))), \"\")","v":""},{"$f":"IFERROR(IFERROR(INDEX(($M$30:$M$60), MATCH(0, COUNTIF($S$29:S40, ($M$30:$M$60)), 0)), INDEX(($N$30:$N$60), MATCH(0, COUNTIF($S$29:S40, ($N$30:$N$60)), 0))), \"\")","v":""},{"$f":"IFERROR(IFERROR(INDEX(($O$30:$O$60), MATCH(0, COUNTIF($T$29:T40, ($O$30:$O$60)), 0)), INDEX(($P$30:$P$60), MATCH(0, COUNTIF($T$29:T40, ($P$30:$P$60)), 0))), \"\")","v":""},{"$f":"IFERROR(IFERROR(INDEX(($Q$30:$Q$60), MATCH(0, COUNTIF($U$29:U40, ($Q$30:$Q$60)), 0)), INDEX(($R$30:$R$60), MATCH(0, COUNTIF($U$29:U40, ($R$30:$R$60)), 0))), \"\")","v":""},{"$f":"IFERROR(IFERROR(INDEX(($S$30:$S$60), MATCH(0, COUNTIF($V$29:V40, ($S$30:$S$60)), 0)), INDEX(($T$30:$T$60), MATCH(0, COUNTIF($V$29:V40, ($T$30:$T$60)), 0))), \"\")","v":""},{"$f":"IFERROR(IFERROR(INDEX(($U$30:$U$60), MATCH(0, COUNTIF($W$29:W40, ($U$30:$U$60)), 0)), INDEX(($V$30:$V$60), MATCH(0, COUNTIF($W$29:W40, ($V$30:$V$60)), 0))), \"\")","v":""},{"$f":"IFERROR(INDEX((Data!$AT$33:$AX$82,Data!$AY$33:$BC$82,Data!$BD$33:$BH$82,Data!$BI$33:$BM$82,Data!$BN$33:$BR$82,Data!$BS$33:$BW$82,Data!$BX$33:$CB$82,Data!$CC$33:$CG$82,Data!$CH$33:$CL$82,Data!$CM$33:$CQ$82),$D41,2,CHOOSE(MATCH($Z$14,INDIRECT(\"Data!$AT$\"&$D41+32&\":$CM$\"&$D41+32),0),1,0,0,0,0,2,0,0,0,0,3,0,0,0,0,4,0,0,0,0,5,0,0,0,0,6,0,0,0,0,7,0,0,0,0,8,0,0,0,0,9,0,0,0,0,10)),\"\")","v":0},{"$f":"IFERROR(INDEX((Data!$AT$33:$AX$82,Data!$AY$33:$BC$82,Data!$BD$33:$BH$82,Data!$BI$33:$BM$82,Data!$BN$33:$BR$82,Data!$BS$33:$BW$82,Data!$BX$33:$CB$82,Data!$CC$33:$CG$82,Data!$CH$33:$CL$82,Data!$CM$33:$CQ$82),$D41,3,CHOOSE(MATCH($Z$14,INDIRECT(\"Data!$AT$\"&$D41+32&\":$CM$\"&$D41+32),0),1,0,0,0,0,2,0,0,0,0,3,0,0,0,0,4,0,0,0,0,5,0,0,0,0,6,0,0,0,0,7,0,0,0,0,8,0,0,0,0,9,0,0,0,0,10)),\"\")","v":0},{"$f":"IFERROR(INDEX((Data!$AT$33:$AX$82,Data!$AY$33:$BC$82,Data!$BD$33:$BH$82,Data!$BI$33:$BM$82,Data!$BN$33:$BR$82,Data!$BS$33:$BW$82,Data!$BX$33:$CB$82,Data!$CC$33:$CG$82,Data!$CH$33:$CL$82,Data!$CM$33:$CQ$82),$D41,4,CHOOSE(MATCH($Z$14,INDIRECT(\"Data!$AT$\"&$D41+32&\":$CM$\"&$D41+32),0),1,0,0,0,0,2,0,0,0,0,3,0,0,0,0,4,0,0,0,0,5,0,0,0,0,6,0,0,0,0,7,0,0,0,0,8,0,0,0,0,9,0,0,0,0,10)),\"\")","v":0},{"$f":"IFERROR(INDEX((Data!$AT$33:$AX$82,Data!$AY$33:$BC$82,Data!$BD$33:$BH$82,Data!$BI$33:$BM$82,Data!$BN$33:$BR$82,Data!$BS$33:$BW$82,Data!$BX$33:$CB$82,Data!$CC$33:$CG$82,Data!$CH$33:$CL$82,Data!$CM$33:$CQ$82),$D41,5,CHOOSE(MATCH($Z$14,INDIRECT(\"Data!$AT$\"&$D41+32&\":$CM$\"&$D41+32),0),1,0,0,0,0,2,0,0,0,0,3,0,0,0,0,4,0,0,0,0,5,0,0,0,0,6,0,0,0,0,7,0,0,0,0,8,0,0,0,0,9,0,0,0,0,10)),\"\")","v":0},0]
[null,{"$f":"'Report A'!$B44","v":"2014-07-13"},{"$f":"'Report A'!$C44","v":"Sunday"},{"$f":"'Report A'!$D44","v":13},"K-Lunch","LOK-LOK","Member 30%","Member Package","Tiger (2+1) Round","Student Member Card","Student Member Price",0,0,0,{"$f":"IFERROR(IFERROR(INDEX(($E$30:$E$60), MATCH(0, COUNTIF($O$29:O41, ($E$30:$E$60)), 0)), INDEX(($F$30:$F$60), MATCH(0, COUNTIF($O$29:O41, ($F$30:$F$60)), 0))), \"\")","v":""},{"$f":"IFERROR(IFERROR(INDEX(($G$30:$G$60), MATCH(0, COUNTIF($P$29:P41, ($G$30:$G$60)), 0)), INDEX(($H$30:$H$60), MATCH(0, COUNTIF($P$29:P41, ($H$30:$H$60)), 0))), \"\")","v":""},{"$f":"IFERROR(IFERROR(INDEX(($I$30:$I$60), MATCH(0, COUNTIF($Q$29:Q41, ($I$30:$I$60)), 0)), INDEX(($J$30:$J$60), MATCH(0, COUNTIF($Q$29:Q41, ($J$30:$J$60)), 0))), \"\")","v":""},{"$f":"IFERROR(IFERROR(INDEX(($K$30:$K$60), MATCH(0, COUNTIF($R$29:R41, ($K$30:$K$60)), 0)), INDEX(($L$30:$L$60), MATCH(0, COUNTIF($R$29:R41, ($L$30:$L$60)), 0))), \"\")","v":""},{"$f":"IFERROR(IFERROR(INDEX(($M$30:$M$60), MATCH(0, COUNTIF($S$29:S41, ($M$30:$M$60)), 0)), INDEX(($N$30:$N$60), MATCH(0, COUNTIF($S$29:S41, ($N$30:$N$60)), 0))), \"\")","v":""},{"$f":"IFERROR(IFERROR(INDEX(($O$30:$O$60), MATCH(0, COUNTIF($T$29:T41, ($O$30:$O$60)), 0)), INDEX(($P$30:$P$60), MATCH(0, COUNTIF($T$29:T41, ($P$30:$P$60)), 0))), \"\")","v":""},{"$f":"IFERROR(IFERROR(INDEX(($Q$30:$Q$60), MATCH(0, COUNTIF($U$29:U41, ($Q$30:$Q$60)), 0)), INDEX(($R$30:$R$60), MATCH(0, COUNTIF($U$29:U41, ($R$30:$R$60)), 0))), \"\")","v":""},{"$f":"IFERROR(IFERROR(INDEX(($S$30:$S$60), MATCH(0, COUNTIF($V$29:V41, ($S$30:$S$60)), 0)), INDEX(($T$30:$T$60), MATCH(0, COUNTIF($V$29:V41, ($T$30:$T$60)), 0))), \"\")","v":""},{"$f":"IFERROR(IFERROR(INDEX(($U$30:$U$60), MATCH(0, COUNTIF($W$29:W41, ($U$30:$U$60)), 0)), INDEX(($V$30:$V$60), MATCH(0, COUNTIF($W$29:W41, ($V$30:$V$60)), 0))), \"\")","v":""},{"$f":"IFERROR(INDEX((Data!$AT$33:$AX$82,Data!$AY$33:$BC$82,Data!$BD$33:$BH$82,Data!$BI$33:$BM$82,Data!$BN$33:$BR$82,Data!$BS$33:$BW$82,Data!$BX$33:$CB$82,Data!$CC$33:$CG$82,Data!$CH$33:$CL$82,Data!$CM$33:$CQ$82),$D42,2,CHOOSE(MATCH($Z$14,INDIRECT(\"Data!$AT$\"&$D42+32&\":$CM$\"&$D42+32),0),1,0,0,0,0,2,0,0,0,0,3,0,0,0,0,4,0,0,0,0,5,0,0,0,0,6,0,0,0,0,7,0,0,0,0,8,0,0,0,0,9,0,0,0,0,10)),\"\")","v":0},{"$f":"IFERROR(INDEX((Data!$AT$33:$AX$82,Data!$AY$33:$BC$82,Data!$BD$33:$BH$82,Data!$BI$33:$BM$82,Data!$BN$33:$BR$82,Data!$BS$33:$BW$82,Data!$BX$33:$CB$82,Data!$CC$33:$CG$82,Data!$CH$33:$CL$82,Data!$CM$33:$CQ$82),$D42,3,CHOOSE(MATCH($Z$14,INDIRECT(\"Data!$AT$\"&$D42+32&\":$CM$\"&$D42+32),0),1,0,0,0,0,2,0,0,0,0,3,0,0,0,0,4,0,0,0,0,5,0,0,0,0,6,0,0,0,0,7,0,0,0,0,8,0,0,0,0,9,0,0,0,0,10)),\"\")","v":0},{"$f":"IFERROR(INDEX((Data!$AT$33:$AX$82,Data!$AY$33:$BC$82,Data!$BD$33:$BH$82,Data!$BI$33:$BM$82,Data!$BN$33:$BR$82,Data!$BS$33:$BW$82,Data!$BX$33:$CB$82,Data!$CC$33:$CG$82,Data!$CH$33:$CL$82,Data!$CM$33:$CQ$82),$D42,4,CHOOSE(MATCH($Z$14,INDIRECT(\"Data!$AT$\"&$D42+32&\":$CM$\"&$D42+32),0),1,0,0,0,0,2,0,0,0,0,3,0,0,0,0,4,0,0,0,0,5,0,0,0,0,6,0,0,0,0,7,0,0,0,0,8,0,0,0,0,9,0,0,0,0,10)),\"\")","v":0},{"$f":"IFERROR(INDEX((Data!$AT$33:$AX$82,Data!$AY$33:$BC$82,Data!$BD$33:$BH$82,Data!$BI$33:$BM$82,Data!$BN$33:$BR$82,Data!$BS$33:$BW$82,Data!$BX$33:$CB$82,Data!$CC$33:$CG$82,Data!$CH$33:$CL$82,Data!$CM$33:$CQ$82),$D42,5,CHOOSE(MATCH($Z$14,INDIRECT(\"Data!$AT$\"&$D42+32&\":$CM$\"&$D42+32),0),1,0,0,0,0,2,0,0,0,0,3,0,0,0,0,4,0,0,0,0,5,0,0,0,0,6,0,0,0,0,7,0,0,0,0,8,0,0,0,0,9,0,0,0,0,10)),\"\")","v":0},0]
[null,{"$f":"'Report A'!$B45","v":"2014-07-14"},{"$f":"'Report A'!$C45","v":"Monday"},{"$f":"'Report A'!$D45","v":14},"K-Lunch","LOK-LOK","Member 30%","Member Package","Tiger (2+1) Round","Student Member Card","Student Member Price",0,0,0,{"$f":"IFERROR(IFERROR(INDEX(($E$30:$E$60), MATCH(0, COUNTIF($O$29:O42, ($E$30:$E$60)), 0)), INDEX(($F$30:$F$60), MATCH(0, COUNTIF($O$29:O42, ($F$30:$F$60)), 0))), \"\")","v":""},{"$f":"IFERROR(IFERROR(INDEX(($G$30:$G$60), MATCH(0, COUNTIF($P$29:P42, ($G$30:$G$60)), 0)), INDEX(($H$30:$H$60), MATCH(0, COUNTIF($P$29:P42, ($H$30:$H$60)), 0))), \"\")","v":""},{"$f":"IFERROR(IFERROR(INDEX(($I$30:$I$60), MATCH(0, COUNTIF($Q$29:Q42, ($I$30:$I$60)), 0)), INDEX(($J$30:$J$60), MATCH(0, COUNTIF($Q$29:Q42, ($J$30:$J$60)), 0))), \"\")","v":""},{"$f":"IFERROR(IFERROR(INDEX(($K$30:$K$60), MATCH(0, COUNTIF($R$29:R42, ($K$30:$K$60)), 0)), INDEX(($L$30:$L$60), MATCH(0, COUNTIF($R$29:R42, ($L$30:$L$60)), 0))), \"\")","v":""},{"$f":"IFERROR(IFERROR(INDEX(($M$30:$M$60), MATCH(0, COUNTIF($S$29:S42, ($M$30:$M$60)), 0)), INDEX(($N$30:$N$60), MATCH(0, COUNTIF($S$29:S42, ($N$30:$N$60)), 0))), \"\")","v":""},{"$f":"IFERROR(IFERROR(INDEX(($O$30:$O$60), MATCH(0, COUNTIF($T$29:T42, ($O$30:$O$60)), 0)), INDEX(($P$30:$P$60), MATCH(0, COUNTIF($T$29:T42, ($P$30:$P$60)), 0))), \"\")","v":""},{"$f":"IFERROR(IFERROR(INDEX(($Q$30:$Q$60), MATCH(0, COUNTIF($U$29:U42, ($Q$30:$Q$60)), 0)), INDEX(($R$30:$R$60), MATCH(0, COUNTIF($U$29:U42, ($R$30:$R$60)), 0))), \"\")","v":""},{"$f":"IFERROR(IFERROR(INDEX(($S$30:$S$60), MATCH(0, COUNTIF($V$29:V42, ($S$30:$S$60)), 0)), INDEX(($T$30:$T$60), MATCH(0, COUNTIF($V$29:V42, ($T$30:$T$60)), 0))), \"\")","v":""},{"$f":"IFERROR(IFERROR(INDEX(($U$30:$U$60), MATCH(0, COUNTIF($W$29:W42, ($U$30:$U$60)), 0)), INDEX(($V$30:$V$60), MATCH(0, COUNTIF($W$29:W42, ($V$30:$V$60)), 0))), \"\")","v":""},{"$f":"IFERROR(INDEX((Data!$AT$33:$AX$82,Data!$AY$33:$BC$82,Data!$BD$33:$BH$82,Data!$BI$33:$BM$82,Data!$BN$33:$BR$82,Data!$BS$33:$BW$82,Data!$BX$33:$CB$82,Data!$CC$33:$CG$82,Data!$CH$33:$CL$82,Data!$CM$33:$CQ$82),$D43,2,CHOOSE(MATCH($Z$14,INDIRECT(\"Data!$AT$\"&$D43+32&\":$CM$\"&$D43+32),0),1,0,0,0,0,2,0,0,0,0,3,0,0,0,0,4,0,0,0,0,5,0,0,0,0,6,0,0,0,0,7,0,0,0,0,8,0,0,0,0,9,0,0,0,0,10)),\"\")","v":0},{"$f":"IFERROR(INDEX((Data!$AT$33:$AX$82,Data!$AY$33:$BC$82,Data!$BD$33:$BH$82,Data!$BI$33:$BM$82,Data!$BN$33:$BR$82,Data!$BS$33:$BW$82,Data!$BX$33:$CB$82,Data!$CC$33:$CG$82,Data!$CH$33:$CL$82,Data!$CM$33:$CQ$82),$D43,3,CHOOSE(MATCH($Z$14,INDIRECT(\"Data!$AT$\"&$D43+32&\":$CM$\"&$D43+32),0),1,0,0,0,0,2,0,0,0,0,3,0,0,0,0,4,0,0,0,0,5,0,0,0,0,6,0,0,0,0,7,0,0,0,0,8,0,0,0,0,9,0,0,0,0,10)),\"\")","v":0},{"$f":"IFERROR(INDEX((Data!$AT$33:$AX$82,Data!$AY$33:$BC$82,Data!$BD$33:$BH$82,Data!$BI$33:$BM$82,Data!$BN$33:$BR$82,Data!$BS$33:$BW$82,Data!$BX$33:$CB$82,Data!$CC$33:$CG$82,Data!$CH$33:$CL$82,Data!$CM$33:$CQ$82),$D43,4,CHOOSE(MATCH($Z$14,INDIRECT(\"Data!$AT$\"&$D43+32&\":$CM$\"&$D43+32),0),1,0,0,0,0,2,0,0,0,0,3,0,0,0,0,4,0,0,0,0,5,0,0,0,0,6,0,0,0,0,7,0,0,0,0,8,0,0,0,0,9,0,0,0,0,10)),\"\")","v":0},{"$f":"IFERROR(INDEX((Data!$AT$33:$AX$82,Data!$AY$33:$BC$82,Data!$BD$33:$BH$82,Data!$BI$33:$BM$82,Data!$BN$33:$BR$82,Data!$BS$33:$BW$82,Data!$BX$33:$CB$82,Data!$CC$33:$CG$82,Data!$CH$33:$CL$82,Data!$CM$33:$CQ$82),$D43,5,CHOOSE(MATCH($Z$14,INDIRECT(\"Data!$AT$\"&$D43+32&\":$CM$\"&$D43+32),0),1,0,0,0,0,2,0,0,0,0,3,0,0,0,0,4,0,0,0,0,5,0,0,0,0,6,0,0,0,0,7,0,0,0,0,8,0,0,0,0,9,0,0,0,0,10)),\"\")","v":0},0]
[null,{"$f":"'Report A'!$B46","v":"2014-07-15"},{"$f":"'Report A'!$C46","v":"Tuesday"},{"$f":"'Report A'!$D46","v":15},"K-Lunch","LOK-LOK","Member 30%","Member Package","Tiger (2+1) Round","Student Member Card","Student Member Price",0,0,0,{"$f":"IFERROR(IFERROR(INDEX(($E$30:$E$60), MATCH(0, COUNTIF($O$29:O43, ($E$30:$E$60)), 0)), INDEX(($F$30:$F$60), MATCH(0, COUNTIF($O$29:O43, ($F$30:$F$60)), 0))), \"\")","v":""},{"$f":"IFERROR(IFERROR(INDEX(($G$30:$G$60), MATCH(0, COUNTIF($P$29:P43, ($G$30:$G$60)), 0)), INDEX(($H$30:$H$60), MATCH(0, COUNTIF($P$29:P43, ($H$30:$H$60)), 0))), \"\")","v":""},{"$f":"IFERROR(IFERROR(INDEX(($I$30:$I$60), MATCH(0, COUNTIF($Q$29:Q43, ($I$30:$I$60)), 0)), INDEX(($J$30:$J$60), MATCH(0, COUNTIF($Q$29:Q43, ($J$30:$J$60)), 0))), \"\")","v":""},{"$f":"IFERROR(IFERROR(INDEX(($K$30:$K$60), MATCH(0, COUNTIF($R$29:R43, ($K$30:$K$60)), 0)), INDEX(($L$30:$L$60), MATCH(0, COUNTIF($R$29:R43, ($L$30:$L$60)), 0))), \"\")","v":""},{"$f":"IFERROR(IFERROR(INDEX(($M$30:$M$60), MATCH(0, COUNTIF($S$29:S43, ($M$30:$M$60)), 0)), INDEX(($N$30:$N$60), MATCH(0, COUNTIF($S$29:S43, ($N$30:$N$60)), 0))), \"\")","v":""},{"$f":"IFERROR(IFERROR(INDEX(($O$30:$O$60), MATCH(0, COUNTIF($T$29:T43, ($O$30:$O$60)), 0)), INDEX(($P$30:$P$60), MATCH(0, COUNTIF($T$29:T43, ($P$30:$P$60)), 0))), \"\")","v":""},{"$f":"IFERROR(IFERROR(INDEX(($Q$30:$Q$60), MATCH(0, COUNTIF($U$29:U43, ($Q$30:$Q$60)), 0)), INDEX(($R$30:$R$60), MATCH(0, COUNTIF($U$29:U43, ($R$30:$R$60)), 0))), \"\")","v":""},{"$f":"IFERROR(IFERROR(INDEX(($S$30:$S$60), MATCH(0, COUNTIF($V$29:V43, ($S$30:$S$60)), 0)), INDEX(($T$30:$T$60), MATCH(0, COUNTIF($V$29:V43, ($T$30:$T$60)), 0))), \"\")","v":""},{"$f":"IFERROR(IFERROR(INDEX(($U$30:$U$60), MATCH(0, COUNTIF($W$29:W43, ($U$30:$U$60)), 0)), INDEX(($V$30:$V$60), MATCH(0, COUNTIF($W$29:W43, ($V$30:$V$60)), 0))), \"\")","v":""},{"$f":"IFERROR(INDEX((Data!$AT$33:$AX$82,Data!$AY$33:$BC$82,Data!$BD$33:$BH$82,Data!$BI$33:$BM$82,Data!$BN$33:$BR$82,Data!$BS$33:$BW$82,Data!$BX$33:$CB$82,Data!$CC$33:$CG$82,Data!$CH$33:$CL$82,Data!$CM$33:$CQ$82),$D44,2,CHOOSE(MATCH($Z$14,INDIRECT(\"Data!$AT$\"&$D44+32&\":$CM$\"&$D44+32),0),1,0,0,0,0,2,0,0,0,0,3,0,0,0,0,4,0,0,0,0,5,0,0,0,0,6,0,0,0,0,7,0,0,0,0,8,0,0,0,0,9,0,0,0,0,10)),\"\")","v":0},{"$f":"IFERROR(INDEX((Data!$AT$33:$AX$82,Data!$AY$33:$BC$82,Data!$BD$33:$BH$82,Data!$BI$33:$BM$82,Data!$BN$33:$BR$82,Data!$BS$33:$BW$82,Data!$BX$33:$CB$82,Data!$CC$33:$CG$82,Data!$CH$33:$CL$82,Data!$CM$33:$CQ$82),$D44,3,CHOOSE(MATCH($Z$14,INDIRECT(\"Data!$AT$\"&$D44+32&\":$CM$\"&$D44+32),0),1,0,0,0,0,2,0,0,0,0,3,0,0,0,0,4,0,0,0,0,5,0,0,0,0,6,0,0,0,0,7,0,0,0,0,8,0,0,0,0,9,0,0,0,0,10)),\"\")","v":0},{"$f":"IFERROR(INDEX((Data!$AT$33:$AX$82,Data!$AY$33:$BC$82,Data!$BD$33:$BH$82,Data!$BI$33:$BM$82,Data!$BN$33:$BR$82,Data!$BS$33:$BW$82,Data!$BX$33:$CB$82,Data!$CC$33:$CG$82,Data!$CH$33:$CL$82,Data!$CM$33:$CQ$82),$D44,4,CHOOSE(MATCH($Z$14,INDIRECT(\"Data!$AT$\"&$D44+32&\":$CM$\"&$D44+32),0),1,0,0,0,0,2,0,0,0,0,3,0,0,0,0,4,0,0,0,0,5,0,0,0,0,6,0,0,0,0,7,0,0,0,0,8,0,0,0,0,9,0,0,0,0,10)),\"\")","v":0},{"$f":"IFERROR(INDEX((Data!$AT$33:$AX$82,Data!$AY$33:$BC$82,Data!$BD$33:$BH$82,Data!$BI$33:$BM$82,Data!$BN$33:$BR$82,Data!$BS$33:$BW$82,Data!$BX$33:$CB$82,Data!$CC$33:$CG$82,Data!$CH$33:$CL$82,Data!$CM$33:$CQ$82),$D44,5,CHOOSE(MATCH($Z$14,INDIRECT(\"Data!$AT$\"&$D44+32&\":$CM$\"&$D44+32),0),1,0,0,0,0,2,0,0,0,0,3,0,0,0,0,4,0,0,0,0,5,0,0,0,0,6,0,0,0,0,7,0,0,0,0,8,0,0,0,0,9,0,0,0,0,10)),\"\")","v":0},0]
[null,{"$f":"'Report A'!$B47","v":"2014-07-16"},{"$f":"'Report A'!$C47","v":"Wednesday"},{"$f":"'Report A'!$D47","v":16},"K-Lunch","LOK-LOK","Member 30%","Member Package","Tiger (2+1) Round","Student Member Card","Student Member Price",0,0,0,{"$f":"IFERROR(IFERROR(INDEX(($E$30:$E$60), MATCH(0, COUNTIF($O$29:O44, ($E$30:$E$60)), 0)), INDEX(($F$30:$F$60), MATCH(0, COUNTIF($O$29:O44, ($F$30:$F$60)), 0))), \"\")","v":""},{"$f":"IFERROR(IFERROR(INDEX(($G$30:$G$60), MATCH(0, COUNTIF($P$29:P44, ($G$30:$G$60)), 0)), INDEX(($H$30:$H$60), MATCH(0, COUNTIF($P$29:P44, ($H$30:$H$60)), 0))), \"\")","v":""},{"$f":"IFERROR(IFERROR(INDEX(($I$30:$I$60), MATCH(0, COUNTIF($Q$29:Q44, ($I$30:$I$60)), 0)), INDEX(($J$30:$J$60), MATCH(0, COUNTIF($Q$29:Q44, ($J$30:$J$60)), 0))), \"\")","v":""},{"$f":"IFERROR(IFERROR(INDEX(($K$30:$K$60), MATCH(0, COUNTIF($R$29:R44, ($K$30:$K$60)), 0)), INDEX(($L$30:$L$60), MATCH(0, COUNTIF($R$29:R44, ($L$30:$L$60)), 0))), \"\")","v":""},{"$f":"IFERROR(IFERROR(INDEX(($M$30:$M$60), MATCH(0, COUNTIF($S$29:S44, ($M$30:$M$60)), 0)), INDEX(($N$30:$N$60), MATCH(0, COUNTIF($S$29:S44, ($N$30:$N$60)), 0))), \"\")","v":""},{"$f":"IFERROR(IFERROR(INDEX(($O$30:$O$60), MATCH(0, COUNTIF($T$29:T44, ($O$30:$O$60)), 0)), INDEX(($P$30:$P$60), MATCH(0, COUNTIF($T$29:T44, ($P$30:$P$60)), 0))), \"\")","v":""},{"$f":"IFERROR(IFERROR(INDEX(($Q$30:$Q$60), MATCH(0, COUNTIF($U$29:U44, ($Q$30:$Q$60)), 0)), INDEX(($R$30:$R$60), MATCH(0, COUNTIF($U$29:U44, ($R$30:$R$60)), 0))), \"\")","v":""},{"$f":"IFERROR(IFERROR(INDEX(($S$30:$S$60), MATCH(0, COUNTIF($V$29:V44, ($S$30:$S$60)), 0)), INDEX(($T$30:$T$60), MATCH(0, COUNTIF($V$29:V44, ($T$30:$T$60)), 0))), \"\")","v":""},{"$f":"IFERROR(IFERROR(INDEX(($U$30:$U$60), MATCH(0, COUNTIF($W$29:W44, ($U$30:$U$60)), 0)), INDEX(($V$30:$V$60), MATCH(0, COUNTIF($W$29:W44, ($V$30:$V$60)), 0))), \"\")","v":""},{"$f":"IFERROR(INDEX((Data!$AT$33:$AX$82,Data!$AY$33:$BC$82,Data!$BD$33:$BH$82,Data!$BI$33:$BM$82,Data!$BN$33:$BR$82,Data!$BS$33:$BW$82,Data!$BX$33:$CB$82,Data!$CC$33:$CG$82,Data!$CH$33:$CL$82,Data!$CM$33:$CQ$82),$D45,2,CHOOSE(MATCH($Z$14,INDIRECT(\"Data!$AT$\"&$D45+32&\":$CM$\"&$D45+32),0),1,0,0,0,0,2,0,0,0,0,3,0,0,0,0,4,0,0,0,0,5,0,0,0,0,6,0,0,0,0,7,0,0,0,0,8,0,0,0,0,9,0,0,0,0,10)),\"\")","v":0},{"$f":"IFERROR(INDEX((Data!$AT$33:$AX$82,Data!$AY$33:$BC$82,Data!$BD$33:$BH$82,Data!$BI$33:$BM$82,Data!$BN$33:$BR$82,Data!$BS$33:$BW$82,Data!$BX$33:$CB$82,Data!$CC$33:$CG$82,Data!$CH$33:$CL$82,Data!$CM$33:$CQ$82),$D45,3,CHOOSE(MATCH($Z$14,INDIRECT(\"Data!$AT$\"&$D45+32&\":$CM$\"&$D45+32),0),1,0,0,0,0,2,0,0,0,0,3,0,0,0,0,4,0,0,0,0,5,0,0,0,0,6,0,0,0,0,7,0,0,0,0,8,0,0,0,0,9,0,0,0,0,10)),\"\")","v":0},{"$f":"IFERROR(INDEX((Data!$AT$33:$AX$82,Data!$AY$33:$BC$82,Data!$BD$33:$BH$82,Data!$BI$33:$BM$82,Data!$BN$33:$BR$82,Data!$BS$33:$BW$82,Data!$BX$33:$CB$82,Data!$CC$33:$CG$82,Data!$CH$33:$CL$82,Data!$CM$33:$CQ$82),$D45,4,CHOOSE(MATCH($Z$14,INDIRECT(\"Data!$AT$\"&$D45+32&\":$CM$\"&$D45+32),0),1,0,0,0,0,2,0,0,0,0,3,0,0,0,0,4,0,0,0,0,5,0,0,0,0,6,0,0,0,0,7,0,0,0,0,8,0,0,0,0,9,0,0,0,0,10)),\"\")","v":5},{"$f":"IFERROR(INDEX((Data!$AT$33:$AX$82,Data!$AY$33:$BC$82,Data!$BD$33:$BH$82,Data!$BI$33:$BM$82,Data!$BN$33:$BR$82,Data!$BS$33:$BW$82,Data!$BX$33:$CB$82,Data!$CC$33:$CG$82,Data!$CH$33:$CL$82,Data!$CM$33:$CQ$82),$D45,5,CHOOSE(MATCH($Z$14,INDIRECT(\"Data!$AT$\"&$D45+32&\":$CM$\"&$D45+32),0),1,0,0,0,0,2,0,0,0,0,3,0,0,0,0,4,0,0,0,0,5,0,0,0,0,6,0,0,0,0,7,0,0,0,0,8,0,0,0,0,9,0,0,0,0,10)),\"\")","v":0},5]
[null,{"$f":"'Report A'!$B48","v":"2014-07-17"},{"$f":"'Report A'!$C48","v":"Thursday"},{"$f":"'Report A'!$D48","v":17},"K-Lunch","LOK-LOK","Member 30%","Member Package","Tiger (2+1) Round","Student Member Card","Student Member Price",0,0,0,{"$f":"IFERROR(IFERROR(INDEX(($E$30:$E$60), MATCH(0, COUNTIF($O$29:O45, ($E$30:$E$60)), 0)), INDEX(($F$30:$F$60), MATCH(0, COUNTIF($O$29:O45, ($F$30:$F$60)), 0))), \"\")","v":""},{"$f":"IFERROR(IFERROR(INDEX(($G$30:$G$60), MATCH(0, COUNTIF($P$29:P45, ($G$30:$G$60)), 0)), INDEX(($H$30:$H$60), MATCH(0, COUNTIF($P$29:P45, ($H$30:$H$60)), 0))), \"\")","v":""},{"$f":"IFERROR(IFERROR(INDEX(($I$30:$I$60), MATCH(0, COUNTIF($Q$29:Q45, ($I$30:$I$60)), 0)), INDEX(($J$30:$J$60), MATCH(0, COUNTIF($Q$29:Q45, ($J$30:$J$60)), 0))), \"\")","v":""},{"$f":"IFERROR(IFERROR(INDEX(($K$30:$K$60), MATCH(0, COUNTIF($R$29:R45, ($K$30:$K$60)), 0)), INDEX(($L$30:$L$60), MATCH(0, COUNTIF($R$29:R45, ($L$30:$L$60)), 0))), \"\")","v":""},{"$f":"IFERROR(IFERROR(INDEX(($M$30:$M$60), MATCH(0, COUNTIF($S$29:S45, ($M$30:$M$60)), 0)), INDEX(($N$30:$N$60), MATCH(0, COUNTIF($S$29:S45, ($N$30:$N$60)), 0))), \"\")","v":""},{"$f":"IFERROR(IFERROR(INDEX(($O$30:$O$60), MATCH(0, COUNTIF($T$29:T45, ($O$30:$O$60)), 0)), INDEX(($P$30:$P$60), MATCH(0, COUNTIF($T$29:T45, ($P$30:$P$60)), 0))), \"\")","v":""},{"$f":"IFERROR(IFERROR(INDEX(($Q$30:$Q$60), MATCH(0, COUNTIF($U$29:U45, ($Q$30:$Q$60)), 0)), INDEX(($R$30:$R$60), MATCH(0, COUNTIF($U$29:U45, ($R$30:$R$60)), 0))), \"\")","v":""},{"$f":"IFERROR(IFERROR(INDEX(($S$30:$S$60), MATCH(0, COUNTIF($V$29:V45, ($S$30:$S$60)), 0)), INDEX(($T$30:$T$60), MATCH(0, COUNTIF($V$29:V45, ($T$30:$T$60)), 0))), \"\")","v":""},{"$f":"IFERROR(IFERROR(INDEX(($U$30:$U$60), MATCH(0, COUNTIF($W$29:W45, ($U$30:$U$60)), 0)), INDEX(($V$30:$V$60), MATCH(0, COUNTIF($W$29:W45, ($V$30:$V$60)), 0))), \"\")","v":""},{"$f":"IFERROR(INDEX((Data!$AT$33:$AX$82,Data!$AY$33:$BC$82,Data!$BD$33:$BH$82,Data!$BI$33:$BM$82,Data!$BN$33:$BR$82,Data!$BS$33:$BW$82,Data!$BX$33:$CB$82,Data!$CC$33:$CG$82,Data!$CH$33:$CL$82,Data!$CM$33:$CQ$82),$D46,2,CHOOSE(MATCH($Z$14,INDIRECT(\"Data!$AT$\"&$D46+32&\":$CM$\"&$D46+32),0),1,0,0,0,0,2,0,0,0,0,3,0,0,0,0,4,0,0,0,0,5,0,0,0,0,6,0,0,0,0,7,0,0,0,0,8,0,0,0,0,9,0,0,0,0,10)),\"\")","v":0},{"$f":"IFERROR(INDEX((Data!$AT$33:$AX$82,Data!$AY$33:$BC$82,Data!$BD$33:$BH$82,Data!$BI$33:$BM$82,Data!$BN$33:$BR$82,Data!$BS$33:$BW$82,Data!$BX$33:$CB$82,Data!$CC$33:$CG$82,Data!$CH$33:$CL$82,Data!$CM$33:$CQ$82),$D46,3,CHOOSE(MATCH($Z$14,INDIRECT(\"Data!$AT$\"&$D46+32&\":$CM$\"&$D46+32),0),1,0,0,0,0,2,0,0,0,0,3,0,0,0,0,4,0,0,0,0,5,0,0,0,0,6,0,0,0,0,7,0,0,0,0,8,0,0,0,0,9,0,0,0,0,10)),\"\")","v":0},{"$f":"IFERROR(INDEX((Data!$AT$33:$AX$82,Data!$AY$33:$BC$82,Data!$BD$33:$BH$82,Data!$BI$33:$BM$82,Data!$BN$33:$BR$82,Data!$BS$33:$BW$82,Data!$BX$33:$CB$82,Data!$CC$33:$CG$82,Data!$CH$33:$CL$82,Data!$CM$33:$CQ$82),$D46,4,CHOOSE(MATCH($Z$14,INDIRECT(\"Data!$AT$\"&$D46+32&\":$CM$\"&$D46+32),0),1,0,0,0,0,2,0,0,0,0,3,0,0,0,0,4,0,0,0,0,5,0,0,0,0,6,0,0,0,0,7,0,0,0,0,8,0,0,0,0,9,0,0,0,0,10)),\"\")","v":0},{"$f":"IFERROR(INDEX((Data!$AT$33:$AX$82,Data!$AY$33:$BC$82,Data!$BD$33:$BH$82,Data!$BI$33:$BM$82,Data!$BN$33:$BR$82,Data!$BS$33:$BW$82,Data!$BX$33:$CB$82,Data!$CC$33:$CG$82,Data!$CH$33:$CL$82,Data!$CM$33:$CQ$82),$D46,5,CHOOSE(MATCH($Z$14,INDIRECT(\"Data!$AT$\"&$D46+32&\":$CM$\"&$D46+32),0),1,0,0,0,0,2,0,0,0,0,3,0,0,0,0,4,0,0,0,0,5,0,0,0,0,6,0,0,0,0,7,0,0,0,0,8,0,0,0,0,9,0,0,0,0,10)),\"\")","v":0},0]
[null,{"$f":"'Report A'!$B49","v":"2014-07-18"},{"$f":"'Report A'!$C49","v":"Friday"},{"$f":"'Report A'!$D49","v":18},"K-Lunch","LOK-LOK","Member 30%","Member Package","Tiger (2+1) Round","Student Member Card","Student Member Price",0,0,0,{"$f":"IFERROR(IFERROR(INDEX(($E$30:$E$60), MATCH(0, COUNTIF($O$29:O46, ($E$30:$E$60)), 0)), INDEX(($F$30:$F$60), MATCH(0, COUNTIF($O$29:O46, ($F$30:$F$60)), 0))), \"\")","v":""},{"$f":"IFERROR(IFERROR(INDEX(($G$30:$G$60), MATCH(0, COUNTIF($P$29:P46, ($G$30:$G$60)), 0)), INDEX(($H$30:$H$60), MATCH(0, COUNTIF($P$29:P46, ($H$30:$H$60)), 0))), \"\")","v":""},{"$f":"IFERROR(IFERROR(INDEX(($I$30:$I$60), MATCH(0, COUNTIF($Q$29:Q46, ($I$30:$I$60)), 0)), INDEX(($J$30:$J$60), MATCH(0, COUNTIF($Q$29:Q46, ($J$30:$J$60)), 0))), \"\")","v":""},{"$f":"IFERROR(IFERROR(INDEX(($K$30:$K$60), MATCH(0, COUNTIF($R$29:R46, ($K$30:$K$60)), 0)), INDEX(($L$30:$L$60), MATCH(0, COUNTIF($R$29:R46, ($L$30:$L$60)), 0))), \"\")","v":""},{"$f":"IFERROR(IFERROR(INDEX(($M$30:$M$60), MATCH(0, COUNTIF($S$29:S46, ($M$30:$M$60)), 0)), INDEX(($N$30:$N$60), MATCH(0, COUNTIF($S$29:S46, ($N$30:$N$60)), 0))), \"\")","v":""},{"$f":"IFERROR(IFERROR(INDEX(($O$30:$O$60), MATCH(0, COUNTIF($T$29:T46, ($O$30:$O$60)), 0)), INDEX(($P$30:$P$60), MATCH(0, COUNTIF($T$29:T46, ($P$30:$P$60)), 0))), \"\")","v":""},{"$f":"IFERROR(IFERROR(INDEX(($Q$30:$Q$60), MATCH(0, COUNTIF($U$29:U46, ($Q$30:$Q$60)), 0)), INDEX(($R$30:$R$60), MATCH(0, COUNTIF($U$29:U46, ($R$30:$R$60)), 0))), \"\")","v":""},{"$f":"IFERROR(IFERROR(INDEX(($S$30:$S$60), MATCH(0, COUNTIF($V$29:V46, ($S$30:$S$60)), 0)), INDEX(($T$30:$T$60), MATCH(0, COUNTIF($V$29:V46, ($T$30:$T$60)), 0))), \"\")","v":""},{"$f":"IFERROR(IFERROR(INDEX(($U$30:$U$60), MATCH(0, COUNTIF($W$29:W46, ($U$30:$U$60)), 0)), INDEX(($V$30:$V$60), MATCH(0, COUNTIF($W$29:W46, ($V$30:$V$60)), 0))), \"\")","v":""},{"$f":"IFERROR(INDEX((Data!$AT$33:$AX$82,Data!$AY$33:$BC$82,Data!$BD$33:$BH$82,Data!$BI$33:$BM$82,Data!$BN$33:$BR$82,Data!$BS$33:$BW$82,Data!$BX$33:$CB$82,Data!$CC$33:$CG$82,Data!$CH$33:$CL$82,Data!$CM$33:$CQ$82),$D47,2,CHOOSE(MATCH($Z$14,INDIRECT(\"Data!$AT$\"&$D47+32&\":$CM$\"&$D47+32),0),1,0,0,0,0,2,0,0,0,0,3,0,0,0,0,4,0,0,0,0,5,0,0,0,0,6,0,0,0,0,7,0,0,0,0,8,0,0,0,0,9,0,0,0,0,10)),\"\")","v":0},{"$f":"IFERROR(INDEX((Data!$AT$33:$AX$82,Data!$AY$33:$BC$82,Data!$BD$33:$BH$82,Data!$BI$33:$BM$82,Data!$BN$33:$BR$82,Data!$BS$33:$BW$82,Data!$BX$33:$CB$82,Data!$CC$33:$CG$82,Data!$CH$33:$CL$82,Data!$CM$33:$CQ$82),$D47,3,CHOOSE(MATCH($Z$14,INDIRECT(\"Data!$AT$\"&$D47+32&\":$CM$\"&$D47+32),0),1,0,0,0,0,2,0,0,0,0,3,0,0,0,0,4,0,0,0,0,5,0,0,0,0,6,0,0,0,0,7,0,0,0,0,8,0,0,0,0,9,0,0,0,0,10)),\"\")","v":0},{"$f":"IFERROR(INDEX((Data!$AT$33:$AX$82,Data!$AY$33:$BC$82,Data!$BD$33:$BH$82,Data!$BI$33:$BM$82,Data!$BN$33:$BR$82,Data!$BS$33:$BW$82,Data!$BX$33:$CB$82,Data!$CC$33:$CG$82,Data!$CH$33:$CL$82,Data!$CM$33:$CQ$82),$D47,4,CHOOSE(MATCH($Z$14,INDIRECT(\"Data!$AT$\"&$D47+32&\":$CM$\"&$D47+32),0),1,0,0,0,0,2,0,0,0,0,3,0,0,0,0,4,0,0,0,0,5,0,0,0,0,6,0,0,0,0,7,0,0,0,0,8,0,0,0,0,9,0,0,0,0,10)),\"\")","v":0},{"$f":"IFERROR(INDEX((Data!$AT$33:$AX$82,Data!$AY$33:$BC$82,Data!$BD$33:$BH$82,Data!$BI$33:$BM$82,Data!$BN$33:$BR$82,Data!$BS$33:$BW$82,Data!$BX$33:$CB$82,Data!$CC$33:$CG$82,Data!$CH$33:$CL$82,Data!$CM$33:$CQ$82),$D47,5,CHOOSE(MATCH($Z$14,INDIRECT(\"Data!$AT$\"&$D47+32&\":$CM$\"&$D47+32),0),1,0,0,0,0,2,0,0,0,0,3,0,0,0,0,4,0,0,0,0,5,0,0,0,0,6,0,0,0,0,7,0,0,0,0,8,0,0,0,0,9,0,0,0,0,10)),\"\")","v":0},0]
[null,{"$f":"'Report A'!$B50","v":"2014-07-19"},{"$f":"'Report A'!$C50","v":"Saturday"},{"$f":"'Report A'!$D50","v":19},"K-Lunch","LOK-LOK","Member 30%","Member Package","Tiger (2+1) Round","Student Member Card","Student Member Price",0,0,0,{"$f":"IFERROR(IFERROR(INDEX(($E$30:$E$60), MATCH(0, COUNTIF($O$29:O47, ($E$30:$E$60)), 0)), INDEX(($F$30:$F$60), MATCH(0, COUNTIF($O$29:O47, ($F$30:$F$60)), 0))), \"\")","v":""},{"$f":"IFERROR(IFERROR(INDEX(($G$30:$G$60), MATCH(0, COUNTIF($P$29:P47, ($G$30:$G$60)), 0)), INDEX(($H$30:$H$60), MATCH(0, COUNTIF($P$29:P47, ($H$30:$H$60)), 0))), \"\")","v":""},{"$f":"IFERROR(IFERROR(INDEX(($I$30:$I$60), MATCH(0, COUNTIF($Q$29:Q47, ($I$30:$I$60)), 0)), INDEX(($J$30:$J$60), MATCH(0, COUNTIF($Q$29:Q47, ($J$30:$J$60)), 0))), \"\")","v":""},{"$f":"IFERROR(IFERROR(INDEX(($K$30:$K$60), MATCH(0, COUNTIF($R$29:R47, ($K$30:$K$60)), 0)), INDEX(($L$30:$L$60), MATCH(0, COUNTIF($R$29:R47, ($L$30:$L$60)), 0))), \"\")","v":""},{"$f":"IFERROR(IFERROR(INDEX(($M$30:$M$60), MATCH(0, COUNTIF($S$29:S47, ($M$30:$M$60)), 0)), INDEX(($N$30:$N$60), MATCH(0, COUNTIF($S$29:S47, ($N$30:$N$60)), 0))), \"\")","v":""},{"$f":"IFERROR(IFERROR(INDEX(($O$30:$O$60), MATCH(0, COUNTIF($T$29:T47, ($O$30:$O$60)), 0)), INDEX(($P$30:$P$60), MATCH(0, COUNTIF($T$29:T47, ($P$30:$P$60)), 0))), \"\")","v":""},{"$f":"IFERROR(IFERROR(INDEX(($Q$30:$Q$60), MATCH(0, COUNTIF($U$29:U47, ($Q$30:$Q$60)), 0)), INDEX(($R$30:$R$60), MATCH(0, COUNTIF($U$29:U47, ($R$30:$R$60)), 0))), \"\")","v":""},{"$f":"IFERROR(IFERROR(INDEX(($S$30:$S$60), MATCH(0, COUNTIF($V$29:V47, ($S$30:$S$60)), 0)), INDEX(($T$30:$T$60), MATCH(0, COUNTIF($V$29:V47, ($T$30:$T$60)), 0))), \"\")","v":""},{"$f":"IFERROR(IFERROR(INDEX(($U$30:$U$60), MATCH(0, COUNTIF($W$29:W47, ($U$30:$U$60)), 0)), INDEX(($V$30:$V$60), MATCH(0, COUNTIF($W$29:W47, ($V$30:$V$60)), 0))), \"\")","v":""},{"$f":"IFERROR(INDEX((Data!$AT$33:$AX$82,Data!$AY$33:$BC$82,Data!$BD$33:$BH$82,Data!$BI$33:$BM$82,Data!$BN$33:$BR$82,Data!$BS$33:$BW$82,Data!$BX$33:$CB$82,Data!$CC$33:$CG$82,Data!$CH$33:$CL$82,Data!$CM$33:$CQ$82),$D48,2,CHOOSE(MATCH($Z$14,INDIRECT(\"Data!$AT$\"&$D48+32&\":$CM$\"&$D48+32),0),1,0,0,0,0,2,0,0,0,0,3,0,0,0,0,4,0,0,0,0,5,0,0,0,0,6,0,0,0,0,7,0,0,0,0,8,0,0,0,0,9,0,0,0,0,10)),\"\")","v":0},{"$f":"IFERROR(INDEX((Data!$AT$33:$AX$82,Data!$AY$33:$BC$82,Data!$BD$33:$BH$82,Data!$BI$33:$BM$82,Data!$BN$33:$BR$82,Data!$BS$33:$BW$82,Data!$BX$33:$CB$82,Data!$CC$33:$CG$82,Data!$CH$33:$CL$82,Data!$CM$33:$CQ$82),$D48,3,CHOOSE(MATCH($Z$14,INDIRECT(\"Data!$AT$\"&$D48+32&\":$CM$\"&$D48+32),0),1,0,0,0,0,2,0,0,0,0,3,0,0,0,0,4,0,0,0,0,5,0,0,0,0,6,0,0,0,0,7,0,0,0,0,8,0,0,0,0,9,0,0,0,0,10)),\"\")","v":0},{"$f":"IFERROR(INDEX((Data!$AT$33:$AX$82,Data!$AY$33:$BC$82,Data!$BD$33:$BH$82,Data!$BI$33:$BM$82,Data!$BN$33:$BR$82,Data!$BS$33:$BW$82,Data!$BX$33:$CB$82,Data!$CC$33:$CG$82,Data!$CH$33:$CL$82,Data!$CM$33:$CQ$82),$D48,4,CHOOSE(MATCH($Z$14,INDIRECT(\"Data!$AT$\"&$D48+32&\":$CM$\"&$D48+32),0),1,0,0,0,0,2,0,0,0,0,3,0,0,0,0,4,0,0,0,0,5,0,0,0,0,6,0,0,0,0,7,0,0,0,0,8,0,0,0,0,9,0,0,0,0,10)),\"\")","v":0},{"$f":"IFERROR(INDEX((Data!$AT$33:$AX$82,Data!$AY$33:$BC$82,Data!$BD$33:$BH$82,Data!$BI$33:$BM$82,Data!$BN$33:$BR$82,Data!$BS$33:$BW$82,Data!$BX$33:$CB$82,Data!$CC$33:$CG$82,Data!$CH$33:$CL$82,Data!$CM$33:$CQ$82),$D48,5,CHOOSE(MATCH($Z$14,INDIRECT(\"Data!$AT$\"&$D48+32&\":$CM$\"&$D48+32),0),1,0,0,0,0,2,0,0,0,0,3,0,0,0,0,4,0,0,0,0,5,0,0,0,0,6,0,0,0,0,7,0,0,0,0,8,0,0,0,0,9,0,0,0,0,10)),\"\")","v":0},0]
[null,{"$f":"'Report A'!$B51","v":"2014-07-20"},{"$f":"'Report A'!$C51","v":"Sunday"},{"$f":"'Report A'!$D51","v":20},"K-Lunch","LOK-LOK","Member 30%","Member Package","Tiger (2+1) Round","Student Member Card","Student Member Price",0,0,0,{"$f":"IFERROR(IFERROR(INDEX(($E$30:$E$60), MATCH(0, COUNTIF($O$29:O48, ($E$30:$E$60)), 0)), INDEX(($F$30:$F$60), MATCH(0, COUNTIF($O$29:O48, ($F$30:$F$60)), 0))), \"\")","v":""},{"$f":"IFERROR(IFERROR(INDEX(($G$30:$G$60), MATCH(0, COUNTIF($P$29:P48, ($G$30:$G$60)), 0)), INDEX(($H$30:$H$60), MATCH(0, COUNTIF($P$29:P48, ($H$30:$H$60)), 0))), \"\")","v":""},{"$f":"IFERROR(IFERROR(INDEX(($I$30:$I$60), MATCH(0, COUNTIF($Q$29:Q48, ($I$30:$I$60)), 0)), INDEX(($J$30:$J$60), MATCH(0, COUNTIF($Q$29:Q48, ($J$30:$J$60)), 0))), \"\")","v":""},{"$f":"IFERROR(IFERROR(INDEX(($K$30:$K$60), MATCH(0, COUNTIF($R$29:R48, ($K$30:$K$60)), 0)), INDEX(($L$30:$L$60), MATCH(0, COUNTIF($R$29:R48, ($L$30:$L$60)), 0))), \"\")","v":""},{"$f":"IFERROR(IFERROR(INDEX(($M$30:$M$60), MATCH(0, COUNTIF($S$29:S48, ($M$30:$M$60)), 0)), INDEX(($N$30:$N$60), MATCH(0, COUNTIF($S$29:S48, ($N$30:$N$60)), 0))), \"\")","v":""},{"$f":"IFERROR(IFERROR(INDEX(($O$30:$O$60), MATCH(0, COUNTIF($T$29:T48, ($O$30:$O$60)), 0)), INDEX(($P$30:$P$60), MATCH(0, COUNTIF($T$29:T48, ($P$30:$P$60)), 0))), \"\")","v":""},{"$f":"IFERROR(IFERROR(INDEX(($Q$30:$Q$60), MATCH(0, COUNTIF($U$29:U48, ($Q$30:$Q$60)), 0)), INDEX(($R$30:$R$60), MATCH(0, COUNTIF($U$29:U48, ($R$30:$R$60)), 0))), \"\")","v":""},{"$f":"IFERROR(IFERROR(INDEX(($S$30:$S$60), MATCH(0, COUNTIF($V$29:V48, ($S$30:$S$60)), 0)), INDEX(($T$30:$T$60), MATCH(0, COUNTIF($V$29:V48, ($T$30:$T$60)), 0))), \"\")","v":""},{"$f":"IFERROR(IFERROR(INDEX(($U$30:$U$60), MATCH(0, COUNTIF($W$29:W48, ($U$30:$U$60)), 0)), INDEX(($V$30:$V$60), MATCH(0, COUNTIF($W$29:W48, ($V$30:$V$60)), 0))), \"\")","v":""},{"$f":"IFERROR(INDEX((Data!$AT$33:$AX$82,Data!$AY$33:$BC$82,Data!$BD$33:$BH$82,Data!$BI$33:$BM$82,Data!$BN$33:$BR$82,Data!$BS$33:$BW$82,Data!$BX$33:$CB$82,Data!$CC$33:$CG$82,Data!$CH$33:$CL$82,Data!$CM$33:$CQ$82),$D49,2,CHOOSE(MATCH($Z$14,INDIRECT(\"Data!$AT$\"&$D49+32&\":$CM$\"&$D49+32),0),1,0,0,0,0,2,0,0,0,0,3,0,0,0,0,4,0,0,0,0,5,0,0,0,0,6,0,0,0,0,7,0,0,0,0,8,0,0,0,0,9,0,0,0,0,10)),\"\")","v":0},{"$f":"IFERROR(INDEX((Data!$AT$33:$AX$82,Data!$AY$33:$BC$82,Data!$BD$33:$BH$82,Data!$BI$33:$BM$82,Data!$BN$33:$BR$82,Data!$BS$33:$BW$82,Data!$BX$33:$CB$82,Data!$CC$33:$CG$82,Data!$CH$33:$CL$82,Data!$CM$33:$CQ$82),$D49,3,CHOOSE(MATCH($Z$14,INDIRECT(\"Data!$AT$\"&$D49+32&\":$CM$\"&$D49+32),0),1,0,0,0,0,2,0,0,0,0,3,0,0,0,0,4,0,0,0,0,5,0,0,0,0,6,0,0,0,0,7,0,0,0,0,8,0,0,0,0,9,0,0,0,0,10)),\"\")","v":0},{"$f":"IFERROR(INDEX((Data!$AT$33:$AX$82,Data!$AY$33:$BC$82,Data!$BD$33:$BH$82,Data!$BI$33:$BM$82,Data!$BN$33:$BR$82,Data!$BS$33:$BW$82,Data!$BX$33:$CB$82,Data!$CC$33:$CG$82,Data!$CH$33:$CL$82,Data!$CM$33:$CQ$82),$D49,4,CHOOSE(MATCH($Z$14,INDIRECT(\"Data!$AT$\"&$D49+32&\":$CM$\"&$D49+32),0),1,0,0,0,0,2,0,0,0,0,3,0,0,0,0,4,0,0,0,0,5,0,0,0,0,6,0,0,0,0,7,0,0,0,0,8,0,0,0,0,9,0,0,0,0,10)),\"\")","v":0},{"$f":"IFERROR(INDEX((Data!$AT$33:$AX$82,Data!$AY$33:$BC$82,Data!$BD$33:$BH$82,Data!$BI$33:$BM$82,Data!$BN$33:$BR$82,Data!$BS$33:$BW$82,Data!$BX$33:$CB$82,Data!$CC$33:$CG$82,Data!$CH$33:$CL$82,Data!$CM$33:$CQ$82),$D49,5,CHOOSE(MATCH($Z$14,INDIRECT(\"Data!$AT$\"&$D49+32&\":$CM$\"&$D49+32),0),1,0,0,0,0,2,0,0,0,0,3,0,0,0,0,4,0,0,0,0,5,0,0,0,0,6,0,0,0,0,7,0,0,0,0,8,0,0,0,0,9,0,0,0,0,10)),\"\")","v":0},0]
[null,{"$f":"'Report A'!$B52","v":"2014-07-21"},{"$f":"'Report A'!$C52","v":"Monday"},{"$f":"'Report A'!$D52","v":21},{"$f":"IFERROR(INDIRECT(\"Data!\"&E$17&$D50+32),\"\")","v":"K-Lunch"},"LOK-LOK","Member 30%","Member Package","Tiger (2+1) Round","Student Member Card","Student Member Price",0,0,0,{"$f":"IFERROR(IFERROR(INDEX(($E$30:$E$60), MATCH(0, COUNTIF($O$29:O49, ($E$30:$E$60)), 0)), INDEX(($F$30:$F$60), MATCH(0, COUNTIF($O$29:O49, ($F$30:$F$60)), 0))), \"\")","v":""},{"$f":"IFERROR(IFERROR(INDEX(($G$30:$G$60), MATCH(0, COUNTIF($P$29:P49, ($G$30:$G$60)), 0)), INDEX(($H$30:$H$60), MATCH(0, COUNTIF($P$29:P49, ($H$30:$H$60)), 0))), \"\")","v":""},{"$f":"IFERROR(IFERROR(INDEX(($I$30:$I$60), MATCH(0, COUNTIF($Q$29:Q49, ($I$30:$I$60)), 0)), INDEX(($J$30:$J$60), MATCH(0, COUNTIF($Q$29:Q49, ($J$30:$J$60)), 0))), \"\")","v":""},{"$f":"IFERROR(IFERROR(INDEX(($K$30:$K$60), MATCH(0, COUNTIF($R$29:R49, ($K$30:$K$60)), 0)), INDEX(($L$30:$L$60), MATCH(0, COUNTIF($R$29:R49, ($L$30:$L$60)), 0))), \"\")","v":""},{"$f":"IFERROR(IFERROR(INDEX(($M$30:$M$60), MATCH(0, COUNTIF($S$29:S49, ($M$30:$M$60)), 0)), INDEX(($N$30:$N$60), MATCH(0, COUNTIF($S$29:S49, ($N$30:$N$60)), 0))), \"\")","v":""},{"$f":"IFERROR(IFERROR(INDEX(($O$30:$O$60), MATCH(0, COUNTIF($T$29:T49, ($O$30:$O$60)), 0)), INDEX(($P$30:$P$60), MATCH(0, COUNTIF($T$29:T49, ($P$30:$P$60)), 0))), \"\")","v":""},{"$f":"IFERROR(IFERROR(INDEX(($Q$30:$Q$60), MATCH(0, COUNTIF($U$29:U49, ($Q$30:$Q$60)), 0)), INDEX(($R$30:$R$60), MATCH(0, COUNTIF($U$29:U49, ($R$30:$R$60)), 0))), \"\")","v":""},{"$f":"IFERROR(IFERROR(INDEX(($S$30:$S$60), MATCH(0, COUNTIF($V$29:V49, ($S$30:$S$60)), 0)), INDEX(($T$30:$T$60), MATCH(0, COUNTIF($V$29:V49, ($T$30:$T$60)), 0))), \"\")","v":""},{"$f":"IFERROR(IFERROR(INDEX(($U$30:$U$60), MATCH(0, COUNTIF($W$29:W49, ($U$30:$U$60)), 0)), INDEX(($V$30:$V$60), MATCH(0, COUNTIF($W$29:W49, ($V$30:$V$60)), 0))), \"\")","v":""},{"$f":"IFERROR(INDEX((Data!$AT$33:$AX$82,Data!$AY$33:$BC$82,Data!$BD$33:$BH$82,Data!$BI$33:$BM$82,Data!$BN$33:$BR$82,Data!$BS$33:$BW$82,Data!$BX$33:$CB$82,Data!$CC$33:$CG$82,Data!$CH$33:$CL$82,Data!$CM$33:$CQ$82),$D50,2,CHOOSE(MATCH($Z$14,INDIRECT(\"Data!$AT$\"&$D50+32&\":$CM$\"&$D50+32),0),1,0,0,0,0,2,0,0,0,0,3,0,0,0,0,4,0,0,0,0,5,0,0,0,0,6,0,0,0,0,7,0,0,0,0,8,0,0,0,0,9,0,0,0,0,10)),\"\")","v":0},{"$f":"IFERROR(INDEX((Data!$AT$33:$AX$82,Data!$AY$33:$BC$82,Data!$BD$33:$BH$82,Data!$BI$33:$BM$82,Data!$BN$33:$BR$82,Data!$BS$33:$BW$82,Data!$BX$33:$CB$82,Data!$CC$33:$CG$82,Data!$CH$33:$CL$82,Data!$CM$33:$CQ$82),$D50,3,CHOOSE(MATCH($Z$14,INDIRECT(\"Data!$AT$\"&$D50+32&\":$CM$\"&$D50+32),0),1,0,0,0,0,2,0,0,0,0,3,0,0,0,0,4,0,0,0,0,5,0,0,0,0,6,0,0,0,0,7,0,0,0,0,8,0,0,0,0,9,0,0,0,0,10)),\"\")","v":0},{"$f":"IFERROR(INDEX((Data!$AT$33:$AX$82,Data!$AY$33:$BC$82,Data!$BD$33:$BH$82,Data!$BI$33:$BM$82,Data!$BN$33:$BR$82,Data!$BS$33:$BW$82,Data!$BX$33:$CB$82,Data!$CC$33:$CG$82,Data!$CH$33:$CL$82,Data!$CM$33:$CQ$82),$D50,4,CHOOSE(MATCH($Z$14,INDIRECT(\"Data!$AT$\"&$D50+32&\":$CM$\"&$D50+32),0),1,0,0,0,0,2,0,0,0,0,3,0,0,0,0,4,0,0,0,0,5,0,0,0,0,6,0,0,0,0,7,0,0,0,0,8,0,0,0,0,9,0,0,0,0,10)),\"\")","v":0},{"$f":"IFERROR(INDEX((Data!$AT$33:$AX$82,Data!$AY$33:$BC$82,Data!$BD$33:$BH$82,Data!$BI$33:$BM$82,Data!$BN$33:$BR$82,Data!$BS$33:$BW$82,Data!$BX$33:$CB$82,Data!$CC$33:$CG$82,Data!$CH$33:$CL$82,Data!$CM$33:$CQ$82),$D50,5,CHOOSE(MATCH($Z$14,INDIRECT(\"Data!$AT$\"&$D50+32&\":$CM$\"&$D50+32),0),1,0,0,0,0,2,0,0,0,0,3,0,0,0,0,4,0,0,0,0,5,0,0,0,0,6,0,0,0,0,7,0,0,0,0,8,0,0,0,0,9,0,0,0,0,10)),\"\")","v":0},0]
[null,{"$f":"'Report A'!$B53","v":"2014-07-22"},{"$f":"'Report A'!$C53","v":"Tuesday"},{"$f":"'Report A'!$D53","v":22},"K-Lunch","LOK-LOK","Member 30%","Member Package","Tiger (2+1) Round","Student Member Card","Student Member Price",0,0,0,{"$f":"IFERROR(IFERROR(INDEX(($E$30:$E$60), MATCH(0, COUNTIF($O$29:O50, ($E$30:$E$60)), 0)), INDEX(($F$30:$F$60), MATCH(0, COUNTIF($O$29:O50, ($F$30:$F$60)), 0))), \"\")","v":""},{"$f":"IFERROR(IFERROR(INDEX(($G$30:$G$60), MATCH(0, COUNTIF($P$29:P50, ($G$30:$G$60)), 0)), INDEX(($H$30:$H$60), MATCH(0, COUNTIF($P$29:P50, ($H$30:$H$60)), 0))), \"\")","v":""},{"$f":"IFERROR(IFERROR(INDEX(($I$30:$I$60), MATCH(0, COUNTIF($Q$29:Q50, ($I$30:$I$60)), 0)), INDEX(($J$30:$J$60), MATCH(0, COUNTIF($Q$29:Q50, ($J$30:$J$60)), 0))), \"\")","v":""},{"$f":"IFERROR(IFERROR(INDEX(($K$30:$K$60), MATCH(0, COUNTIF($R$29:R50, ($K$30:$K$60)), 0)), INDEX(($L$30:$L$60), MATCH(0, COUNTIF($R$29:R50, ($L$30:$L$60)), 0))), \"\")","v":""},{"$f":"IFERROR(IFERROR(INDEX(($M$30:$M$60), MATCH(0, COUNTIF($S$29:S50, ($M$30:$M$60)), 0)), INDEX(($N$30:$N$60), MATCH(0, COUNTIF($S$29:S50, ($N$30:$N$60)), 0))), \"\")","v":""},{"$f":"IFERROR(IFERROR(INDEX(($O$30:$O$60), MATCH(0, COUNTIF($T$29:T50, ($O$30:$O$60)), 0)), INDEX(($P$30:$P$60), MATCH(0, COUNTIF($T$29:T50, ($P$30:$P$60)), 0))), \"\")","v":""},{"$f":"IFERROR(IFERROR(INDEX(($Q$30:$Q$60), MATCH(0, COUNTIF($U$29:U50, ($Q$30:$Q$60)), 0)), INDEX(($R$30:$R$60), MATCH(0, COUNTIF($U$29:U50, ($R$30:$R$60)), 0))), \"\")","v":""},{"$f":"IFERROR(IFERROR(INDEX(($S$30:$S$60), MATCH(0, COUNTIF($V$29:V50, ($S$30:$S$60)), 0)), INDEX(($T$30:$T$60), MATCH(0, COUNTIF($V$29:V50, ($T$30:$T$60)), 0))), \"\")","v":""},{"$f":"IFERROR(IFERROR(INDEX(($U$30:$U$60), MATCH(0, COUNTIF($W$29:W50, ($U$30:$U$60)), 0)), INDEX(($V$30:$V$60), MATCH(0, COUNTIF($W$29:W50, ($V$30:$V$60)), 0))), \"\")","v":""},{"$f":"IFERROR(INDEX((Data!$AT$33:$AX$82,Data!$AY$33:$BC$82,Data!$BD$33:$BH$82,Data!$BI$33:$BM$82,Data!$BN$33:$BR$82,Data!$BS$33:$BW$82,Data!$BX$33:$CB$82,Data!$CC$33:$CG$82,Data!$CH$33:$CL$82,Data!$CM$33:$CQ$82),$D51,2,CHOOSE(MATCH($Z$14,INDIRECT(\"Data!$AT$\"&$D51+32&\":$CM$\"&$D51+32),0),1,0,0,0,0,2,0,0,0,0,3,0,0,0,0,4,0,0,0,0,5,0,0,0,0,6,0,0,0,0,7,0,0,0,0,8,0,0,0,0,9,0,0,0,0,10)),\"\")","v":0},{"$f":"IFERROR(INDEX((Data!$AT$33:$AX$82,Data!$AY$33:$BC$82,Data!$BD$33:$BH$82,Data!$BI$33:$BM$82,Data!$BN$33:$BR$82,Data!$BS$33:$BW$82,Data!$BX$33:$CB$82,Data!$CC$33:$CG$82,Data!$CH$33:$CL$82,Data!$CM$33:$CQ$82),$D51,3,CHOOSE(MATCH($Z$14,INDIRECT(\"Data!$AT$\"&$D51+32&\":$CM$\"&$D51+32),0),1,0,0,0,0,2,0,0,0,0,3,0,0,0,0,4,0,0,0,0,5,0,0,0,0,6,0,0,0,0,7,0,0,0,0,8,0,0,0,0,9,0,0,0,0,10)),\"\")","v":0},{"$f":"IFERROR(INDEX((Data!$AT$33:$AX$82,Data!$AY$33:$BC$82,Data!$BD$33:$BH$82,Data!$BI$33:$BM$82,Data!$BN$33:$BR$82,Data!$BS$33:$BW$82,Data!$BX$33:$CB$82,Data!$CC$33:$CG$82,Data!$CH$33:$CL$82,Data!$CM$33:$CQ$82),$D51,4,CHOOSE(MATCH($Z$14,INDIRECT(\"Data!$AT$\"&$D51+32&\":$CM$\"&$D51+32),0),1,0,0,0,0,2,0,0,0,0,3,0,0,0,0,4,0,0,0,0,5,0,0,0,0,6,0,0,0,0,7,0,0,0,0,8,0,0,0,0,9,0,0,0,0,10)),\"\")","v":0},{"$f":"IFERROR(INDEX((Data!$AT$33:$AX$82,Data!$AY$33:$BC$82,Data!$BD$33:$BH$82,Data!$BI$33:$BM$82,Data!$BN$33:$BR$82,Data!$BS$33:$BW$82,Data!$BX$33:$CB$82,Data!$CC$33:$CG$82,Data!$CH$33:$CL$82,Data!$CM$33:$CQ$82),$D51,5,CHOOSE(MATCH($Z$14,INDIRECT(\"Data!$AT$\"&$D51+32&\":$CM$\"&$D51+32),0),1,0,0,0,0,2,0,0,0,0,3,0,0,0,0,4,0,0,0,0,5,0,0,0,0,6,0,0,0,0,7,0,0,0,0,8,0,0,0,0,9,0,0,0,0,10)),\"\")","v":0},0]
[null,{"$f":"'Report A'!$B54","v":"2014-07-23"},{"$f":"'Report A'!$C54","v":"Wednesday"},{"$f":"'Report A'!$D54","v":23},"K-Lunch","LOK-LOK","Member 30%","Member Package","Tiger (2+1) Round","Student Member Card","Student Member Price",0,0,0,{"$f":"IFERROR(IFERROR(INDEX(($E$30:$E$60), MATCH(0, COUNTIF($O$29:O51, ($E$30:$E$60)), 0)), INDEX(($F$30:$F$60), MATCH(0, COUNTIF($O$29:O51, ($F$30:$F$60)), 0))), \"\")","v":""},{"$f":"IFERROR(IFERROR(INDEX(($G$30:$G$60), MATCH(0, COUNTIF($P$29:P51, ($G$30:$G$60)), 0)), INDEX(($H$30:$H$60), MATCH(0, COUNTIF($P$29:P51, ($H$30:$H$60)), 0))), \"\")","v":""},{"$f":"IFERROR(IFERROR(INDEX(($I$30:$I$60), MATCH(0, COUNTIF($Q$29:Q51, ($I$30:$I$60)), 0)), INDEX(($J$30:$J$60), MATCH(0, COUNTIF($Q$29:Q51, ($J$30:$J$60)), 0))), \"\")","v":""},{"$f":"IFERROR(IFERROR(INDEX(($K$30:$K$60), MATCH(0, COUNTIF($R$29:R51, ($K$30:$K$60)), 0)), INDEX(($L$30:$L$60), MATCH(0, COUNTIF($R$29:R51, ($L$30:$L$60)), 0))), \"\")","v":""},{"$f":"IFERROR(IFERROR(INDEX(($M$30:$M$60), MATCH(0, COUNTIF($S$29:S51, ($M$30:$M$60)), 0)), INDEX(($N$30:$N$60), MATCH(0, COUNTIF($S$29:S51, ($N$30:$N$60)), 0))), \"\")","v":""},{"$f":"IFERROR(IFERROR(INDEX(($O$30:$O$60), MATCH(0, COUNTIF($T$29:T51, ($O$30:$O$60)), 0)), INDEX(($P$30:$P$60), MATCH(0, COUNTIF($T$29:T51, ($P$30:$P$60)), 0))), \"\")","v":""},{"$f":"IFERROR(IFERROR(INDEX(($Q$30:$Q$60), MATCH(0, COUNTIF($U$29:U51, ($Q$30:$Q$60)), 0)), INDEX(($R$30:$R$60), MATCH(0, COUNTIF($U$29:U51, ($R$30:$R$60)), 0))), \"\")","v":""},{"$f":"IFERROR(IFERROR(INDEX(($S$30:$S$60), MATCH(0, COUNTIF($V$29:V51, ($S$30:$S$60)), 0)), INDEX(($T$30:$T$60), MATCH(0, COUNTIF($V$29:V51, ($T$30:$T$60)), 0))), \"\")","v":""},{"$f":"IFERROR(IFERROR(INDEX(($U$30:$U$60), MATCH(0, COUNTIF($W$29:W51, ($U$30:$U$60)), 0)), INDEX(($V$30:$V$60), MATCH(0, COUNTIF($W$29:W51, ($V$30:$V$60)), 0))), \"\")","v":""},{"$f":"IFERROR(INDEX((Data!$AT$33:$AX$82,Data!$AY$33:$BC$82,Data!$BD$33:$BH$82,Data!$BI$33:$BM$82,Data!$BN$33:$BR$82,Data!$BS$33:$BW$82,Data!$BX$33:$CB$82,Data!$CC$33:$CG$82,Data!$CH$33:$CL$82,Data!$CM$33:$CQ$82),$D52,2,CHOOSE(MATCH($Z$14,INDIRECT(\"Data!$AT$\"&$D52+32&\":$CM$\"&$D52+32),0),1,0,0,0,0,2,0,0,0,0,3,0,0,0,0,4,0,0,0,0,5,0,0,0,0,6,0,0,0,0,7,0,0,0,0,8,0,0,0,0,9,0,0,0,0,10)),\"\")","v":0},{"$f":"IFERROR(INDEX((Data!$AT$33:$AX$82,Data!$AY$33:$BC$82,Data!$BD$33:$BH$82,Data!$BI$33:$BM$82,Data!$BN$33:$BR$82,Data!$BS$33:$BW$82,Data!$BX$33:$CB$82,Data!$CC$33:$CG$82,Data!$CH$33:$CL$82,Data!$CM$33:$CQ$82),$D52,3,CHOOSE(MATCH($Z$14,INDIRECT(\"Data!$AT$\"&$D52+32&\":$CM$\"&$D52+32),0),1,0,0,0,0,2,0,0,0,0,3,0,0,0,0,4,0,0,0,0,5,0,0,0,0,6,0,0,0,0,7,0,0,0,0,8,0,0,0,0,9,0,0,0,0,10)),\"\")","v":0},{"$f":"IFERROR(INDEX((Data!$AT$33:$AX$82,Data!$AY$33:$BC$82,Data!$BD$33:$BH$82,Data!$BI$33:$BM$82,Data!$BN$33:$BR$82,Data!$BS$33:$BW$82,Data!$BX$33:$CB$82,Data!$CC$33:$CG$82,Data!$CH$33:$CL$82,Data!$CM$33:$CQ$82),$D52,4,CHOOSE(MATCH($Z$14,INDIRECT(\"Data!$AT$\"&$D52+32&\":$CM$\"&$D52+32),0),1,0,0,0,0,2,0,0,0,0,3,0,0,0,0,4,0,0,0,0,5,0,0,0,0,6,0,0,0,0,7,0,0,0,0,8,0,0,0,0,9,0,0,0,0,10)),\"\")","v":1},{"$f":"IFERROR(INDEX((Data!$AT$33:$AX$82,Data!$AY$33:$BC$82,Data!$BD$33:$BH$82,Data!$BI$33:$BM$82,Data!$BN$33:$BR$82,Data!$BS$33:$BW$82,Data!$BX$33:$CB$82,Data!$CC$33:$CG$82,Data!$CH$33:$CL$82,Data!$CM$33:$CQ$82),$D52,5,CHOOSE(MATCH($Z$14,INDIRECT(\"Data!$AT$\"&$D52+32&\":$CM$\"&$D52+32),0),1,0,0,0,0,2,0,0,0,0,3,0,0,0,0,4,0,0,0,0,5,0,0,0,0,6,0,0,0,0,7,0,0,0,0,8,0,0,0,0,9,0,0,0,0,10)),\"\")","v":0},1]
[null,{"$f":"'Report A'!$B55","v":"2014-07-24"},{"$f":"'Report A'!$C55","v":"Thursday"},{"$f":"'Report A'!$D55","v":24},"K-Lunch","LOK-LOK","Member 30%","Member Package","Tiger (2+1) Round","Student Member Card","Student Member Price",0,0,0,{"$f":"IFERROR(IFERROR(INDEX(($E$30:$E$60), MATCH(0, COUNTIF($O$29:O52, ($E$30:$E$60)), 0)), INDEX(($F$30:$F$60), MATCH(0, COUNTIF($O$29:O52, ($F$30:$F$60)), 0))), \"\")","v":""},{"$f":"IFERROR(IFERROR(INDEX(($G$30:$G$60), MATCH(0, COUNTIF($P$29:P52, ($G$30:$G$60)), 0)), INDEX(($H$30:$H$60), MATCH(0, COUNTIF($P$29:P52, ($H$30:$H$60)), 0))), \"\")","v":""},{"$f":"IFERROR(IFERROR(INDEX(($I$30:$I$60), MATCH(0, COUNTIF($Q$29:Q52, ($I$30:$I$60)), 0)), INDEX(($J$30:$J$60), MATCH(0, COUNTIF($Q$29:Q52, ($J$30:$J$60)), 0))), \"\")","v":""},{"$f":"IFERROR(IFERROR(INDEX(($K$30:$K$60), MATCH(0, COUNTIF($R$29:R52, ($K$30:$K$60)), 0)), INDEX(($L$30:$L$60), MATCH(0, COUNTIF($R$29:R52, ($L$30:$L$60)), 0))), \"\")","v":""},{"$f":"IFERROR(IFERROR(INDEX(($M$30:$M$60), MATCH(0, COUNTIF($S$29:S52, ($M$30:$M$60)), 0)), INDEX(($N$30:$N$60), MATCH(0, COUNTIF($S$29:S52, ($N$30:$N$60)), 0))), \"\")","v":""},{"$f":"IFERROR(IFERROR(INDEX(($O$30:$O$60), MATCH(0, COUNTIF($T$29:T52, ($O$30:$O$60)), 0)), INDEX(($P$30:$P$60), MATCH(0, COUNTIF($T$29:T52, ($P$30:$P$60)), 0))), \"\")","v":""},{"$f":"IFERROR(IFERROR(INDEX(($Q$30:$Q$60), MATCH(0, COUNTIF($U$29:U52, ($Q$30:$Q$60)), 0)), INDEX(($R$30:$R$60), MATCH(0, COUNTIF($U$29:U52, ($R$30:$R$60)), 0))), \"\")","v":""},{"$f":"IFERROR(IFERROR(INDEX(($S$30:$S$60), MATCH(0, COUNTIF($V$29:V52, ($S$30:$S$60)), 0)), INDEX(($T$30:$T$60), MATCH(0, COUNTIF($V$29:V52, ($T$30:$T$60)), 0))), \"\")","v":""},{"$f":"IFERROR(IFERROR(INDEX(($U$30:$U$60), MATCH(0, COUNTIF($W$29:W52, ($U$30:$U$60)), 0)), INDEX(($V$30:$V$60), MATCH(0, COUNTIF($W$29:W52, ($V$30:$V$60)), 0))), \"\")","v":""},{"$f":"IFERROR(INDEX((Data!$AT$33:$AX$82,Data!$AY$33:$BC$82,Data!$BD$33:$BH$82,Data!$BI$33:$BM$82,Data!$BN$33:$BR$82,Data!$BS$33:$BW$82,Data!$BX$33:$CB$82,Data!$CC$33:$CG$82,Data!$CH$33:$CL$82,Data!$CM$33:$CQ$82),$D53,2,CHOOSE(MATCH($Z$14,INDIRECT(\"Data!$AT$\"&$D53+32&\":$CM$\"&$D53+32),0),1,0,0,0,0,2,0,0,0,0,3,0,0,0,0,4,0,0,0,0,5,0,0,0,0,6,0,0,0,0,7,0,0,0,0,8,0,0,0,0,9,0,0,0,0,10)),\"\")","v":0},{"$f":"IFERROR(INDEX((Data!$AT$33:$AX$82,Data!$AY$33:$BC$82,Data!$BD$33:$BH$82,Data!$BI$33:$BM$82,Data!$BN$33:$BR$82,Data!$BS$33:$BW$82,Data!$BX$33:$CB$82,Data!$CC$33:$CG$82,Data!$CH$33:$CL$82,Data!$CM$33:$CQ$82),$D53,3,CHOOSE(MATCH($Z$14,INDIRECT(\"Data!$AT$\"&$D53+32&\":$CM$\"&$D53+32),0),1,0,0,0,0,2,0,0,0,0,3,0,0,0,0,4,0,0,0,0,5,0,0,0,0,6,0,0,0,0,7,0,0,0,0,8,0,0,0,0,9,0,0,0,0,10)),\"\")","v":0},{"$f":"IFERROR(INDEX((Data!$AT$33:$AX$82,Data!$AY$33:$BC$82,Data!$BD$33:$BH$82,Data!$BI$33:$BM$82,Data!$BN$33:$BR$82,Data!$BS$33:$BW$82,Data!$BX$33:$CB$82,Data!$CC$33:$CG$82,Data!$CH$33:$CL$82,Data!$CM$33:$CQ$82),$D53,4,CHOOSE(MATCH($Z$14,INDIRECT(\"Data!$AT$\"&$D53+32&\":$CM$\"&$D53+32),0),1,0,0,0,0,2,0,0,0,0,3,0,0,0,0,4,0,0,0,0,5,0,0,0,0,6,0,0,0,0,7,0,0,0,0,8,0,0,0,0,9,0,0,0,0,10)),\"\")","v":0},{"$f":"IFERROR(INDEX((Data!$AT$33:$AX$82,Data!$AY$33:$BC$82,Data!$BD$33:$BH$82,Data!$BI$33:$BM$82,Data!$BN$33:$BR$82,Data!$BS$33:$BW$82,Data!$BX$33:$CB$82,Data!$CC$33:$CG$82,Data!$CH$33:$CL$82,Data!$CM$33:$CQ$82),$D53,5,CHOOSE(MATCH($Z$14,INDIRECT(\"Data!$AT$\"&$D53+32&\":$CM$\"&$D53+32),0),1,0,0,0,0,2,0,0,0,0,3,0,0,0,0,4,0,0,0,0,5,0,0,0,0,6,0,0,0,0,7,0,0,0,0,8,0,0,0,0,9,0,0,0,0,10)),\"\")","v":0},0]
[null,{"$f":"'Report A'!$B56","v":"2014-07-25"},{"$f":"'Report A'!$C56","v":"Friday"},{"$f":"'Report A'!$D56","v":25},"K-Lunch","LOK-LOK","Member 30%","Member Package","Tiger (2+1) Round","Student Member Card","Student Member Price",0,0,0,{"$f":"IFERROR(IFERROR(INDEX(($E$30:$E$60), MATCH(0, COUNTIF($O$29:O53, ($E$30:$E$60)), 0)), INDEX(($F$30:$F$60), MATCH(0, COUNTIF($O$29:O53, ($F$30:$F$60)), 0))), \"\")","v":""},{"$f":"IFERROR(IFERROR(INDEX(($G$30:$G$60), MATCH(0, COUNTIF($P$29:P53, ($G$30:$G$60)), 0)), INDEX(($H$30:$H$60), MATCH(0, COUNTIF($P$29:P53, ($H$30:$H$60)), 0))), \"\")","v":""},{"$f":"IFERROR(IFERROR(INDEX(($I$30:$I$60), MATCH(0, COUNTIF($Q$29:Q53, ($I$30:$I$60)), 0)), INDEX(($J$30:$J$60), MATCH(0, COUNTIF($Q$29:Q53, ($J$30:$J$60)), 0))), \"\")","v":""},{"$f":"IFERROR(IFERROR(INDEX(($K$30:$K$60), MATCH(0, COUNTIF($R$29:R53, ($K$30:$K$60)), 0)), INDEX(($L$30:$L$60), MATCH(0, COUNTIF($R$29:R53, ($L$30:$L$60)), 0))), \"\")","v":""},{"$f":"IFERROR(IFERROR(INDEX(($M$30:$M$60), MATCH(0, COUNTIF($S$29:S53, ($M$30:$M$60)), 0)), INDEX(($N$30:$N$60), MATCH(0, COUNTIF($S$29:S53, ($N$30:$N$60)), 0))), \"\")","v":""},{"$f":"IFERROR(IFERROR(INDEX(($O$30:$O$60), MATCH(0, COUNTIF($T$29:T53, ($O$30:$O$60)), 0)), INDEX(($P$30:$P$60), MATCH(0, COUNTIF($T$29:T53, ($P$30:$P$60)), 0))), \"\")","v":""},{"$f":"IFERROR(IFERROR(INDEX(($Q$30:$Q$60), MATCH(0, COUNTIF($U$29:U53, ($Q$30:$Q$60)), 0)), INDEX(($R$30:$R$60), MATCH(0, COUNTIF($U$29:U53, ($R$30:$R$60)), 0))), \"\")","v":""},{"$f":"IFERROR(IFERROR(INDEX(($S$30:$S$60), MATCH(0, COUNTIF($V$29:V53, ($S$30:$S$60)), 0)), INDEX(($T$30:$T$60), MATCH(0, COUNTIF($V$29:V53, ($T$30:$T$60)), 0))), \"\")","v":""},{"$f":"IFERROR(IFERROR(INDEX(($U$30:$U$60), MATCH(0, COUNTIF($W$29:W53, ($U$30:$U$60)), 0)), INDEX(($V$30:$V$60), MATCH(0, COUNTIF($W$29:W53, ($V$30:$V$60)), 0))), \"\")","v":""},{"$f":"IFERROR(INDEX((Data!$AT$33:$AX$82,Data!$AY$33:$BC$82,Data!$BD$33:$BH$82,Data!$BI$33:$BM$82,Data!$BN$33:$BR$82,Data!$BS$33:$BW$82,Data!$BX$33:$CB$82,Data!$CC$33:$CG$82,Data!$CH$33:$CL$82,Data!$CM$33:$CQ$82),$D54,2,CHOOSE(MATCH($Z$14,INDIRECT(\"Data!$AT$\"&$D54+32&\":$CM$\"&$D54+32),0),1,0,0,0,0,2,0,0,0,0,3,0,0,0,0,4,0,0,0,0,5,0,0,0,0,6,0,0,0,0,7,0,0,0,0,8,0,0,0,0,9,0,0,0,0,10)),\"\")","v":0},{"$f":"IFERROR(INDEX((Data!$AT$33:$AX$82,Data!$AY$33:$BC$82,Data!$BD$33:$BH$82,Data!$BI$33:$BM$82,Data!$BN$33:$BR$82,Data!$BS$33:$BW$82,Data!$BX$33:$CB$82,Data!$CC$33:$CG$82,Data!$CH$33:$CL$82,Data!$CM$33:$CQ$82),$D54,3,CHOOSE(MATCH($Z$14,INDIRECT(\"Data!$AT$\"&$D54+32&\":$CM$\"&$D54+32),0),1,0,0,0,0,2,0,0,0,0,3,0,0,0,0,4,0,0,0,0,5,0,0,0,0,6,0,0,0,0,7,0,0,0,0,8,0,0,0,0,9,0,0,0,0,10)),\"\")","v":0},{"$f":"IFERROR(INDEX((Data!$AT$33:$AX$82,Data!$AY$33:$BC$82,Data!$BD$33:$BH$82,Data!$BI$33:$BM$82,Data!$BN$33:$BR$82,Data!$BS$33:$BW$82,Data!$BX$33:$CB$82,Data!$CC$33:$CG$82,Data!$CH$33:$CL$82,Data!$CM$33:$CQ$82),$D54,4,CHOOSE(MATCH($Z$14,INDIRECT(\"Data!$AT$\"&$D54+32&\":$CM$\"&$D54+32),0),1,0,0,0,0,2,0,0,0,0,3,0,0,0,0,4,0,0,0,0,5,0,0,0,0,6,0,0,0,0,7,0,0,0,0,8,0,0,0,0,9,0,0,0,0,10)),\"\")","v":0},{"$f":"IFERROR(INDEX((Data!$AT$33:$AX$82,Data!$AY$33:$BC$82,Data!$BD$33:$BH$82,Data!$BI$33:$BM$82,Data!$BN$33:$BR$82,Data!$BS$33:$BW$82,Data!$BX$33:$CB$82,Data!$CC$33:$CG$82,Data!$CH$33:$CL$82,Data!$CM$33:$CQ$82),$D54,5,CHOOSE(MATCH($Z$14,INDIRECT(\"Data!$AT$\"&$D54+32&\":$CM$\"&$D54+32),0),1,0,0,0,0,2,0,0,0,0,3,0,0,0,0,4,0,0,0,0,5,0,0,0,0,6,0,0,0,0,7,0,0,0,0,8,0,0,0,0,9,0,0,0,0,10)),\"\")","v":0},0]
[null,{"$f":"'Report A'!$B57","v":"2014-07-26"},{"$f":"'Report A'!$C57","v":"Saturday"},{"$f":"'Report A'!$D57","v":26},"K-Lunch","LOK-LOK","Member 30%","Member Package","Tiger (2+1) Round","Student Member Card","Student Member Price",0,0,0,{"$f":"IFERROR(IFERROR(INDEX(($E$30:$E$60), MATCH(0, COUNTIF($O$29:O54, ($E$30:$E$60)), 0)), INDEX(($F$30:$F$60), MATCH(0, COUNTIF($O$29:O54, ($F$30:$F$60)), 0))), \"\")","v":""},{"$f":"IFERROR(IFERROR(INDEX(($G$30:$G$60), MATCH(0, COUNTIF($P$29:P54, ($G$30:$G$60)), 0)), INDEX(($H$30:$H$60), MATCH(0, COUNTIF($P$29:P54, ($H$30:$H$60)), 0))), \"\")","v":""},{"$f":"IFERROR(IFERROR(INDEX(($I$30:$I$60), MATCH(0, COUNTIF($Q$29:Q54, ($I$30:$I$60)), 0)), INDEX(($J$30:$J$60), MATCH(0, COUNTIF($Q$29:Q54, ($J$30:$J$60)), 0))), \"\")","v":""},{"$f":"IFERROR(IFERROR(INDEX(($K$30:$K$60), MATCH(0, COUNTIF($R$29:R54, ($K$30:$K$60)), 0)), INDEX(($L$30:$L$60), MATCH(0, COUNTIF($R$29:R54, ($L$30:$L$60)), 0))), \"\")","v":""},{"$f":"IFERROR(IFERROR(INDEX(($M$30:$M$60), MATCH(0, COUNTIF($S$29:S54, ($M$30:$M$60)), 0)), INDEX(($N$30:$N$60), MATCH(0, COUNTIF($S$29:S54, ($N$30:$N$60)), 0))), \"\")","v":""},{"$f":"IFERROR(IFERROR(INDEX(($O$30:$O$60), MATCH(0, COUNTIF($T$29:T54, ($O$30:$O$60)), 0)), INDEX(($P$30:$P$60), MATCH(0, COUNTIF($T$29:T54, ($P$30:$P$60)), 0))), \"\")","v":""},{"$f":"IFERROR(IFERROR(INDEX(($Q$30:$Q$60), MATCH(0, COUNTIF($U$29:U54, ($Q$30:$Q$60)), 0)), INDEX(($R$30:$R$60), MATCH(0, COUNTIF($U$29:U54, ($R$30:$R$60)), 0))), \"\")","v":""},{"$f":"IFERROR(IFERROR(INDEX(($S$30:$S$60), MATCH(0, COUNTIF($V$29:V54, ($S$30:$S$60)), 0)), INDEX(($T$30:$T$60), MATCH(0, COUNTIF($V$29:V54, ($T$30:$T$60)), 0))), \"\")","v":""},{"$f":"IFERROR(IFERROR(INDEX(($U$30:$U$60), MATCH(0, COUNTIF($W$29:W54, ($U$30:$U$60)), 0)), INDEX(($V$30:$V$60), MATCH(0, COUNTIF($W$29:W54, ($V$30:$V$60)), 0))), \"\")","v":""},{"$f":"IFERROR(INDEX((Data!$AT$33:$AX$82,Data!$AY$33:$BC$82,Data!$BD$33:$BH$82,Data!$BI$33:$BM$82,Data!$BN$33:$BR$82,Data!$BS$33:$BW$82,Data!$BX$33:$CB$82,Data!$CC$33:$CG$82,Data!$CH$33:$CL$82,Data!$CM$33:$CQ$82),$D55,2,CHOOSE(MATCH($Z$14,INDIRECT(\"Data!$AT$\"&$D55+32&\":$CM$\"&$D55+32),0),1,0,0,0,0,2,0,0,0,0,3,0,0,0,0,4,0,0,0,0,5,0,0,0,0,6,0,0,0,0,7,0,0,0,0,8,0,0,0,0,9,0,0,0,0,10)),\"\")","v":0},{"$f":"IFERROR(INDEX((Data!$AT$33:$AX$82,Data!$AY$33:$BC$82,Data!$BD$33:$BH$82,Data!$BI$33:$BM$82,Data!$BN$33:$BR$82,Data!$BS$33:$BW$82,Data!$BX$33:$CB$82,Data!$CC$33:$CG$82,Data!$CH$33:$CL$82,Data!$CM$33:$CQ$82),$D55,3,CHOOSE(MATCH($Z$14,INDIRECT(\"Data!$AT$\"&$D55+32&\":$CM$\"&$D55+32),0),1,0,0,0,0,2,0,0,0,0,3,0,0,0,0,4,0,0,0,0,5,0,0,0,0,6,0,0,0,0,7,0,0,0,0,8,0,0,0,0,9,0,0,0,0,10)),\"\")","v":0},{"$f":"IFERROR(INDEX((Data!$AT$33:$AX$82,Data!$AY$33:$BC$82,Data!$BD$33:$BH$82,Data!$BI$33:$BM$82,Data!$BN$33:$BR$82,Data!$BS$33:$BW$82,Data!$BX$33:$CB$82,Data!$CC$33:$CG$82,Data!$CH$33:$CL$82,Data!$CM$33:$CQ$82),$D55,4,CHOOSE(MATCH($Z$14,INDIRECT(\"Data!$AT$\"&$D55+32&\":$CM$\"&$D55+32),0),1,0,0,0,0,2,0,0,0,0,3,0,0,0,0,4,0,0,0,0,5,0,0,0,0,6,0,0,0,0,7,0,0,0,0,8,0,0,0,0,9,0,0,0,0,10)),\"\")","v":0},{"$f":"IFERROR(INDEX((Data!$AT$33:$AX$82,Data!$AY$33:$BC$82,Data!$BD$33:$BH$82,Data!$BI$33:$BM$82,Data!$BN$33:$BR$82,Data!$BS$33:$BW$82,Data!$BX$33:$CB$82,Data!$CC$33:$CG$82,Data!$CH$33:$CL$82,Data!$CM$33:$CQ$82),$D55,5,CHOOSE(MATCH($Z$14,INDIRECT(\"Data!$AT$\"&$D55+32&\":$CM$\"&$D55+32),0),1,0,0,0,0,2,0,0,0,0,3,0,0,0,0,4,0,0,0,0,5,0,0,0,0,6,0,0,0,0,7,0,0,0,0,8,0,0,0,0,9,0,0,0,0,10)),\"\")","v":0},0]
[null,{"$f":"'Report A'!$B58","v":"2014-07-27"},{"$f":"'Report A'!$C58","v":"Sunday +"},{"$f":"'Report A'!$D58","v":27},"K-Lunch","LOK-LOK","Member 30%","Member Package","Tiger (2+1) Round","Student Member Card","Student Member Price",0,0,0,{"$f":"IFERROR(IFERROR(INDEX(($E$30:$E$60), MATCH(0, COUNTIF($O$29:O55, ($E$30:$E$60)), 0)), INDEX(($F$30:$F$60), MATCH(0, COUNTIF($O$29:O55, ($F$30:$F$60)), 0))), \"\")","v":""},{"$f":"IFERROR(IFERROR(INDEX(($G$30:$G$60), MATCH(0, COUNTIF($P$29:P55, ($G$30:$G$60)), 0)), INDEX(($H$30:$H$60), MATCH(0, COUNTIF($P$29:P55, ($H$30:$H$60)), 0))), \"\")","v":""},{"$f":"IFERROR(IFERROR(INDEX(($I$30:$I$60), MATCH(0, COUNTIF($Q$29:Q55, ($I$30:$I$60)), 0)), INDEX(($J$30:$J$60), MATCH(0, COUNTIF($Q$29:Q55, ($J$30:$J$60)), 0))), \"\")","v":""},{"$f":"IFERROR(IFERROR(INDEX(($K$30:$K$60), MATCH(0, COUNTIF($R$29:R55, ($K$30:$K$60)), 0)), INDEX(($L$30:$L$60), MATCH(0, COUNTIF($R$29:R55, ($L$30:$L$60)), 0))), \"\")","v":""},{"$f":"IFERROR(IFERROR(INDEX(($M$30:$M$60), MATCH(0, COUNTIF($S$29:S55, ($M$30:$M$60)), 0)), INDEX(($N$30:$N$60), MATCH(0, COUNTIF($S$29:S55, ($N$30:$N$60)), 0))), \"\")","v":""},{"$f":"IFERROR(IFERROR(INDEX(($O$30:$O$60), MATCH(0, COUNTIF($T$29:T55, ($O$30:$O$60)), 0)), INDEX(($P$30:$P$60), MATCH(0, COUNTIF($T$29:T55, ($P$30:$P$60)), 0))), \"\")","v":""},{"$f":"IFERROR(IFERROR(INDEX(($Q$30:$Q$60), MATCH(0, COUNTIF($U$29:U55, ($Q$30:$Q$60)), 0)), INDEX(($R$30:$R$60), MATCH(0, COUNTIF($U$29:U55, ($R$30:$R$60)), 0))), \"\")","v":""},{"$f":"IFERROR(IFERROR(INDEX(($S$30:$S$60), MATCH(0, COUNTIF($V$29:V55, ($S$30:$S$60)), 0)), INDEX(($T$30:$T$60), MATCH(0, COUNTIF($V$29:V55, ($T$30:$T$60)), 0))), \"\")","v":""},{"$f":"IFERROR(IFERROR(INDEX(($U$30:$U$60), MATCH(0, COUNTIF($W$29:W55, ($U$30:$U$60)), 0)), INDEX(($V$30:$V$60), MATCH(0, COUNTIF($W$29:W55, ($V$30:$V$60)), 0))), \"\")","v":""},{"$f":"IFERROR(INDEX((Data!$AT$33:$AX$82,Data!$AY$33:$BC$82,Data!$BD$33:$BH$82,Data!$BI$33:$BM$82,Data!$BN$33:$BR$82,Data!$BS$33:$BW$82,Data!$BX$33:$CB$82,Data!$CC$33:$CG$82,Data!$CH$33:$CL$82,Data!$CM$33:$CQ$82),$D56,2,CHOOSE(MATCH($Z$14,INDIRECT(\"Data!$AT$\"&$D56+32&\":$CM$\"&$D56+32),0),1,0,0,0,0,2,0,0,0,0,3,0,0,0,0,4,0,0,0,0,5,0,0,0,0,6,0,0,0,0,7,0,0,0,0,8,0,0,0,0,9,0,0,0,0,10)),\"\")","v":0},{"$f":"IFERROR(INDEX((Data!$AT$33:$AX$82,Data!$AY$33:$BC$82,Data!$BD$33:$BH$82,Data!$BI$33:$BM$82,Data!$BN$33:$BR$82,Data!$BS$33:$BW$82,Data!$BX$33:$CB$82,Data!$CC$33:$CG$82,Data!$CH$33:$CL$82,Data!$CM$33:$CQ$82),$D56,3,CHOOSE(MATCH($Z$14,INDIRECT(\"Data!$AT$\"&$D56+32&\":$CM$\"&$D56+32),0),1,0,0,0,0,2,0,0,0,0,3,0,0,0,0,4,0,0,0,0,5,0,0,0,0,6,0,0,0,0,7,0,0,0,0,8,0,0,0,0,9,0,0,0,0,10)),\"\")","v":0},{"$f":"IFERROR(INDEX((Data!$AT$33:$AX$82,Data!$AY$33:$BC$82,Data!$BD$33:$BH$82,Data!$BI$33:$BM$82,Data!$BN$33:$BR$82,Data!$BS$33:$BW$82,Data!$BX$33:$CB$82,Data!$CC$33:$CG$82,Data!$CH$33:$CL$82,Data!$CM$33:$CQ$82),$D56,4,CHOOSE(MATCH($Z$14,INDIRECT(\"Data!$AT$\"&$D56+32&\":$CM$\"&$D56+32),0),1,0,0,0,0,2,0,0,0,0,3,0,0,0,0,4,0,0,0,0,5,0,0,0,0,6,0,0,0,0,7,0,0,0,0,8,0,0,0,0,9,0,0,0,0,10)),\"\")","v":0},{"$f":"IFERROR(INDEX((Data!$AT$33:$AX$82,Data!$AY$33:$BC$82,Data!$BD$33:$BH$82,Data!$BI$33:$BM$82,Data!$BN$33:$BR$82,Data!$BS$33:$BW$82,Data!$BX$33:$CB$82,Data!$CC$33:$CG$82,Data!$CH$33:$CL$82,Data!$CM$33:$CQ$82),$D56,5,CHOOSE(MATCH($Z$14,INDIRECT(\"Data!$AT$\"&$D56+32&\":$CM$\"&$D56+32),0),1,0,0,0,0,2,0,0,0,0,3,0,0,0,0,4,0,0,0,0,5,0,0,0,0,6,0,0,0,0,7,0,0,0,0,8,0,0,0,0,9,0,0,0,0,10)),\"\")","v":0},0]
[null,{"$f":"'Report A'!$B59","v":"2014-07-28"},{"$f":"'Report A'!$C59","v":"Monday ++"},{"$f":"'Report A'!$D59","v":28},"K-Lunch","LOK-LOK","Member 30%","Member Package","Tiger (2+1) Round","Student Member Card","Student Member Price",0,0,0,{"$f":"IFERROR(IFERROR(INDEX(($E$30:$E$60), MATCH(0, COUNTIF($O$29:O56, ($E$30:$E$60)), 0)), INDEX(($F$30:$F$60), MATCH(0, COUNTIF($O$29:O56, ($F$30:$F$60)), 0))), \"\")","v":""},{"$f":"IFERROR(IFERROR(INDEX(($G$30:$G$60), MATCH(0, COUNTIF($P$29:P56, ($G$30:$G$60)), 0)), INDEX(($H$30:$H$60), MATCH(0, COUNTIF($P$29:P56, ($H$30:$H$60)), 0))), \"\")","v":""},{"$f":"IFERROR(IFERROR(INDEX(($I$30:$I$60), MATCH(0, COUNTIF($Q$29:Q56, ($I$30:$I$60)), 0)), INDEX(($J$30:$J$60), MATCH(0, COUNTIF($Q$29:Q56, ($J$30:$J$60)), 0))), \"\")","v":""},{"$f":"IFERROR(IFERROR(INDEX(($K$30:$K$60), MATCH(0, COUNTIF($R$29:R56, ($K$30:$K$60)), 0)), INDEX(($L$30:$L$60), MATCH(0, COUNTIF($R$29:R56, ($L$30:$L$60)), 0))), \"\")","v":""},{"$f":"IFERROR(IFERROR(INDEX(($M$30:$M$60), MATCH(0, COUNTIF($S$29:S56, ($M$30:$M$60)), 0)), INDEX(($N$30:$N$60), MATCH(0, COUNTIF($S$29:S56, ($N$30:$N$60)), 0))), \"\")","v":""},{"$f":"IFERROR(IFERROR(INDEX(($O$30:$O$60), MATCH(0, COUNTIF($T$29:T56, ($O$30:$O$60)), 0)), INDEX(($P$30:$P$60), MATCH(0, COUNTIF($T$29:T56, ($P$30:$P$60)), 0))), \"\")","v":""},{"$f":"IFERROR(IFERROR(INDEX(($Q$30:$Q$60), MATCH(0, COUNTIF($U$29:U56, ($Q$30:$Q$60)), 0)), INDEX(($R$30:$R$60), MATCH(0, COUNTIF($U$29:U56, ($R$30:$R$60)), 0))), \"\")","v":""},{"$f":"IFERROR(IFERROR(INDEX(($S$30:$S$60), MATCH(0, COUNTIF($V$29:V56, ($S$30:$S$60)), 0)), INDEX(($T$30:$T$60), MATCH(0, COUNTIF($V$29:V56, ($T$30:$T$60)), 0))), \"\")","v":""},{"$f":"IFERROR(IFERROR(INDEX(($U$30:$U$60), MATCH(0, COUNTIF($W$29:W56, ($U$30:$U$60)), 0)), INDEX(($V$30:$V$60), MATCH(0, COUNTIF($W$29:W56, ($V$30:$V$60)), 0))), \"\")","v":""},{"$f":"IFERROR(INDEX((Data!$AT$33:$AX$82,Data!$AY$33:$BC$82,Data!$BD$33:$BH$82,Data!$BI$33:$BM$82,Data!$BN$33:$BR$82,Data!$BS$33:$BW$82,Data!$BX$33:$CB$82,Data!$CC$33:$CG$82,Data!$CH$33:$CL$82,Data!$CM$33:$CQ$82),$D57,2,CHOOSE(MATCH($Z$14,INDIRECT(\"Data!$AT$\"&$D57+32&\":$CM$\"&$D57+32),0),1,0,0,0,0,2,0,0,0,0,3,0,0,0,0,4,0,0,0,0,5,0,0,0,0,6,0,0,0,0,7,0,0,0,0,8,0,0,0,0,9,0,0,0,0,10)),\"\")","v":0},{"$f":"IFERROR(INDEX((Data!$AT$33:$AX$82,Data!$AY$33:$BC$82,Data!$BD$33:$BH$82,Data!$BI$33:$BM$82,Data!$BN$33:$BR$82,Data!$BS$33:$BW$82,Data!$BX$33:$CB$82,Data!$CC$33:$CG$82,Data!$CH$33:$CL$82,Data!$CM$33:$CQ$82),$D57,3,CHOOSE(MATCH($Z$14,INDIRECT(\"Data!$AT$\"&$D57+32&\":$CM$\"&$D57+32),0),1,0,0,0,0,2,0,0,0,0,3,0,0,0,0,4,0,0,0,0,5,0,0,0,0,6,0,0,0,0,7,0,0,0,0,8,0,0,0,0,9,0,0,0,0,10)),\"\")","v":0},{"$f":"IFERROR(INDEX((Data!$AT$33:$AX$82,Data!$AY$33:$BC$82,Data!$BD$33:$BH$82,Data!$BI$33:$BM$82,Data!$BN$33:$BR$82,Data!$BS$33:$BW$82,Data!$BX$33:$CB$82,Data!$CC$33:$CG$82,Data!$CH$33:$CL$82,Data!$CM$33:$CQ$82),$D57,4,CHOOSE(MATCH($Z$14,INDIRECT(\"Data!$AT$\"&$D57+32&\":$CM$\"&$D57+32),0),1,0,0,0,0,2,0,0,0,0,3,0,0,0,0,4,0,0,0,0,5,0,0,0,0,6,0,0,0,0,7,0,0,0,0,8,0,0,0,0,9,0,0,0,0,10)),\"\")","v":3},{"$f":"IFERROR(INDEX((Data!$AT$33:$AX$82,Data!$AY$33:$BC$82,Data!$BD$33:$BH$82,Data!$BI$33:$BM$82,Data!$BN$33:$BR$82,Data!$BS$33:$BW$82,Data!$BX$33:$CB$82,Data!$CC$33:$CG$82,Data!$CH$33:$CL$82,Data!$CM$33:$CQ$82),$D57,5,CHOOSE(MATCH($Z$14,INDIRECT(\"Data!$AT$\"&$D57+32&\":$CM$\"&$D57+32),0),1,0,0,0,0,2,0,0,0,0,3,0,0,0,0,4,0,0,0,0,5,0,0,0,0,6,0,0,0,0,7,0,0,0,0,8,0,0,0,0,9,0,0,0,0,10)),\"\")","v":0},3]
[null,{"$f":"'Report A'!$B60","v":"2014-07-29"},{"$f":"'Report A'!$C60","v":"Tuesday ++"},{"$f":"'Report A'!$D60","v":29},"K-Lunch","LOK-LOK","Member 30%","Member Package","Tiger (2+1) Round","Student Member Card","Student Member Price",0,0,0,{"$f":"IFERROR(IFERROR(INDEX(($E$30:$E$60), MATCH(0, COUNTIF($O$29:O57, ($E$30:$E$60)), 0)), INDEX(($F$30:$F$60), MATCH(0, COUNTIF($O$29:O57, ($F$30:$F$60)), 0))), \"\")","v":""},{"$f":"IFERROR(IFERROR(INDEX(($G$30:$G$60), MATCH(0, COUNTIF($P$29:P57, ($G$30:$G$60)), 0)), INDEX(($H$30:$H$60), MATCH(0, COUNTIF($P$29:P57, ($H$30:$H$60)), 0))), \"\")","v":""},{"$f":"IFERROR(IFERROR(INDEX(($I$30:$I$60), MATCH(0, COUNTIF($Q$29:Q57, ($I$30:$I$60)), 0)), INDEX(($J$30:$J$60), MATCH(0, COUNTIF($Q$29:Q57, ($J$30:$J$60)), 0))), \"\")","v":""},{"$f":"IFERROR(IFERROR(INDEX(($K$30:$K$60), MATCH(0, COUNTIF($R$29:R57, ($K$30:$K$60)), 0)), INDEX(($L$30:$L$60), MATCH(0, COUNTIF($R$29:R57, ($L$30:$L$60)), 0))), \"\")","v":""},{"$f":"IFERROR(IFERROR(INDEX(($M$30:$M$60), MATCH(0, COUNTIF($S$29:S57, ($M$30:$M$60)), 0)), INDEX(($N$30:$N$60), MATCH(0, COUNTIF($S$29:S57, ($N$30:$N$60)), 0))), \"\")","v":""},{"$f":"IFERROR(IFERROR(INDEX(($O$30:$O$60), MATCH(0, COUNTIF($T$29:T57, ($O$30:$O$60)), 0)), INDEX(($P$30:$P$60), MATCH(0, COUNTIF($T$29:T57, ($P$30:$P$60)), 0))), \"\")","v":""},{"$f":"IFERROR(IFERROR(INDEX(($Q$30:$Q$60), MATCH(0, COUNTIF($U$29:U57, ($Q$30:$Q$60)), 0)), INDEX(($R$30:$R$60), MATCH(0, COUNTIF($U$29:U57, ($R$30:$R$60)), 0))), \"\")","v":""},{"$f":"IFERROR(IFERROR(INDEX(($S$30:$S$60), MATCH(0, COUNTIF($V$29:V57, ($S$30:$S$60)), 0)), INDEX(($T$30:$T$60), MATCH(0, COUNTIF($V$29:V57, ($T$30:$T$60)), 0))), \"\")","v":""},{"$f":"IFERROR(IFERROR(INDEX(($U$30:$U$60), MATCH(0, COUNTIF($W$29:W57, ($U$30:$U$60)), 0)), INDEX(($V$30:$V$60), MATCH(0, COUNTIF($W$29:W57, ($V$30:$V$60)), 0))), \"\")","v":""},{"$f":"IFERROR(INDEX((Data!$AT$33:$AX$82,Data!$AY$33:$BC$82,Data!$BD$33:$BH$82,Data!$BI$33:$BM$82,Data!$BN$33:$BR$82,Data!$BS$33:$BW$82,Data!$BX$33:$CB$82,Data!$CC$33:$CG$82,Data!$CH$33:$CL$82,Data!$CM$33:$CQ$82),$D58,2,CHOOSE(MATCH($Z$14,INDIRECT(\"Data!$AT$\"&$D58+32&\":$CM$\"&$D58+32),0),1,0,0,0,0,2,0,0,0,0,3,0,0,0,0,4,0,0,0,0,5,0,0,0,0,6,0,0,0,0,7,0,0,0,0,8,0,0,0,0,9,0,0,0,0,10)),\"\")","v":0},{"$f":"IFERROR(INDEX((Data!$AT$33:$AX$82,Data!$AY$33:$BC$82,Data!$BD$33:$BH$82,Data!$BI$33:$BM$82,Data!$BN$33:$BR$82,Data!$BS$33:$BW$82,Data!$BX$33:$CB$82,Data!$CC$33:$CG$82,Data!$CH$33:$CL$82,Data!$CM$33:$CQ$82),$D58,3,CHOOSE(MATCH($Z$14,INDIRECT(\"Data!$AT$\"&$D58+32&\":$CM$\"&$D58+32),0),1,0,0,0,0,2,0,0,0,0,3,0,0,0,0,4,0,0,0,0,5,0,0,0,0,6,0,0,0,0,7,0,0,0,0,8,0,0,0,0,9,0,0,0,0,10)),\"\")","v":0},{"$f":"IFERROR(INDEX((Data!$AT$33:$AX$82,Data!$AY$33:$BC$82,Data!$BD$33:$BH$82,Data!$BI$33:$BM$82,Data!$BN$33:$BR$82,Data!$BS$33:$BW$82,Data!$BX$33:$CB$82,Data!$CC$33:$CG$82,Data!$CH$33:$CL$82,Data!$CM$33:$CQ$82),$D58,4,CHOOSE(MATCH($Z$14,INDIRECT(\"Data!$AT$\"&$D58+32&\":$CM$\"&$D58+32),0),1,0,0,0,0,2,0,0,0,0,3,0,0,0,0,4,0,0,0,0,5,0,0,0,0,6,0,0,0,0,7,0,0,0,0,8,0,0,0,0,9,0,0,0,0,10)),\"\")","v":0},{"$f":"IFERROR(INDEX((Data!$AT$33:$AX$82,Data!$AY$33:$BC$82,Data!$BD$33:$BH$82,Data!$BI$33:$BM$82,Data!$BN$33:$BR$82,Data!$BS$33:$BW$82,Data!$BX$33:$CB$82,Data!$CC$33:$CG$82,Data!$CH$33:$CL$82,Data!$CM$33:$CQ$82),$D58,5,CHOOSE(MATCH($Z$14,INDIRECT(\"Data!$AT$\"&$D58+32&\":$CM$\"&$D58+32),0),1,0,0,0,0,2,0,0,0,0,3,0,0,0,0,4,0,0,0,0,5,0,0,0,0,6,0,0,0,0,7,0,0,0,0,8,0,0,0,0,9,0,0,0,0,10)),\"\")","v":0},0]
[null,{"$f":"'Report A'!$B61","v":"2014-07-30"},{"$f":"'Report A'!$C61","v":"Wednesday"},{"$f":"'Report A'!$D61","v":30},"K-Lunch","LOK-LOK","Member 30%","Member Package","Tiger (2+1) Round","Student Member Card","Student Member Price",0,0,0,{"$f":"IFERROR(IFERROR(INDEX(($E$30:$E$60), MATCH(0, COUNTIF($O$29:O58, ($E$30:$E$60)), 0)), INDEX(($F$30:$F$60), MATCH(0, COUNTIF($O$29:O58, ($F$30:$F$60)), 0))), \"\")","v":""},{"$f":"IFERROR(IFERROR(INDEX(($G$30:$G$60), MATCH(0, COUNTIF($P$29:P58, ($G$30:$G$60)), 0)), INDEX(($H$30:$H$60), MATCH(0, COUNTIF($P$29:P58, ($H$30:$H$60)), 0))), \"\")","v":""},{"$f":"IFERROR(IFERROR(INDEX(($I$30:$I$60), MATCH(0, COUNTIF($Q$29:Q58, ($I$30:$I$60)), 0)), INDEX(($J$30:$J$60), MATCH(0, COUNTIF($Q$29:Q58, ($J$30:$J$60)), 0))), \"\")","v":""},{"$f":"IFERROR(IFERROR(INDEX(($K$30:$K$60), MATCH(0, COUNTIF($R$29:R58, ($K$30:$K$60)), 0)), INDEX(($L$30:$L$60), MATCH(0, COUNTIF($R$29:R58, ($L$30:$L$60)), 0))), \"\")","v":""},{"$f":"IFERROR(IFERROR(INDEX(($M$30:$M$60), MATCH(0, COUNTIF($S$29:S58, ($M$30:$M$60)), 0)), INDEX(($N$30:$N$60), MATCH(0, COUNTIF($S$29:S58, ($N$30:$N$60)), 0))), \"\")","v":""},{"$f":"IFERROR(IFERROR(INDEX(($O$30:$O$60), MATCH(0, COUNTIF($T$29:T58, ($O$30:$O$60)), 0)), INDEX(($P$30:$P$60), MATCH(0, COUNTIF($T$29:T58, ($P$30:$P$60)), 0))), \"\")","v":""},{"$f":"IFERROR(IFERROR(INDEX(($Q$30:$Q$60), MATCH(0, COUNTIF($U$29:U58, ($Q$30:$Q$60)), 0)), INDEX(($R$30:$R$60), MATCH(0, COUNTIF($U$29:U58, ($R$30:$R$60)), 0))), \"\")","v":""},{"$f":"IFERROR(IFERROR(INDEX(($S$30:$S$60), MATCH(0, COUNTIF($V$29:V58, ($S$30:$S$60)), 0)), INDEX(($T$30:$T$60), MATCH(0, COUNTIF($V$29:V58, ($T$30:$T$60)), 0))), \"\")","v":""},{"$f":"IFERROR(IFERROR(INDEX(($U$30:$U$60), MATCH(0, COUNTIF($W$29:W58, ($U$30:$U$60)), 0)), INDEX(($V$30:$V$60), MATCH(0, COUNTIF($W$29:W58, ($V$30:$V$60)), 0))), \"\")","v":""},{"$f":"IFERROR(INDEX((Data!$AT$33:$AX$82,Data!$AY$33:$BC$82,Data!$BD$33:$BH$82,Data!$BI$33:$BM$82,Data!$BN$33:$BR$82,Data!$BS$33:$BW$82,Data!$BX$33:$CB$82,Data!$CC$33:$CG$82,Data!$CH$33:$CL$82,Data!$CM$33:$CQ$82),$D59,2,CHOOSE(MATCH($Z$14,INDIRECT(\"Data!$AT$\"&$D59+32&\":$CM$\"&$D59+32),0),1,0,0,0,0,2,0,0,0,0,3,0,0,0,0,4,0,0,0,0,5,0,0,0,0,6,0,0,0,0,7,0,0,0,0,8,0,0,0,0,9,0,0,0,0,10)),\"\")","v":0},{"$f":"IFERROR(INDEX((Data!$AT$33:$AX$82,Data!$AY$33:$BC$82,Data!$BD$33:$BH$82,Data!$BI$33:$BM$82,Data!$BN$33:$BR$82,Data!$BS$33:$BW$82,Data!$BX$33:$CB$82,Data!$CC$33:$CG$82,Data!$CH$33:$CL$82,Data!$CM$33:$CQ$82),$D59,3,CHOOSE(MATCH($Z$14,INDIRECT(\"Data!$AT$\"&$D59+32&\":$CM$\"&$D59+32),0),1,0,0,0,0,2,0,0,0,0,3,0,0,0,0,4,0,0,0,0,5,0,0,0,0,6,0,0,0,0,7,0,0,0,0,8,0,0,0,0,9,0,0,0,0,10)),\"\")","v":0},{"$f":"IFERROR(INDEX((Data!$AT$33:$AX$82,Data!$AY$33:$BC$82,Data!$BD$33:$BH$82,Data!$BI$33:$BM$82,Data!$BN$33:$BR$82,Data!$BS$33:$BW$82,Data!$BX$33:$CB$82,Data!$CC$33:$CG$82,Data!$CH$33:$CL$82,Data!$CM$33:$CQ$82),$D59,4,CHOOSE(MATCH($Z$14,INDIRECT(\"Data!$AT$\"&$D59+32&\":$CM$\"&$D59+32),0),1,0,0,0,0,2,0,0,0,0,3,0,0,0,0,4,0,0,0,0,5,0,0,0,0,6,0,0,0,0,7,0,0,0,0,8,0,0,0,0,9,0,0,0,0,10)),\"\")","v":0},{"$f":"IFERROR(INDEX((Data!$AT$33:$AX$82,Data!$AY$33:$BC$82,Data!$BD$33:$BH$82,Data!$BI$33:$BM$82,Data!$BN$33:$BR$82,Data!$BS$33:$BW$82,Data!$BX$33:$CB$82,Data!$CC$33:$CG$82,Data!$CH$33:$CL$82,Data!$CM$33:$CQ$82),$D59,5,CHOOSE(MATCH($Z$14,INDIRECT(\"Data!$AT$\"&$D59+32&\":$CM$\"&$D59+32),0),1,0,0,0,0,2,0,0,0,0,3,0,0,0,0,4,0,0,0,0,5,0,0,0,0,6,0,0,0,0,7,0,0,0,0,8,0,0,0,0,9,0,0,0,0,10)),\"\")","v":0},0]
[null,{"$f":"'Report A'!$B62","v":"2014-07-31"},{"$f":"'Report A'!$C62","v":"Thursday"},{"$f":"'Report A'!$D62","v":31},"K-Lunch","LOK-LOK","Member 30%","Member Package","Tiger (2+1) Round","Student Member Card","Student Member Price",0,0,0,{"$f":"IFERROR(IFERROR(INDEX(($E$30:$E$60), MATCH(0, COUNTIF($O$29:O59, ($E$30:$E$60)), 0)), INDEX(($F$30:$F$60), MATCH(0, COUNTIF($O$29:O59, ($F$30:$F$60)), 0))), \"\")","v":""},{"$f":"IFERROR(IFERROR(INDEX(($G$30:$G$60), MATCH(0, COUNTIF($P$29:P59, ($G$30:$G$60)), 0)), INDEX(($H$30:$H$60), MATCH(0, COUNTIF($P$29:P59, ($H$30:$H$60)), 0))), \"\")","v":""},{"$f":"IFERROR(IFERROR(INDEX(($I$30:$I$60), MATCH(0, COUNTIF($Q$29:Q59, ($I$30:$I$60)), 0)), INDEX(($J$30:$J$60), MATCH(0, COUNTIF($Q$29:Q59, ($J$30:$J$60)), 0))), \"\")","v":""},{"$f":"IFERROR(IFERROR(INDEX(($K$30:$K$60), MATCH(0, COUNTIF($R$29:R59, ($K$30:$K$60)), 0)), INDEX(($L$30:$L$60), MATCH(0, COUNTIF($R$29:R59, ($L$30:$L$60)), 0))), \"\")","v":""},{"$f":"IFERROR(IFERROR(INDEX(($M$30:$M$60), MATCH(0, COUNTIF($S$29:S59, ($M$30:$M$60)), 0)), INDEX(($N$30:$N$60), MATCH(0, COUNTIF($S$29:S59, ($N$30:$N$60)), 0))), \"\")","v":""},{"$f":"IFERROR(IFERROR(INDEX(($O$30:$O$60), MATCH(0, COUNTIF($T$29:T59, ($O$30:$O$60)), 0)), INDEX(($P$30:$P$60), MATCH(0, COUNTIF($T$29:T59, ($P$30:$P$60)), 0))), \"\")","v":""},{"$f":"IFERROR(IFERROR(INDEX(($Q$30:$Q$60), MATCH(0, COUNTIF($U$29:U59, ($Q$30:$Q$60)), 0)), INDEX(($R$30:$R$60), MATCH(0, COUNTIF($U$29:U59, ($R$30:$R$60)), 0))), \"\")","v":""},{"$f":"IFERROR(IFERROR(INDEX(($S$30:$S$60), MATCH(0, COUNTIF($V$29:V59, ($S$30:$S$60)), 0)), INDEX(($T$30:$T$60), MATCH(0, COUNTIF($V$29:V59, ($T$30:$T$60)), 0))), \"\")","v":""},{"$f":"IFERROR(IFERROR(INDEX(($U$30:$U$60), MATCH(0, COUNTIF($W$29:W59, ($U$30:$U$60)), 0)), INDEX(($V$30:$V$60), MATCH(0, COUNTIF($W$29:W59, ($V$30:$V$60)), 0))), \"\")","v":""},{"$f":"IFERROR(INDEX((Data!$AT$33:$AX$82,Data!$AY$33:$BC$82,Data!$BD$33:$BH$82,Data!$BI$33:$BM$82,Data!$BN$33:$BR$82,Data!$BS$33:$BW$82,Data!$BX$33:$CB$82,Data!$CC$33:$CG$82,Data!$CH$33:$CL$82,Data!$CM$33:$CQ$82),$D60,2,CHOOSE(MATCH($Z$14,INDIRECT(\"Data!$AT$\"&$D60+32&\":$CM$\"&$D60+32),0),1,0,0,0,0,2,0,0,0,0,3,0,0,0,0,4,0,0,0,0,5,0,0,0,0,6,0,0,0,0,7,0,0,0,0,8,0,0,0,0,9,0,0,0,0,10)),\"\")","v":0},{"$f":"IFERROR(INDEX((Data!$AT$33:$AX$82,Data!$AY$33:$BC$82,Data!$BD$33:$BH$82,Data!$BI$33:$BM$82,Data!$BN$33:$BR$82,Data!$BS$33:$BW$82,Data!$BX$33:$CB$82,Data!$CC$33:$CG$82,Data!$CH$33:$CL$82,Data!$CM$33:$CQ$82),$D60,3,CHOOSE(MATCH($Z$14,INDIRECT(\"Data!$AT$\"&$D60+32&\":$CM$\"&$D60+32),0),1,0,0,0,0,2,0,0,0,0,3,0,0,0,0,4,0,0,0,0,5,0,0,0,0,6,0,0,0,0,7,0,0,0,0,8,0,0,0,0,9,0,0,0,0,10)),\"\")","v":0},{"$f":"IFERROR(INDEX((Data!$AT$33:$AX$82,Data!$AY$33:$BC$82,Data!$BD$33:$BH$82,Data!$BI$33:$BM$82,Data!$BN$33:$BR$82,Data!$BS$33:$BW$82,Data!$BX$33:$CB$82,Data!$CC$33:$CG$82,Data!$CH$33:$CL$82,Data!$CM$33:$CQ$82),$D60,4,CHOOSE(MATCH($Z$14,INDIRECT(\"Data!$AT$\"&$D60+32&\":$CM$\"&$D60+32),0),1,0,0,0,0,2,0,0,0,0,3,0,0,0,0,4,0,0,0,0,5,0,0,0,0,6,0,0,0,0,7,0,0,0,0,8,0,0,0,0,9,0,0,0,0,10)),\"\")","v":0},{"$f":"IFERROR(INDEX((Data!$AT$33:$AX$82,Data!$AY$33:$BC$82,Data!$BD$33:$BH$82,Data!$BI$33:$BM$82,Data!$BN$33:$BR$82,Data!$BS$33:$BW$82,Data!$BX$33:$CB$82,Data!$CC$33:$CG$82,Data!$CH$33:$CL$82,Data!$CM$33:$CQ$82),$D60,5,CHOOSE(MATCH($Z$14,INDIRECT(\"Data!$AT$\"&$D60+32&\":$CM$\"&$D60+32),0),1,0,0,0,0,2,0,0,0,0,3,0,0,0,0,4,0,0,0,0,5,0,0,0,0,6,0,0,0,0,7,0,0,0,0,8,0,0,0,0,9,0,0,0,0,10)),\"\")","v":0},0]

{"sheet":"Report F","index":7,"n_rows":60,"n_cols":10,"rows_kept":60,"cut":false,"hidden":false,"merged":[]}
[]
[]
[null,null,"MONTHLY SALES REPORTING BY OUTLET"]
[]
[]
[null,"SUBJECT","REPORT F : PERFORMANCE OF F&B SALES AND MEMBERSHIP SUBSCRIPTIONS"]
[]
[null,"OUTLET",{"$f":"Data!$C$8","v":"TSU"}]
[]
[null,"MONTH / YEAR",{"$f":"Data!$C$10","v":"July 2014"}]
[]
[null,"MENU"]
[]
[null,"DATE","DAY","ROW","CHOOSE CATEGORY",null,"MEAL",null,null,{"$f":"\"CHART : SALES PERFORMANCE OF \"&$G$14","v":"CHART : SALES PERFORMANCE OF MEAL"}]
[]
[null,null,null,null,"NOON K","HAPPY","NORMAL","MIDNIGHT","ALL"]
[null,null,null,null,{"$f":"IF(OR($G$14=\"BEER EXCHANGE\",$G$14=\"BEER PACKAGE\",$G$14=\"BEER SIDE ORDER\",$G$14=\"LIQUOR PACKAGE\",$G$14=\"LIQUOR SIDE ORDER\",$G$14=\"WINE\"),\"( bottle )\",IF($G$14=\"MEAL\",\"( set )\",\"( subsription )\"))","v":"( set )"},{"$f":"$E$17","v":"( set )"},{"$f":"$E$17","v":"( set )"},"( set )","( set )"]
[null,"SUMMARY FOR MONTH",null,null,null,null,null,null,null,"LEGEND"]
[null,{"$f":"\"TOTAL \"&IF($G$14=\"MEMBERSHIP\",\"SUBSCRIPTIONS\",\"SALES\")","v":"TOTAL SALES"},null,null,{"$f":"SUM(E$30:E$60)","v":0},{"$f":"SUM(F$30:F$60)","v":0},2186,0,2186]
[null,{"$f":"\"AVERAGE \"&IF($G$14=\"MEMBERSHIP\",\"SUBSCRIPTIONS\",\"SALES\")","v":"AVERAGE SALES"},null,null,{"$f":"IFERROR(SUM(E$30:E$60)/COUNTIF($D$30:$D$60,\">0\"),\"\")","v":0},{"$f":"IFERROR(SUM(F$30:F$60)/COUNTIF($D$30:$D$60,\">0\"),\"\")","v":0},70.516129032258064,0,70.516129032258064]
[null,{"$f":"\"HIGHEST \"&IF($G$14=\"MEMBERSHIP\",\"SUBSCRIPTIONS\",\"SALES\")","v":"HIGHEST SALES"},null,null,{"$f":"IFERROR(IF(LARGE(E$30:E$60,1)>0,LARGE(E$30:E$60,1),\"NIL\"),\"NIL\")","v":"NIL"},{"$f":"IFERROR(IF(LARGE(F$30:F$60,1)>0,LARGE(F$30:F$60,1),\"NIL\"),\"NIL\")","v":"NIL"},119,"NIL",119]
[null,{"$f":"\"LOWEST \"&IF($G$14=\"MEMBERSHIP\",\"SUBSCRIPTIONS\",\"SALES\")","v":"LOWEST SALES"},null,null,{"$f":"IFERROR(IF(LARGE(E$30:E$60,COUNTIF(E$30:E$60,\">0\"))<>E$21,LARGE(E$30:E$60,COUNTIF(E$30:E$60,\">0\")),\"NIL\"),\"NIL\")","v":"NIL"},{"$f":"IFERROR(IF(LARGE(F$30:F$60,COUNTIF(F$30:F$60,\">0\"))<>F$21,LARGE(F$30:F$60,COUNTIF(F$30:F$60,\">0\")),\"NIL\"),\"NIL\")","v":"NIL"},{"$f":"IFERROR(IF(LARGE(G$30:G$60,COUNTIF(G$30:G$60,\">0\"))<>G$21,LARGE(G$30:G$60,COUNTIF(G$30:G$60,\">0\")),\"NIL\"),\"NIL\")","v":15},{"$f":"IFERROR(IF(LARGE(H$30:H$60,COUNTIF(H$30:H$60,\">0\"))<>H$21,LARGE(H$30:H$60,COUNTIF(H$30:H$60,\">0\")),\"NIL\"),\"NIL\")","v":"NIL"},{"$f":"IFERROR(IF(LARGE(I$30:I$60,COUNTIF(I$30:I$60,\">0\"))<>I$21,LARGE(I$30:I$60,COUNTIF(I$30:I$60,\">0\")),\"NIL\"),\"NIL\")","v":15}]
[null,"AVERAGE FOR ","MONDAY",null,{"$f":"IFERROR(SUMIF($C$30:$C$60,\"Monday*\",E$30:E$60)/COUNTIF($C$30:$C$60,\"Monday*\"),\"\")","v":0},{"$f":"IFERROR(SUMIF($C$30:$C$60,\"Monday*\",F$30:F$60)/COUNTIF($C$30:$C$60,\"Monday*\"),\"\")","v":0},58.75,0,58.75]
[null,null,"TUESDAY",null,{"$f":"IFERROR(SUMIF($C$30:$C$60,\"Tuesday*\",E$30:E$60)/COUNTIF($C$30:$C$60,\"Tuesday*\"),\"\")","v":0},{"$f":"IFERROR(SUMIF($C$30:$C$60,\"Tuesday*\",F$30:F$60)/COUNTIF($C$30:$C$60,\"Tuesday*\"),\"\")","v":0},65,0,65]
[null,null,"WEDNESDAY",null,{"$f":"IFERROR(SUMIF($C$30:$C$60,\"Wednesday*\",E$30:E$60)/COUNTIF($C$30:$C$60,\"Wednesday*\"),\"\")","v":0},{"$f":"IFERROR(SUMIF($C$30:$C$60,\"Wednesday*\",F$30:F$60)/COUNTIF($C$30:$C$60,\"Wednesday*\"),\"\")","v":0},62.6,0,62.6]
[null,null,"THURSDAY",null,{"$f":"IFERROR(SUMIF($C$30:$C$60,\"Thursday*\",E$30:E$60)/COUNTIF($C$30:$C$60,\"Thursday*\"),\"\")","v":0},{"$f":"IFERROR(SUMIF($C$30:$C$60,\"Thursday*\",F$30:F$60)/COUNTIF($C$30:$C$60,\"Thursday*\"),\"\")","v":0},48.2,0,48.2]
[null,null,"FRIDAY",null,{"$f":"IFERROR(SUMIF($C$30:$C$60,\"Friday*\",E$30:E$60)/COUNTIF($C$30:$C$60,\"Friday*\"),\"\")","v":0},{"$f":"IFERROR(SUMIF($C$30:$C$60,\"Friday*\",F$30:F$60)/COUNTIF($C$30:$C$60,\"Friday*\"),\"\")","v":0},71.5,0,71.5]
[null,null,"SATURDAY",null,{"$f":"IFERROR(SUMIF($C$30:$C$60,\"Saturday*\",E$30:E$60)/COUNTIF($C$30:$C$60,\"Saturday*\"),\"\")","v":0},{"$f":"IFERROR(SUMIF($C$30:$C$60,\"Saturday*\",F$30:F$60)/COUNTIF($C$30:$C$60,\"Saturday*\"),\"\")","v":0},107.25,0,107.25]
[null,null,"SUNDAY",null,{"$f":"IFERROR(SUMIF($C$30:$C$60,\"Sunday*\",E$30:E$60)/COUNTIF($C$30:$C$60,\"Sunday*\"),\"\")","v":0},{"$f":"IFERROR(SUMIF($C$30:$C$60,\"Sunday*\",F$30:F$60)/COUNTIF($C$30:$C$60,\"Sunday*\"),\"\")","v":0},89.25,0,89.25]
[null,{"$f":"'Report A'!$B32","v":"2014-07-01"},{"$f":"'Report A'!$C32","v":"Tuesday"},{"$f":"'Report A'!$D32","v":1},{"$f":"IFERROR(IF($G$14=\"BEER EXCHANGE\",INDEX(Data!$DD$33:$DG$82,$D30,1),IF($G$14=\"BEER PACKAGE\",INDEX(Data!$CZ$33:$DC$82,$D30,1),IF($G$14=\"BEER SIDE ORDER\",(INDEX(Data!$DH$33:$DK$82,$D30,1)+INDEX(Data!$DL$33:$DO$82,$D30,1)+INDEX(Data!$DP$33:$DS$82,$D30,1)),IF($G$14=\"LIQUOR PACKAGE\",INDEX(Data!$DT$33:$DW$82,$D30,1),IF($G$14=\"LIQUOR SIDE ORDER\",INDEX(Data!$DX$33:$EA$82,$D30,1),IF($G$14=\"MEAL\",INDEX(Data!$CR$33:$CU$82,$D30,1),IF($G$14=\"MEMBERSHIP\",INDEX(Data!$CV$33:$CY$82,$D30,1),IF($G$14=\"WINE\",INDEX(Data!$EB$33:$EE$82,$D30,1),\"\")))))))),\"\")","v":0},{"$f":"IFERROR(IF($G$14=\"BEER EXCHANGE\",INDEX(Data!$DD$33:$DG$82,$D30,2),IF($G$14=\"BEER PACKAGE\",INDEX(Data!$CZ$33:$DC$82,$D30,2),IF($G$14=\"BEER SIDE ORDER\",(INDEX(Data!$DH$33:$DK$82,$D30,2)+INDEX(Data!$DL$33:$DO$82,$D30,2)+INDEX(Data!$DP$33:$DS$82,$D30,2)),IF($G$14=\"LIQUOR PACKAGE\",INDEX(Data!$DT$33:$DW$82,$D30,2),IF($G$14=\"LIQUOR SIDE ORDER\",INDEX(Data!$DX$33:$EA$82,$D30,2),IF($G$14=\"MEAL\",INDEX(Data!$CR$33:$CU$82,$D30,2),IF($G$14=\"MEMBERSHIP\",INDEX(Data!$CV$33:$CY$82,$D30,2),IF($G$14=\"WINE\",INDEX(Data!$EB$33:$EE$82,$D30,2),\"\")))))))),\"\")","v":0},{"$f":"IFERROR(IF($G$14=\"BEER EXCHANGE\",INDEX(Data!$DD$33:$DG$82,$D30,3),IF($G$14=\"BEER PACKAGE\",INDEX(Data!$CZ$33:$DC$82,$D30,3),IF($G$14=\"BEER SIDE ORDER\",(INDEX(Data!$DH$33:$DK$82,$D30,3)+INDEX(Data!$DL$33:$DO$82,$D30,3)+INDEX(Data!$DP$33:$DS$82,$D30,3)),IF($G$14=\"LIQUOR PACKAGE\",INDEX(Data!$DT$33:$DW$82,$D30,3),IF($G$14=\"LIQUOR SIDE ORDER\",INDEX(Data!$DX$33:$EA$82,$D30,3),IF($G$14=\"MEAL\",INDEX(Data!$CR$33:$CU$82,$D30,3),IF($G$14=\"MEMBERSHIP\",INDEX(Data!$CV$33:$CY$82,$D30,3),IF($G$14=\"WINE\",INDEX(Data!$EB$33:$EE$82,$D30,3),\"\")))))))),\"\")","v":58},{"$f":"IFERROR(IF($G$14=\"BEER EXCHANGE\",INDEX(Data!$DD$33:$DG$82,$D30,4),IF($G$14=\"BEER PACKAGE\",INDEX(Data!$CZ$33:$DC$82,$D30,4),IF($G$14=\"BEER SIDE ORDER\",(INDEX(Data!$DH$33:$DK$82,$D30,4)+INDEX(Data!$DL$33:$DO$82,$D30,4)+INDEX(Data!$DP$33:$DS$82,$D30,4)),IF($G$14=\"LIQUOR PACKAGE\",INDEX(Data!$DT$33:$DW$82,$D30,4),IF($G$14=\"LIQUOR SIDE ORDER\",INDEX(Data!$DX$33:$EA$82,$D30,4),IF($G$14=\"MEAL\",INDEX(Data!$CR$33:$CU$82,$D30,4),IF($G$14=\"MEMBERSHIP\",INDEX(Data!$CV$33:$CY$82,$D30,4),IF($G$14=\"WINE\",INDEX(Data!$EB$33:$EE$82,$D30,4),\"\")))))))),\"\")","v":0},{"$f":"IFERROR(SUM($E30:$H30),\"\")","v":58}]
[null,{"$f":"'Report A'!$B33","v":"2014-07-02"},{"$f":"'Report A'!$C33","v":"Wednesday"},{"$f":"'Report A'!$D33","v":2},{"$f":"IFERROR(IF($G$14=\"BEER EXCHANGE\",INDEX(Data!$DD$33:$DG$82,$D31,1),IF($G$14=\"BEER PACKAGE\",INDEX(Data!$CZ$33:$DC$82,$D31,1),IF($G$14=\"BEER SIDE ORDER\",(INDEX(Data!$DH$33:$DK$82,$D31,1)+INDEX(Data!$DL$33:$DO$82,$D31,1)+INDEX(Data!$DP$33:$DS$82,$D31,1)),IF($G$14=\"LIQUOR PACKAGE\",INDEX(Data!$DT$33:$DW$82,$D31,1),IF($G$14=\"LIQUOR SIDE ORDER\",INDEX(Data!$DX$33:$EA$82,$D31,1),IF($G$14=\"MEAL\",INDEX(Data!$CR$33:$CU$82,$D31,1),IF($G$14=\"MEMBERSHIP\",INDEX(Data!$CV$33:$CY$82,$D31,1),IF($G$14=\"WINE\",INDEX(Data!$EB$33:$EE$82,$D31,1),\"\")))))))),\"\")","v":0},{"$f":"IFERROR(IF($G$14=\"BEER EXCHANGE\",INDEX(Data!$DD$33:$DG$82,$D31,2),IF($G$14=\"BEER PACKAGE\",INDEX(Data!$CZ$33:$DC$82,$D31,2),IF($G$14=\"BEER SIDE ORDER\",(INDEX(Data!$DH$33:$DK$82,$D31,2)+INDEX(Data!$DL$33:$DO$82,$D31,2)+INDEX(Data!$DP$33:$DS$82,$D31,2)),IF($G$14=\"LIQUOR PACKAGE\",INDEX(Data!$DT$33:$DW$82,$D31,2),IF($G$14=\"LIQUOR SIDE ORDER\",INDEX(Data!$DX$33:$EA$82,$D31,2),IF($G$14=\"MEAL\",INDEX(Data!$CR$33:$CU$82,$D31,2),IF($G$14=\"MEMBERSHIP\",INDEX(Data!$CV$33:$CY$82,$D31,2),IF($G$14=\"WINE\",INDEX(Data!$EB$33:$EE$82,$D31,2),\"\")))))))),\"\")","v":0},{"$f":"IFERROR(IF($G$14=\"BEER EXCHANGE\",INDEX(Data!$DD$33:$DG$82,$D31,3),IF($G$14=\"BEER PACKAGE\",INDEX(Data!$CZ$33:$DC$82,$D31,3),IF($G$14=\"BEER SIDE ORDER\",(INDEX(Data!$DH$33:$DK$82,$D31,3)+INDEX(Data!$DL$33:$DO$82,$D31,3)+INDEX(Data!$DP$33:$DS$82,$D31,3)),IF($G$14=\"LIQUOR PACKAGE\",INDEX(Data!$DT$33:$DW$82,$D31,3),IF($G$14=\"LIQUOR SIDE ORDER\",INDEX(Data!$DX$33:$EA$82,$D31,3),IF($G$14=\"MEAL\",INDEX(Data!$CR$33:$CU$82,$D31,3),IF($G$14=\"MEMBERSHIP\",INDEX(Data!$CV$33:$CY$82,$D31,3),IF($G$14=\"WINE\",INDEX(Data!$EB$33:$EE$82,$D31,3),\"\")))))))),\"\")","v":41},{"$f":"IFERROR(IF($G$14=\"BEER EXCHANGE\",INDEX(Data!$DD$33:$DG$82,$D31,4),IF($G$14=\"BEER PACKAGE\",INDEX(Data!$CZ$33:$DC$82,$D31,4),IF($G$14=\"BEER SIDE ORDER\",(INDEX(Data!$DH$33:$DK$82,$D31,4)+INDEX(Data!$DL$33:$DO$82,$D31,4)+INDEX(Data!$DP$33:$DS$82,$D31,4)),IF($G$14=\"LIQUOR PACKAGE\",INDEX(Data!$DT$33:$DW$82,$D31,4),IF($G$14=\"LIQUOR SIDE ORDER\",INDEX(Data!$DX$33:$EA$82,$D31,4),IF($G$14=\"MEAL\",INDEX(Data!$CR$33:$CU$82,$D31,4),IF($G$14=\"MEMBERSHIP\",INDEX(Data!$CV$33:$CY$82,$D31,4),IF($G$14=\"WINE\",INDEX(Data!$EB$33:$EE$82,$D31,4),\"\")))))))),\"\")","v":0},{"$f":"IFERROR(SUM($E31:$H31),\"\")","v":41}]
[null,{"$f":"'Report A'!$B34","v":"2014-07-03"},{"$f":"'Report A'!$C34","v":"Thursday"},{"$f":"'Report A'!$D34","v":3},{"$f":"IFERROR(IF($G$14=\"BEER EXCHANGE\",INDEX(Data!$DD$33:$DG$82,$D32,1),IF($G$14=\"BEER PACKAGE\",INDEX(Data!$CZ$33:$DC$82,$D32,1),IF($G$14=\"BEER SIDE ORDER\",(INDEX(Data!$DH$33:$DK$82,$D32,1)+INDEX(Data!$DL$33:$DO$82,$D32,1)+INDEX(Data!$DP$33:$DS$82,$D32,1)),IF($G$14=\"LIQUOR PACKAGE\",INDEX(Data!$DT$33:$DW$82,$D32,1),IF($G$14=\"LIQUOR SIDE ORDER\",INDEX(Data!$DX$33:$EA$82,$D32,1),IF($G$14=\"MEAL\",INDEX(Data!$CR$33:$CU$82,$D32,1),IF($G$14=\"MEMBERSHIP\",INDEX(Data!$CV$33:$CY$82,$D32,1),IF($G$14=\"WINE\",INDEX(Data!$EB$33:$EE$82,$D32,1),\"\")))))))),\"\")","v":0},{"$f":"IFERROR(IF($G$14=\"BEER EXCHANGE\",INDEX(Data!$DD$33:$DG$82,$D32,2),IF($G$14=\"BEER PACKAGE\",INDEX(Data!$CZ$33:$DC$82,$D32,2),IF($G$14=\"BEER SIDE ORDER\",(INDEX(Data!$DH$33:$DK$82,$D32,2)+INDEX(Data!$DL$33:$DO$82,$D32,2)+INDEX(Data!$DP$33:$DS$82,$D32,2)),IF($G$14=\"LIQUOR PACKAGE\",INDEX(Data!$DT$33:$DW$82,$D32,2),IF($G$14=\"LIQUOR SIDE ORDER\",INDEX(Data!$DX$33:$EA$82,$D32,2),IF($G$14=\"MEAL\",INDEX(Data!$CR$33:$CU$82,$D32,2),IF($G$14=\"MEMBERSHIP\",INDEX(Data!$CV$33:$CY$82,$D32,2),IF($G$14=\"WINE\",INDEX(Data!$EB$33:$EE$82,$D32,2),\"\")))))))),\"\")","v":0},{"$f":"IFERROR(IF($G$14=\"BEER EXCHANGE\",INDEX(Data!$DD$33:$DG$82,$D32,3),IF($G$14=\"BEER PACKAGE\",INDEX(Data!$CZ$33:$DC$82,$D32,3),IF($G$14=\"BEER SIDE ORDER\",(INDEX(Data!$DH$33:$DK$82,$D32,3)+INDEX(Data!$DL$33:$DO$82,$D32,3)+INDEX(Data!$DP$33:$DS$82,$D32,3)),IF($G$14=\"LIQUOR PACKAGE\",INDEX(Data!$DT$33:$DW$82,$D32,3),IF($G$14=\"LIQUOR SIDE ORDER\",INDEX(Data!$DX$33:$EA$82,$D32,3),IF($G$14=\"MEAL\",INDEX(Data!$CR$33:$CU$82,$D32,3),IF($G$14=\"MEMBERSHIP\",INDEX(Data!$CV$33:$CY$82,$D32,3),IF($G$14=\"WINE\",INDEX(Data!$EB$33:$EE$82,$D32,3),\"\")))))))),\"\")","v":50},{"$f":"IFERROR(IF($G$14=\"BEER EXCHANGE\",INDEX(Data!$DD$33:$DG$82,$D32,4),IF($G$14=\"BEER PACKAGE\",INDEX(Data!$CZ$33:$DC$82,$D32,4),IF($G$14=\"BEER SIDE ORDER\",(INDEX(Data!$DH$33:$DK$82,$D32,4)+INDEX(Data!$DL$33:$DO$82,$D32,4)+INDEX(Data!$DP$33:$DS$82,$D32,4)),IF($G$14=\"LIQUOR PACKAGE\",INDEX(Data!$DT$33:$DW$82,$D32,4),IF($G$14=\"LIQUOR SIDE ORDER\",INDEX(Data!$DX$33:$EA$82,$D32,4),IF($G$14=\"MEAL\",INDEX(Data!$CR$33:$CU$82,$D32,4),IF($G$14=\"MEMBERSHIP\",INDEX(Data!$CV$33:$CY$82,$D32,4),IF($G$14=\"WINE\",INDEX(Data!$EB$33:$EE$82,$D32,4),\"\")))))))),\"\")","v":0},50]
[null,{"$f":"'Report A'!$B35","v":"2014-07-04"},{"$f":"'Report A'!$C35","v":"Friday"},{"$f":"'Report A'!$D35","v":4},{"$f":"IFERROR(IF($G$14=\"BEER EXCHANGE\",INDEX(Data!$DD$33:$DG$82,$D33,1),IF($G$14=\"BEER PACKAGE\",INDEX(Data!$CZ$33:$DC$82,$D33,1),IF($G$14=\"BEER SIDE ORDER\",(INDEX(Data!$DH$33:$DK$82,$D33,1)+INDEX(Data!$DL$33:$DO$82,$D33,1)+INDEX(Data!$DP$33:$DS$82,$D33,1)),IF($G$14=\"LIQUOR PACKAGE\",INDEX(Data!$DT$33:$DW$82,$D33,1),IF($G$14=\"LIQUOR SIDE ORDER\",INDEX(Data!$DX$33:$EA$82,$D33,1),IF($G$14=\"MEAL\",INDEX(Data!$CR$33:$CU$82,$D33,1),IF($G$14=\"MEMBERSHIP\",INDEX(Data!$CV$33:$CY$82,$D33,1),IF($G$14=\"WINE\",INDEX(Data!$EB$33:$EE$82,$D33,1),\"\")))))))),\"\")","v":0},{"$f":"IFERROR(IF($G$14=\"BEER EXCHANGE\",INDEX(Data!$DD$33:$DG$82,$D33,2),IF($G$14=\"BEER PACKAGE\",INDEX(Data!$CZ$33:$DC$82,$D33,2),IF($G$14=\"BEER SIDE ORDER\",(INDEX(Data!$DH$33:$DK$82,$D33,2)+INDEX(Data!$DL$33:$DO$82,$D33,2)+INDEX(Data!$DP$33:$DS$82,$D33,2)),IF($G$14=\"LIQUOR PACKAGE\",INDEX(Data!$DT$33:$DW$82,$D33,2),IF($G$14=\"LIQUOR SIDE ORDER\",INDEX(Data!$DX$33:$EA$82,$D33,2),IF($G$14=\"MEAL\",INDEX(Data!$CR$33:$CU$82,$D33,2),IF($G$14=\"MEMBERSHIP\",INDEX(Data!$CV$33:$CY$82,$D33,2),IF($G$14=\"WINE\",INDEX(Data!$EB$33:$EE$82,$D33,2),\"\")))))))),\"\")","v":0},{"$f":"IFERROR(IF($G$14=\"BEER EXCHANGE\",INDEX(Data!$DD$33:$DG$82,$D33,3),IF($G$14=\"BEER PACKAGE\",INDEX(Data!$CZ$33:$DC$82,$D33,3),IF($G$14=\"BEER SIDE ORDER\",(INDEX(Data!$DH$33:$DK$82,$D33,3)+INDEX(Data!$DL$33:$DO$82,$D33,3)+INDEX(Data!$DP$33:$DS$82,$D33,3)),IF($G$14=\"LIQUOR PACKAGE\",INDEX(Data!$DT$33:$DW$82,$D33,3),IF($G$14=\"LIQUOR SIDE ORDER\",INDEX(Data!$DX$33:$EA$82,$D33,3),IF($G$14=\"MEAL\",INDEX(Data!$CR$33:$CU$82,$D33,3),IF($G$14=\"MEMBERSHIP\",INDEX(Data!$CV$33:$CY$82,$D33,3),IF($G$14=\"WINE\",INDEX(Data!$EB$33:$EE$82,$D33,3),\"\")))))))),\"\")","v":82},{"$f":"IFERROR(IF($G$14=\"BEER EXCHANGE\",INDEX(Data!$DD$33:$DG$82,$D33,4),IF($G$14=\"BEER PACKAGE\",INDEX(Data!$CZ$33:$DC$82,$D33,4),IF($G$14=\"BEER SIDE ORDER\",(INDEX(Data!$DH$33:$DK$82,$D33,4)+INDEX(Data!$DL$33:$DO$82,$D33,4)+INDEX(Data!$DP$33:$DS$82,$D33,4)),IF($G$14=\"LIQUOR PACKAGE\",INDEX(Data!$DT$33:$DW$82,$D33,4),IF($G$14=\"LIQUOR SIDE ORDER\",INDEX(Data!$DX$33:$EA$82,$D33,4),IF($G$14=\"MEAL\",INDEX(Data!$CR$33:$CU$82,$D33,4),IF($G$14=\"MEMBERSHIP\",INDEX(Data!$CV$33:$CY$82,$D33,4),IF($G$14=\"WINE\",INDEX(Data!$EB$33:$EE$82,$D33,4),\"\")))))))),\"\")","v":0},82]
[null,{"$f":"'Report A'!$B36","v":"2014-07-05"},{"$f":"'Report A'!$C36","v":"Saturday"},{"$f":"'Report A'!$D36","v":5},{"$f":"IFERROR(IF($G$14=\"BEER EXCHANGE\",INDEX(Data!$DD$33:$DG$82,$D34,1),IF($G$14=\"BEER PACKAGE\",INDEX(Data!$CZ$33:$DC$82,$D34,1),IF($G$14=\"BEER SIDE ORDER\",(INDEX(Data!$DH$33:$DK$82,$D34,1)+INDEX(Data!$DL$33:$DO$82,$D34,1)+INDEX(Data!$DP$33:$DS$82,$D34,1)),IF($G$14=\"LIQUOR PACKAGE\",INDEX(Data!$DT$33:$DW$82,$D34,1),IF($G$14=\"LIQUOR SIDE ORDER\",INDEX(Data!$DX$33:$EA$82,$D34,1),IF($G$14=\"MEAL\",INDEX(Data!$CR$33:$CU$82,$D34,1),IF($G$14=\"MEMBERSHIP\",INDEX(Data!$CV$33:$CY$82,$D34,1),IF($G$14=\"WINE\",INDEX(Data!$EB$33:$EE$82,$D34,1),\"\")))))))),\"\")","v":0},{"$f":"IFERROR(IF($G$14=\"BEER EXCHANGE\",INDEX(Data!$DD$33:$DG$82,$D34,2),IF($G$14=\"BEER PACKAGE\",INDEX(Data!$CZ$33:$DC$82,$D34,2),IF($G$14=\"BEER SIDE ORDER\",(INDEX(Data!$DH$33:$DK$82,$D34,2)+INDEX(Data!$DL$33:$DO$82,$D34,2)+INDEX(Data!$DP$33:$DS$82,$D34,2)),IF($G$14=\"LIQUOR PACKAGE\",INDEX(Data!$DT$33:$DW$82,$D34,2),IF($G$14=\"LIQUOR SIDE ORDER\",INDEX(Data!$DX$33:$EA$82,$D34,2),IF($G$14=\"MEAL\",INDEX(Data!$CR$33:$CU$82,$D34,2),IF($G$14=\"MEMBERSHIP\",INDEX(Data!$CV$33:$CY$82,$D34,2),IF($G$14=\"WINE\",INDEX(Data!$EB$33:$EE$82,$D34,2),\"\")))))))),\"\")","v":0},{"$f":"IFERROR(IF($G$14=\"BEER EXCHANGE\",INDEX(Data!$DD$33:$DG$82,$D34,3),IF($G$14=\"BEER PACKAGE\",INDEX(Data!$CZ$33:$DC$82,$D34,3),IF($G$14=\"BEER SIDE ORDER\",(INDEX(Data!$DH$33:$DK$82,$D34,3)+INDEX(Data!$DL$33:$DO$82,$D34,3)+INDEX(Data!$DP$33:$DS$82,$D34,3)),IF($G$14=\"LIQUOR PACKAGE\",INDEX(Data!$DT$33:$DW$82,$D34,3),IF($G$14=\"LIQUOR SIDE ORDER\",INDEX(Data!$DX$33:$EA$82,$D34,3),IF($G$14=\"MEAL\",INDEX(Data!$CR$33:$CU$82,$D34,3),IF($G$14=\"MEMBERSHIP\",INDEX(Data!$CV$33:$CY$82,$D34,3),IF($G$14=\"WINE\",INDEX(Data!$EB$33:$EE$82,$D34,3),\"\")))))))),\"\")","v":115},{"$f":"IFERROR(IF($G$14=\"BEER EXCHANGE\",INDEX(Data!$DD$33:$DG$82,$D34,4),IF($G$14=\"BEER PACKAGE\",INDEX(Data!$CZ$33:$DC$82,$D34,4),IF($G$14=\"BEER SIDE ORDER\",(INDEX(Data!$DH$33:$DK$82,$D34,4)+INDEX(Data!$DL$33:$DO$82,$D34,4)+INDEX(Data!$DP$33:$DS$82,$D34,4)),IF($G$14=\"LIQUOR PACKAGE\",INDEX(Data!$DT$33:$DW$82,$D34,4),IF($G$14=\"LIQUOR SIDE ORDER\",INDEX(Data!$DX$33:$EA$82,$D34,4),IF($G$14=\"MEAL\",INDEX(Data!$CR$33:$CU$82,$D34,4),IF($G$14=\"MEMBERSHIP\",INDEX(Data!$CV$33:$CY$82,$D34,4),IF($G$14=\"WINE\",INDEX(Data!$EB$33:$EE$82,$D34,4),\"\")))))))),\"\")","v":0},115]
[null,{"$f":"'Report A'!$B37","v":"2014-07-06"},{"$f":"'Report A'!$C37","v":"Sunday"},{"$f":"'Report A'!$D37","v":6},{"$f":"IFERROR(IF($G$14=\"BEER EXCHANGE\",INDEX(Data!$DD$33:$DG$82,$D35,1),IF($G$14=\"BEER PACKAGE\",INDEX(Data!$CZ$33:$DC$82,$D35,1),IF($G$14=\"BEER SIDE ORDER\",(INDEX(Data!$DH$33:$DK$82,$D35,1)+INDEX(Data!$DL$33:$DO$82,$D35,1)+INDEX(Data!$DP$33:$DS$82,$D35,1)),IF($G$14=\"LIQUOR PACKAGE\",INDEX(Data!$DT$33:$DW$82,$D35,1),IF($G$14=\"LIQUOR SIDE ORDER\",INDEX(Data!$DX$33:$EA$82,$D35,1),IF($G$14=\"MEAL\",INDEX(Data!$CR$33:$CU$82,$D35,1),IF($G$14=\"MEMBERSHIP\",INDEX(Data!$CV$33:$CY$82,$D35,1),IF($G$14=\"WINE\",INDEX(Data!$EB$33:$EE$82,$D35,1),\"\")))))))),\"\")","v":0},{"$f":"IFERROR(IF($G$14=\"BEER EXCHANGE\",INDEX(Data!$DD$33:$DG$82,$D35,2),IF($G$14=\"BEER PACKAGE\",INDEX(Data!$CZ$33:$DC$82,$D35,2),IF($G$14=\"BEER SIDE ORDER\",(INDEX(Data!$DH$33:$DK$82,$D35,2)+INDEX(Data!$DL$33:$DO$82,$D35,2)+INDEX(Data!$DP$33:$DS$82,$D35,2)),IF($G$14=\"LIQUOR PACKAGE\",INDEX(Data!$DT$33:$DW$82,$D35,2),IF($G$14=\"LIQUOR SIDE ORDER\",INDEX(Data!$DX$33:$EA$82,$D35,2),IF($G$14=\"MEAL\",INDEX(Data!$CR$33:$CU$82,$D35,2),IF($G$14=\"MEMBERSHIP\",INDEX(Data!$CV$33:$CY$82,$D35,2),IF($G$14=\"WINE\",INDEX(Data!$EB$33:$EE$82,$D35,2),\"\")))))))),\"\")","v":0},{"$f":"IFERROR(IF($G$14=\"BEER EXCHANGE\",INDEX(Data!$DD$33:$DG$82,$D35,3),IF($G$14=\"BEER PACKAGE\",INDEX(Data!$CZ$33:$DC$82,$D35,3),IF($G$14=\"BEER SIDE ORDER\",(INDEX(Data!$DH$33:$DK$82,$D35,3)+INDEX(Data!$DL$33:$DO$82,$D35,3)+INDEX(Data!$DP$33:$DS$82,$D35,3)),IF($G$14=\"LIQUOR PACKAGE\",INDEX(Data!$DT$33:$DW$82,$D35,3),IF($G$14=\"LIQUOR SIDE ORDER\",INDEX(Data!$DX$33:$EA$82,$D35,3),IF($G$14=\"MEAL\",INDEX(Data!$CR$33:$CU$82,$D35,3),IF($G$14=\"MEMBERSHIP\",INDEX(Data!$CV$33:$CY$82,$D35,3),IF($G$14=\"WINE\",INDEX(Data!$EB$33:$EE$82,$D35,3),\"\")))))))),\"\")","v":108},{"$f":"IFERROR(IF($G$14=\"BEER EXCHANGE\",INDEX(Data!$DD$33:$DG$82,$D35,4),IF($G$14=\"BEER PACKAGE\",INDEX(Data!$CZ$33:$DC$82,$D35,4),IF($G$14=\"BEER SIDE ORDER\",(INDEX(Data!$DH$33:$DK$82,$D35,4)+INDEX(Data!$DL$33:$DO$82,$D35,4)+INDEX(Data!$DP$33:$DS$82,$D35,4)),IF($G$14=\"LIQUOR PACKAGE\",INDEX(Data!$DT$33:$DW$82,$D35,4),IF($G$14=\"LIQUOR SIDE ORDER\",INDEX(Data!$DX$33:$EA$82,$D35,4),IF($G$14=\"MEAL\",INDEX(Data!$CR$33:$CU$82,$D35,4),IF($G$14=\"MEMBERSHIP\",INDEX(Data!$CV$33:$CY$82,$D35,4),IF($G$14=\"WINE\",INDEX(Data!$EB$33:$EE$82,$D35,4),\"\")))))))),\"\")","v":0},108]
[null,{"$f":"'Report A'!$B38","v":"2014-07-07"},{"$f":"'Report A'!$C38","v":"Monday"},{"$f":"'Report A'!$D38","v":7},{"$f":"IFERROR(IF($G$14=\"BEER EXCHANGE\",INDEX(Data!$DD$33:$DG$82,$D36,1),IF($G$14=\"BEER PACKAGE\",INDEX(Data!$CZ$33:$DC$82,$D36,1),IF($G$14=\"BEER SIDE ORDER\",(INDEX(Data!$DH$33:$DK$82,$D36,1)+INDEX(Data!$DL$33:$DO$82,$D36,1)+INDEX(Data!$DP$33:$DS$82,$D36,1)),IF($G$14=\"LIQUOR PACKAGE\",INDEX(Data!$DT$33:$DW$82,$D36,1),IF($G$14=\"LIQUOR SIDE ORDER\",INDEX(Data!$DX$33:$EA$82,$D36,1),IF($G$14=\"MEAL\",INDEX(Data!$CR$33:$CU$82,$D36,1),IF($G$14=\"MEMBERSHIP\",INDEX(Data!$CV$33:$CY$82,$D36,1),IF($G$14=\"WINE\",INDEX(Data!$EB$33:$EE$82,$D36,1),\"\")))))))),\"\")","v":0},{"$f":"IFERROR(IF($G$14=\"BEER EXCHANGE\",INDEX(Data!$DD$33:$DG$82,$D36,2),IF($G$14=\"BEER PACKAGE\",INDEX(Data!$CZ$33:$DC$82,$D36,2),IF($G$14=\"BEER SIDE ORDER\",(INDEX(Data!$DH$33:$DK$82,$D36,2)+INDEX(Data!$DL$33:$DO$82,$D36,2)+INDEX(Data!$DP$33:$DS$82,$D36,2)),IF($G$14=\"LIQUOR PACKAGE\",INDEX(Data!$DT$33:$DW$82,$D36,2),IF($G$14=\"LIQUOR SIDE ORDER\",INDEX(Data!$DX$33:$EA$82,$D36,2),IF($G$14=\"MEAL\",INDEX(Data!$CR$33:$CU$82,$D36,2),IF($G$14=\"MEMBERSHIP\",INDEX(Data!$CV$33:$CY$82,$D36,2),IF($G$14=\"WINE\",INDEX(Data!$EB$33:$EE$82,$D36,2),\"\")))))))),\"\")","v":0},{"$f":"IFERROR(IF($G$14=\"BEER EXCHANGE\",INDEX(Data!$DD$33:$DG$82,$D36,3),IF($G$14=\"BEER PACKAGE\",INDEX(Data!$CZ$33:$DC$82,$D36,3),IF($G$14=\"BEER SIDE ORDER\",(INDEX(Data!$DH$33:$DK$82,$D36,3)+INDEX(Data!$DL$33:$DO$82,$D36,3)+INDEX(Data!$DP$33:$DS$82,$D36,3)),IF($G$14=\"LIQUOR PACKAGE\",INDEX(Data!$DT$33:$DW$82,$D36,3),IF($G$14=\"LIQUOR SIDE ORDER\",INDEX(Data!$DX$33:$EA$82,$D36,3),IF($G$14=\"MEAL\",INDEX(Data!$CR$33:$CU$82,$D36,3),IF($G$14=\"MEMBERSHIP\",INDEX(Data!$CV$33:$CY$82,$D36,3),IF($G$14=\"WINE\",INDEX(Data!$EB$33:$EE$82,$D36,3),\"\")))))))),\"\")","v":0},{"$f":"IFERROR(IF($G$14=\"BEER EXCHANGE\",INDEX(Data!$DD$33:$DG$82,$D36,4),IF($G$14=\"BEER PACKAGE\",INDEX(Data!$CZ$33:$DC$82,$D36,4),IF($G$14=\"BEER SIDE ORDER\",(INDEX(Data!$DH$33:$DK$82,$D36,4)+INDEX(Data!$DL$33:$DO$82,$D36,4)+INDEX(Data!$DP$33:$DS$82,$D36,4)),IF($G$14=\"LIQUOR PACKAGE\",INDEX(Data!$DT$33:$DW$82,$D36,4),IF($G$14=\"LIQUOR SIDE ORDER\",INDEX(Data!$DX$33:$EA$82,$D36,4),IF($G$14=\"MEAL\",INDEX(Data!$CR$33:$CU$82,$D36,4),IF($G$14=\"MEMBERSHIP\",INDEX(Data!$CV$33:$CY$82,$D36,4),IF($G$14=\"WINE\",INDEX(Data!$EB$33:$EE$82,$D36,4),\"\")))))))),\"\")","v":0},0]
[null,{"$f":"'Report A'!$B39","v":"2014-07-08"},{"$f":"'Report A'!$C39","v":"Tuesday"},{"$f":"'Report A'!$D39","v":8},{"$f":"IFERROR(IF($G$14=\"BEER EXCHANGE\",INDEX(Data!$DD$33:$DG$82,$D37,1),IF($G$14=\"BEER PACKAGE\",INDEX(Data!$CZ$33:$DC$82,$D37,1),IF($G$14=\"BEER SIDE ORDER\",(INDEX(Data!$DH$33:$DK$82,$D37,1)+INDEX(Data!$DL$33:$DO$82,$D37,1)+INDEX(Data!$DP$33:$DS$82,$D37,1)),IF($G$14=\"LIQUOR PACKAGE\",INDEX(Data!$DT$33:$DW$82,$D37,1),IF($G$14=\"LIQUOR SIDE ORDER\",INDEX(Data!$DX$33:$EA$82,$D37,1),IF($G$14=\"MEAL\",INDEX(Data!$CR$33:$CU$82,$D37,1),IF($G$14=\"MEMBERSHIP\",INDEX(Data!$CV$33:$CY$82,$D37,1),IF($G$14=\"WINE\",INDEX(Data!$EB$33:$EE$82,$D37,1),\"\")))))))),\"\")","v":0},{"$f":"IFERROR(IF($G$14=\"BEER EXCHANGE\",INDEX(Data!$DD$33:$DG$82,$D37,2),IF($G$14=\"BEER PACKAGE\",INDEX(Data!$CZ$33:$DC$82,$D37,2),IF($G$14=\"BEER SIDE ORDER\",(INDEX(Data!$DH$33:$DK$82,$D37,2)+INDEX(Data!$DL$33:$DO$82,$D37,2)+INDEX(Data!$DP$33:$DS$82,$D37,2)),IF($G$14=\"LIQUOR PACKAGE\",INDEX(Data!$DT$33:$DW$82,$D37,2),IF($G$14=\"LIQUOR SIDE ORDER\",INDEX(Data!$DX$33:$EA$82,$D37,2),IF($G$14=\"MEAL\",INDEX(Data!$CR$33:$CU$82,$D37,2),IF($G$14=\"MEMBERSHIP\",INDEX(Data!$CV$33:$CY$82,$D37,2),IF($G$14=\"WINE\",INDEX(Data!$EB$33:$EE$82,$D37,2),\"\")))))))),\"\")","v":0},{"$f":"IFERROR(IF($G$14=\"BEER EXCHANGE\",INDEX(Data!$DD$33:$DG$82,$D37,3),IF($G$14=\"BEER PACKAGE\",INDEX(Data!$CZ$33:$DC$82,$D37,3),IF($G$14=\"BEER SIDE ORDER\",(INDEX(Data!$DH$33:$DK$82,$D37,3)+INDEX(Data!$DL$33:$DO$82,$D37,3)+INDEX(Data!$DP$33:$DS$82,$D37,3)),IF($G$14=\"LIQUOR PACKAGE\",INDEX(Data!$DT$33:$DW$82,$D37,3),IF($G$14=\"LIQUOR SIDE ORDER\",INDEX(Data!$DX$33:$EA$82,$D37,3),IF($G$14=\"MEAL\",INDEX(Data!$CR$33:$CU$82,$D37,3),IF($G$14=\"MEMBERSHIP\",INDEX(Data!$CV$33:$CY$82,$D37,3),IF($G$14=\"WINE\",INDEX(Data!$EB$33:$EE$82,$D37,3),\"\")))))))),\"\")","v":81},{"$f":"IFERROR(IF($G$14=\"BEER EXCHANGE\",INDEX(Data!$DD$33:$DG$82,$D37,4),IF($G$14=\"BEER PACKAGE\",INDEX(Data!$CZ$33:$DC$82,$D37,4),IF($G$14=\"BEER SIDE ORDER\",(INDEX(Data!$DH$33:$DK$82,$D37,4)+INDEX(Data!$DL$33:$DO$82,$D37,4)+INDEX(Data!$DP$33:$DS$82,$D37,4)),IF($G$14=\"LIQUOR PACKAGE\",INDEX(Data!$DT$33:$DW$82,$D37,4),IF($G$14=\"LIQUOR SIDE ORDER\",INDEX(Data!$DX$33:$EA$82,$D37,4),IF($G$14=\"MEAL\",INDEX(Data!$CR$33:$CU$82,$D37,4),IF($G$14=\"MEMBERSHIP\",INDEX(Data!$CV$33:$CY$82,$D37,4),IF($G$14=\"WINE\",INDEX(Data!$EB$33:$EE$82,$D37,4),\"\")))))))),\"\")","v":0},81]
[null,{"$f":"'Report A'!$B40","v":"2014-07-09"},{"$f":"'Report A'!$C40","v":"Wednesday"},{"$f":"'Report A'!$D40","v":9},{"$f":"IFERROR(IF($G$14=\"BEER EXCHANGE\",INDEX(Data!$DD$33:$DG$82,$D38,1),IF($G$14=\"BEER PACKAGE\",INDEX(Data!$CZ$33:$DC$82,$D38,1),IF($G$14=\"BEER SIDE ORDER\",(INDEX(Data!$DH$33:$DK$82,$D38,1)+INDEX(Data!$DL$33:$DO$82,$D38,1)+INDEX(Data!$DP$33:$DS$82,$D38,1)),IF($G$14=\"LIQUOR PACKAGE\",INDEX(Data!$DT$33:$DW$82,$D38,1),IF($G$14=\"LIQUOR SIDE ORDER\",INDEX(Data!$DX$33:$EA$82,$D38,1),IF($G$14=\"MEAL\",INDEX(Data!$CR$33:$CU$82,$D38,1),IF($G$14=\"MEMBERSHIP\",INDEX(Data!$CV$33:$CY$82,$D38,1),IF($G$14=\"WINE\",INDEX(Data!$EB$33:$EE$82,$D38,1),\"\")))))))),\"\")","v":0},{"$f":"IFERROR(IF($G$14=\"BEER EXCHANGE\",INDEX(Data!$DD$33:$DG$82,$D38,2),IF($G$14=\"BEER PACKAGE\",INDEX(Data!$CZ$33:$DC$82,$D38,2),IF($G$14=\"BEER SIDE ORDER\",(INDEX(Data!$DH$33:$DK$82,$D38,2)+INDEX(Data!$DL$33:$DO$82,$D38,2)+INDEX(Data!$DP$33:$DS$82,$D38,2)),IF($G$14=\"LIQUOR PACKAGE\",INDEX(Data!$DT$33:$DW$82,$D38,2),IF($G$14=\"LIQUOR SIDE ORDER\",INDEX(Data!$DX$33:$EA$82,$D38,2),IF($G$14=\"MEAL\",INDEX(Data!$CR$33:$CU$82,$D38,2),IF($G$14=\"MEMBERSHIP\",INDEX(Data!$CV$33:$CY$82,$D38,2),IF($G$14=\"WINE\",INDEX(Data!$EB$33:$EE$82,$D38,2),\"\")))))))),\"\")","v":0},{"$f":"IFERROR(IF($G$14=\"BEER EXCHANGE\",INDEX(Data!$DD$33:$DG$82,$D38,3),IF($G$14=\"BEER PACKAGE\",INDEX(Data!$CZ$33:$DC$82,$D38,3),IF($G$14=\"BEER SIDE ORDER\",(INDEX(Data!$DH$33:$DK$82,$D38,3)+INDEX(Data!$DL$33:$DO$82,$D38,3)+INDEX(Data!$DP$33:$DS$82,$D38,3)),IF($G$14=\"LIQUOR PACKAGE\",INDEX(Data!$DT$33:$DW$82,$D38,3),IF($G$14=\"LIQUOR SIDE ORDER\",INDEX(Data!$DX$33:$EA$82,$D38,3),IF($G$14=\"MEAL\",INDEX(Data!$CR$33:$CU$82,$D38,3),IF($G$14=\"MEMBERSHIP\",INDEX(Data!$CV$33:$CY$82,$D38,3),IF($G$14=\"WINE\",INDEX(Data!$EB$33:$EE$82,$D38,3),\"\")))))))),\"\")","v":76},{"$f":"IFERROR(IF($G$14=\"BEER EXCHANGE\",INDEX(Data!$DD$33:$DG$82,$D38,4),IF($G$14=\"BEER PACKAGE\",INDEX(Data!$CZ$33:$DC$82,$D38,4),IF($G$14=\"BEER SIDE ORDER\",(INDEX(Data!$DH$33:$DK$82,$D38,4)+INDEX(Data!$DL$33:$DO$82,$D38,4)+INDEX(Data!$DP$33:$DS$82,$D38,4)),IF($G$14=\"LIQUOR PACKAGE\",INDEX(Data!$DT$33:$DW$82,$D38,4),IF($G$14=\"LIQUOR SIDE ORDER\",INDEX(Data!$DX$33:$EA$82,$D38,4),IF($G$14=\"MEAL\",INDEX(Data!$CR$33:$CU$82,$D38,4),IF($G$14=\"MEMBERSHIP\",INDEX(Data!$CV$33:$CY$82,$D38,4),IF($G$14=\"WINE\",INDEX(Data!$EB$33:$EE$82,$D38,4),\"\")))))))),\"\")","v":0},76]
[null,{"$f":"'Report A'!$B41","v":"2014-07-10"},{"$f":"'Report A'!$C41","v":"Thursday"},{"$f":"'Report A'!$D41","v":10},{"$f":"IFERROR(IF($G$14=\"BEER EXCHANGE\",INDEX(Data!$DD$33:$DG$82,$D39,1),IF($G$14=\"BEER PACKAGE\",INDEX(Data!$CZ$33:$DC$82,$D39,1),IF($G$14=\"BEER SIDE ORDER\",(INDEX(Data!$DH$33:$DK$82,$D39,1)+INDEX(Data!$DL$33:$DO$82,$D39,1)+INDEX(Data!$DP$33:$DS$82,$D39,1)),IF($G$14=\"LIQUOR PACKAGE\",INDEX(Data!$DT$33:$DW$82,$D39,1),IF($G$14=\"LIQUOR SIDE ORDER\",INDEX(Data!$DX$33:$EA$82,$D39,1),IF($G$14=\"MEAL\",INDEX(Data!$CR$33:$CU$82,$D39,1),IF($G$14=\"MEMBERSHIP\",INDEX(Data!$CV$33:$CY$82,$D39,1),IF($G$14=\"WINE\",INDEX(Data!$EB$33:$EE$82,$D39,1),\"\")))))))),\"\")","v":0},{"$f":"IFERROR(IF($G$14=\"BEER EXCHANGE\",INDEX(Data!$DD$33:$DG$82,$D39,2),IF($G$14=\"BEER PACKAGE\",INDEX(Data!$CZ$33:$DC$82,$D39,2),IF($G$14=\"BEER SIDE ORDER\",(INDEX(Data!$DH$33:$DK$82,$D39,2)+INDEX(Data!$DL$33:$DO$82,$D39,2)+INDEX(Data!$DP$33:$DS$82,$D39,2)),IF($G$14=\"LIQUOR PACKAGE\",INDEX(Data!$DT$33:$DW$82,$D39,2),IF($G$14=\"LIQUOR SIDE ORDER\",INDEX(Data!$DX$33:$EA$82,$D39,2),IF($G$14=\"MEAL\",INDEX(Data!$CR$33:$CU$82,$D39,2),IF($G$14=\"MEMBERSHIP\",INDEX(Data!$CV$33:$CY$82,$D39,2),IF($G$14=\"WINE\",INDEX(Data!$EB$33:$EE$82,$D39,2),\"\")))))))),\"\")","v":0},{"$f":"IFERROR(IF($G$14=\"BEER EXCHANGE\",INDEX(Data!$DD$33:$DG$82,$D39,3),IF($G$14=\"BEER PACKAGE\",INDEX(Data!$CZ$33:$DC$82,$D39,3),IF($G$14=\"BEER SIDE ORDER\",(INDEX(Data!$DH$33:$DK$82,$D39,3)+INDEX(Data!$DL$33:$DO$82,$D39,3)+INDEX(Data!$DP$33:$DS$82,$D39,3)),IF($G$14=\"LIQUOR PACKAGE\",INDEX(Data!$DT$33:$DW$82,$D39,3),IF($G$14=\"LIQUOR SIDE ORDER\",INDEX(Data!$DX$33:$EA$82,$D39,3),IF($G$14=\"MEAL\",INDEX(Data!$CR$33:$CU$82,$D39,3),IF($G$14=\"MEMBERSHIP\",INDEX(Data!$CV$33:$CY$82,$D39,3),IF($G$14=\"WINE\",INDEX(Data!$EB$33:$EE$82,$D39,3),\"\")))))))),\"\")","v":63},{"$f":"IFERROR(IF($G$14=\"BEER EXCHANGE\",INDEX(Data!$DD$33:$DG$82,$D39,4),IF($G$14=\"BEER PACKAGE\",INDEX(Data!$CZ$33:$DC$82,$D39,4),IF($G$14=\"BEER SIDE ORDER\",(INDEX(Data!$DH$33:$DK$82,$D39,4)+INDEX(Data!$DL$33:$DO$82,$D39,4)+INDEX(Data!$DP$33:$DS$82,$D39,4)),IF($G$14=\"LIQUOR PACKAGE\",INDEX(Data!$DT$33:$DW$82,$D39,4),IF($G$14=\"LIQUOR SIDE ORDER\",INDEX(Data!$DX$33:$EA$82,$D39,4),IF($G$14=\"MEAL\",INDEX(Data!$CR$33:$CU$82,$D39,4),IF($G$14=\"MEMBERSHIP\",INDEX(Data!$CV$33:$CY$82,$D39,4),IF($G$14=\"WINE\",INDEX(Data!$EB$33:$EE$82,$D39,4),\"\")))))))),\"\")","v":0},63]
[null,{"$f":"'Report A'!$B42","v":"2014-07-11"},{"$f":"'Report A'!$C42","v":"Friday"},{"$f":"'Report A'!$D42","v":11},{"$f":"IFERROR(IF($G$14=\"BEER EXCHANGE\",INDEX(Data!$DD$33:$DG$82,$D40,1),IF($G$14=\"BEER PACKAGE\",INDEX(Data!$CZ$33:$DC$82,$D40,1),IF($G$14=\"BEER SIDE ORDER\",(INDEX(Data!$DH$33:$DK$82,$D40,1)+INDEX(Data!$DL$33:$DO$82,$D40,1)+INDEX(Data!$DP$33:$DS$82,$D40,1)),IF($G$14=\"LIQUOR PACKAGE\",INDEX(Data!$DT$33:$DW$82,$D40,1),IF($G$14=\"LIQUOR SIDE ORDER\",INDEX(Data!$DX$33:$EA$82,$D40,1),IF($G$14=\"MEAL\",INDEX(Data!$CR$33:$CU$82,$D40,1),IF($G$14=\"MEMBERSHIP\",INDEX(Data!$CV$33:$CY$82,$D40,1),IF($G$14=\"WINE\",INDEX(Data!$EB$33:$EE$82,$D40,1),\"\")))))))),\"\")","v":0},{"$f":"IFERROR(IF($G$14=\"BEER EXCHANGE\",INDEX(Data!$DD$33:$DG$82,$D40,2),IF($G$14=\"BEER PACKAGE\",INDEX(Data!$CZ$33:$DC$82,$D40,2),IF($G$14=\"BEER SIDE ORDER\",(INDEX(Data!$DH$33:$DK$82,$D40,2)+INDEX(Data!$DL$33:$DO$82,$D40,2)+INDEX(Data!$DP$33:$DS$82,$D40,2)),IF($G$14=\"LIQUOR PACKAGE\",INDEX(Data!$DT$33:$DW$82,$D40,2),IF($G$14=\"LIQUOR SIDE ORDER\",INDEX(Data!$DX$33:$EA$82,$D40,2),IF($G$14=\"MEAL\",INDEX(Data!$CR$33:$CU$82,$D40,2),IF($G$14=\"MEMBERSHIP\",INDEX(Data!$CV$33:$CY$82,$D40,2),IF($G$14=\"WINE\",INDEX(Data!$EB$33:$EE$82,$D40,2),\"\")))))))),\"\")","v":0},{"$f":"IFERROR(IF($G$14=\"BEER EXCHANGE\",INDEX(Data!$DD$33:$DG$82,$D40,3),IF($G$14=\"BEER PACKAGE\",INDEX(Data!$CZ$33:$DC$82,$D40,3),IF($G$14=\"BEER SIDE ORDER\",(INDEX(Data!$DH$33:$DK$82,$D40,3)+INDEX(Data!$DL$33:$DO$82,$D40,3)+INDEX(Data!$DP$33:$DS$82,$D40,3)),IF($G$14=\"LIQUOR PACKAGE\",INDEX(Data!$DT$33:$DW$82,$D40,3),IF($G$14=\"LIQUOR SIDE ORDER\",INDEX(Data!$DX$33:$EA$82,$D40,3),IF($G$14=\"MEAL\",INDEX(Data!$CR$33:$CU$82,$D40,3),IF($G$14=\"MEMBERSHIP\",INDEX(Data!$CV$33:$CY$82,$D40,3),IF($G$14=\"WINE\",INDEX(Data!$EB$33:$EE$82,$D40,3),\"\")))))))),\"\")","v":74},{"$f":"IFERROR(IF($G$14=\"BEER EXCHANGE\",INDEX(Data!$DD$33:$DG$82,$D40,4),IF($G$14=\"BEER PACKAGE\",INDEX(Data!$CZ$33:$DC$82,$D40,4),IF($G$14=\"BEER SIDE ORDER\",(INDEX(Data!$DH$33:$DK$82,$D40,4)+INDEX(Data!$DL$33:$DO$82,$D40,4)+INDEX(Data!$DP$33:$DS$82,$D40,4)),IF($G$14=\"LIQUOR PACKAGE\",INDEX(Data!$DT$33:$DW$82,$D40,4),IF($G$14=\"LIQUOR SIDE ORDER\",INDEX(Data!$DX$33:$EA$82,$D40,4),IF($G$14=\"MEAL\",INDEX(Data!$CR$33:$CU$82,$D40,4),IF($G$14=\"MEMBERSHIP\",INDEX(Data!$CV$33:$CY$82,$D40,4),IF($G$14=\"WINE\",INDEX(Data!$EB$33:$EE$82,$D40,4),\"\")))))))),\"\")","v":0},74]
[null,{"$f":"'Report A'!$B43","v":"2014-07-12"},{"$f":"'Report A'!$C43","v":"Saturday"},{"$f":"'Report A'!$D43","v":12},{"$f":"IFERROR(IF($G$14=\"BEER EXCHANGE\",INDEX(Data!$DD$33:$DG$82,$D41,1),IF($G$14=\"BEER PACKAGE\",INDEX(Data!$CZ$33:$DC$82,$D41,1),IF($G$14=\"BEER SIDE ORDER\",(INDEX(Data!$DH$33:$DK$82,$D41,1)+INDEX(Data!$DL$33:$DO$82,$D41,1)+INDEX(Data!$DP$33:$DS$82,$D41,1)),IF($G$14=\"LIQUOR PACKAGE\",INDEX(Data!$DT$33:$DW$82,$D41,1),IF($G$14=\"LIQUOR SIDE ORDER\",INDEX(Data!$DX$33:$EA$82,$D41,1),IF($G$14=\"MEAL\",INDEX(Data!$CR$33:$CU$82,$D41,1),IF($G$14=\"MEMBERSHIP\",INDEX(Data!$CV$33:$CY$82,$D41,1),IF($G$14=\"WINE\",INDEX(Data!$EB$33:$EE$82,$D41,1),\"\")))))))),\"\")","v":0},{"$f":"IFERROR(IF($G$14=\"BEER EXCHANGE\",INDEX(Data!$DD$33:$DG$82,$D41,2),IF($G$14=\"BEER PACKAGE\",INDEX(Data!$CZ$33:$DC$82,$D41,2),IF($G$14=\"BEER SIDE ORDER\",(INDEX(Data!$DH$33:$DK$82,$D41,2)+INDEX(Data!$DL$33:$DO$82,$D41,2)+INDEX(Data!$DP$33:$DS$82,$D41,2)),IF($G$14=\"LIQUOR PACKAGE\",INDEX(Data!$DT$33:$DW$82,$D41,2),IF($G$14=\"LIQUOR SIDE ORDER\",INDEX(Data!$DX$33:$EA$82,$D41,2),IF($G$14=\"MEAL\",INDEX(Data!$CR$33:$CU$82,$D41,2),IF($G$14=\"MEMBERSHIP\",INDEX(Data!$CV$33:$CY$82,$D41,2),IF($G$14=\"WINE\",INDEX(Data!$EB$33:$EE$82,$D41,2),\"\")))))))),\"\")","v":0},{"$f":"IFERROR(IF($G$14=\"BEER EXCHANGE\",INDEX(Data!$DD$33:$DG$82,$D41,3),IF($G$14=\"BEER PACKAGE\",INDEX(Data!$CZ$33:$DC$82,$D41,3),IF($G$14=\"BEER SIDE ORDER\",(INDEX(Data!$DH$33:$DK$82,$D41,3)+INDEX(Data!$DL$33:$DO$82,$D41,3)+INDEX(Data!$DP$33:$DS$82,$D41,3)),IF($G$14=\"LIQUOR PACKAGE\",INDEX(Data!$DT$33:$DW$82,$D41,3),IF($G$14=\"LIQUOR SIDE ORDER\",INDEX(Data!$DX$33:$EA$82,$D41,3),IF($G$14=\"MEAL\",INDEX(Data!$CR$33:$CU$82,$D41,3),IF($G$14=\"MEMBERSHIP\",INDEX(Data!$CV$33:$CY$82,$D41,3),IF($G$14=\"WINE\",INDEX(Data!$EB$33:$EE$82,$D41,3),\"\")))))))),\"\")","v":97},{"$f":"IFERROR(IF($G$14=\"BEER EXCHANGE\",INDEX(Data!$DD$33:$DG$82,$D41,4),IF($G$14=\"BEER PACKAGE\",INDEX(Data!$CZ$33:$DC$82,$D41,4),IF($G$14=\"BEER SIDE ORDER\",(INDEX(Data!$DH$33:$DK$82,$D41,4)+INDEX(Data!$DL$33:$DO$82,$D41,4)+INDEX(Data!$DP$33:$DS$82,$D41,4)),IF($G$14=\"LIQUOR PACKAGE\",INDEX(Data!$DT$33:$DW$82,$D41,4),IF($G$14=\"LIQUOR SIDE ORDER\",INDEX(Data!$DX$33:$EA$82,$D41,4),IF($G$14=\"MEAL\",INDEX(Data!$CR$33:$CU$82,$D41,4),IF($G$14=\"MEMBERSHIP\",INDEX(Data!$CV$33:$CY$82,$D41,4),IF($G$14=\"WINE\",INDEX(Data!$EB$33:$EE$82,$D41,4),\"\")))))))),\"\")","v":0},97]
[null,{"$f":"'Report A'!$B44","v":"2014-07-13"},{"$f":"'Report A'!$C44","v":"Sunday"},{"$f":"'Report A'!$D44","v":13},{"$f":"IFERROR(IF($G$14=\"BEER EXCHANGE\",INDEX(Data!$DD$33:$DG$82,$D42,1),IF($G$14=\"BEER PACKAGE\",INDEX(Data!$CZ$33:$DC$82,$D42,1),IF($G$14=\"BEER SIDE ORDER\",(INDEX(Data!$DH$33:$DK$82,$D42,1)+INDEX(Data!$DL$33:$DO$82,$D42,1)+INDEX(Data!$DP$33:$DS$82,$D42,1)),IF($G$14=\"LIQUOR PACKAGE\",INDEX(Data!$DT$33:$DW$82,$D42,1),IF($G$14=\"LIQUOR SIDE ORDER\",INDEX(Data!$DX$33:$EA$82,$D42,1),IF($G$14=\"MEAL\",INDEX(Data!$CR$33:$CU$82,$D42,1),IF($G$14=\"MEMBERSHIP\",INDEX(Data!$CV$33:$CY$82,$D42,1),IF($G$14=\"WINE\",INDEX(Data!$EB$33:$EE$82,$D42,1),\"\")))))))),\"\")","v":0},{"$f":"IFERROR(IF($G$14=\"BEER EXCHANGE\",INDEX(Data!$DD$33:$DG$82,$D42,2),IF($G$14=\"BEER PACKAGE\",INDEX(Data!$CZ$33:$DC$82,$D42,2),IF($G$14=\"BEER SIDE ORDER\",(INDEX(Data!$DH$33:$DK$82,$D42,2)+INDEX(Data!$DL$33:$DO$82,$D42,2)+INDEX(Data!$DP$33:$DS$82,$D42,2)),IF($G$14=\"LIQUOR PACKAGE\",INDEX(Data!$DT$33:$DW$82,$D42,2),IF($G$14=\"LIQUOR SIDE ORDER\",INDEX(Data!$DX$33:$EA$82,$D42,2),IF($G$14=\"MEAL\",INDEX(Data!$CR$33:$CU$82,$D42,2),IF($G$14=\"MEMBERSHIP\",INDEX(Data!$CV$33:$CY$82,$D42,2),IF($G$14=\"WINE\",INDEX(Data!$EB$33:$EE$82,$D42,2),\"\")))))))),\"\")","v":0},{"$f":"IFERROR(IF($G$14=\"BEER EXCHANGE\",INDEX(Data!$DD$33:$DG$82,$D42,3),IF($G$14=\"BEER PACKAGE\",INDEX(Data!$CZ$33:$DC$82,$D42,3),IF($G$14=\"BEER SIDE ORDER\",(INDEX(Data!$DH$33:$DK$82,$D42,3)+INDEX(Data!$DL$33:$DO$82,$D42,3)+INDEX(Data!$DP$33:$DS$82,$D42,3)),IF($G$14=\"LIQUOR PACKAGE\",INDEX(Data!$DT$33:$DW$82,$D42,3),IF($G$14=\"LIQUOR SIDE ORDER\",INDEX(Data!$DX$33:$EA$82,$D42,3),IF($G$14=\"MEAL\",INDEX(Data!$CR$33:$CU$82,$D42,3),IF($G$14=\"MEMBERSHIP\",INDEX(Data!$CV$33:$CY$82,$D42,3),IF($G$14=\"WINE\",INDEX(Data!$EB$33:$EE$82,$D42,3),\"\")))))))),\"\")","v":96},{"$f":"IFERROR(IF($G$14=\"BEER EXCHANGE\",INDEX(Data!$DD$33:$DG$82,$D42,4),IF($G$14=\"BEER PACKAGE\",INDEX(Data!$CZ$33:$DC$82,$D42,4),IF($G$14=\"BEER SIDE ORDER\",(INDEX(Data!$DH$33:$DK$82,$D42,4)+INDEX(Data!$DL$33:$DO$82,$D42,4)+INDEX(Data!$DP$33:$DS$82,$D42,4)),IF($G$14=\"LIQUOR PACKAGE\",INDEX(Data!$DT$33:$DW$82,$D42,4),IF($G$14=\"LIQUOR SIDE ORDER\",INDEX(Data!$DX$33:$EA$82,$D42,4),IF($G$14=\"MEAL\",INDEX(Data!$CR$33:$CU$82,$D42,4),IF($G$14=\"MEMBERSHIP\",INDEX(Data!$CV$33:$CY$82,$D42,4),IF($G$14=\"WINE\",INDEX(Data!$EB$33:$EE$82,$D42,4),\"\")))))))),\"\")","v":0},96]
[null,{"$f":"'Report A'!$B45","v":"2014-07-14"},{"$f":"'Report A'!$C45","v":"Monday"},{"$f":"'Report A'!$D45","v":14},{"$f":"IFERROR(IF($G$14=\"BEER EXCHANGE\",INDEX(Data!$DD$33:$DG$82,$D43,1),IF($G$14=\"BEER PACKAGE\",INDEX(Data!$CZ$33:$DC$82,$D43,1),IF($G$14=\"BEER SIDE ORDER\",(INDEX(Data!$DH$33:$DK$82,$D43,1)+INDEX(Data!$DL$33:$DO$82,$D43,1)+INDEX(Data!$DP$33:$DS$82,$D43,1)),IF($G$14=\"LIQUOR PACKAGE\",INDEX(Data!$DT$33:$DW$82,$D43,1),IF($G$14=\"LIQUOR SIDE ORDER\",INDEX(Data!$DX$33:$EA$82,$D43,1),IF($G$14=\"MEAL\",INDEX(Data!$CR$33:$CU$82,$D43,1),IF($G$14=\"MEMBERSHIP\",INDEX(Data!$CV$33:$CY$82,$D43,1),IF($G$14=\"WINE\",INDEX(Data!$EB$33:$EE$82,$D43,1),\"\")))))))),\"\")","v":0},{"$f":"IFERROR(IF($G$14=\"BEER EXCHANGE\",INDEX(Data!$DD$33:$DG$82,$D43,2),IF($G$14=\"BEER PACKAGE\",INDEX(Data!$CZ$33:$DC$82,$D43,2),IF($G$14=\"BEER SIDE ORDER\",(INDEX(Data!$DH$33:$DK$82,$D43,2)+INDEX(Data!$DL$33:$DO$82,$D43,2)+INDEX(Data!$DP$33:$DS$82,$D43,2)),IF($G$14=\"LIQUOR PACKAGE\",INDEX(Data!$DT$33:$DW$82,$D43,2),IF($G$14=\"LIQUOR SIDE ORDER\",INDEX(Data!$DX$33:$EA$82,$D43,2),IF($G$14=\"MEAL\",INDEX(Data!$CR$33:$CU$82,$D43,2),IF($G$14=\"MEMBERSHIP\",INDEX(Data!$CV$33:$CY$82,$D43,2),IF($G$14=\"WINE\",INDEX(Data!$EB$33:$EE$82,$D43,2),\"\")))))))),\"\")","v":0},{"$f":"IFERROR(IF($G$14=\"BEER EXCHANGE\",INDEX(Data!$DD$33:$DG$82,$D43,3),IF($G$14=\"BEER PACKAGE\",INDEX(Data!$CZ$33:$DC$82,$D43,3),IF($G$14=\"BEER SIDE ORDER\",(INDEX(Data!$DH$33:$DK$82,$D43,3)+INDEX(Data!$DL$33:$DO$82,$D43,3)+INDEX(Data!$DP$33:$DS$82,$D43,3)),IF($G$14=\"LIQUOR PACKAGE\",INDEX(Data!$DT$33:$DW$82,$D43,3),IF($G$14=\"LIQUOR SIDE ORDER\",INDEX(Data!$DX$33:$EA$82,$D43,3),IF($G$14=\"MEAL\",INDEX(Data!$CR$33:$CU$82,$D43,3),IF($G$14=\"MEMBERSHIP\",INDEX(Data!$CV$33:$CY$82,$D43,3),IF($G$14=\"WINE\",INDEX(Data!$EB$33:$EE$82,$D43,3),\"\")))))))),\"\")","v":76},{"$f":"IFERROR(IF($G$14=\"BEER EXCHANGE\",INDEX(Data!$DD$33:$DG$82,$D43,4),IF($G$14=\"BEER PACKAGE\",INDEX(Data!$CZ$33:$DC$82,$D43,4),IF($G$14=\"BEER SIDE ORDER\",(INDEX(Data!$DH$33:$DK$82,$D43,4)+INDEX(Data!$DL$33:$DO$82,$D43,4)+INDEX(Data!$DP$33:$DS$82,$D43,4)),IF($G$14=\"LIQUOR PACKAGE\",INDEX(Data!$DT$33:$DW$82,$D43,4),IF($G$14=\"LIQUOR SIDE ORDER\",INDEX(Data!$DX$33:$EA$82,$D43,4),IF($G$14=\"MEAL\",INDEX(Data!$CR$33:$CU$82,$D43,4),IF($G$14=\"MEMBERSHIP\",INDEX(Data!$CV$33:$CY$82,$D43,4),IF($G$14=\"WINE\",INDEX(Data!$EB$33:$EE$82,$D43,4),\"\")))))))),\"\")","v":0},76]
[null,{"$f":"'Report A'!$B46","v":"2014-07-15"},{"$f":"'Report A'!$C46","v":"Tuesday"},{"$f":"'Report A'!$D46","v":15},{"$f":"IFERROR(IF($G$14=\"BEER EXCHANGE\",INDEX(Data!$DD$33:$DG$82,$D44,1),IF($G$14=\"BEER PACKAGE\",INDEX(Data!$CZ$33:$DC$82,$D44,1),IF($G$14=\"BEER SIDE ORDER\",(INDEX(Data!$DH$33:$DK$82,$D44,1)+INDEX(Data!$DL$33:$DO$82,$D44,1)+INDEX(Data!$DP$33:$DS$82,$D44,1)),IF($G$14=\"LIQUOR PACKAGE\",INDEX(Data!$DT$33:$DW$82,$D44,1),IF($G$14=\"LIQUOR SIDE ORDER\",INDEX(Data!$DX$33:$EA$82,$D44,1),IF($G$14=\"MEAL\",INDEX(Data!$CR$33:$CU$82,$D44,1),IF($G$14=\"MEMBERSHIP\",INDEX(Data!$CV$33:$CY$82,$D44,1),IF($G$14=\"WINE\",INDEX(Data!$EB$33:$EE$82,$D44,1),\"\")))))))),\"\")","v":0},{"$f":"IFERROR(IF($G$14=\"BEER EXCHANGE\",INDEX(Data!$DD$33:$DG$82,$D44,2),IF($G$14=\"BEER PACKAGE\",INDEX(Data!$CZ$33:$DC$82,$D44,2),IF($G$14=\"BEER SIDE ORDER\",(INDEX(Data!$DH$33:$DK$82,$D44,2)+INDEX(Data!$DL$33:$DO$82,$D44,2)+INDEX(Data!$DP$33:$DS$82,$D44,2)),IF($G$14=\"LIQUOR PACKAGE\",INDEX(Data!$DT$33:$DW$82,$D44,2),IF($G$14=\"LIQUOR SIDE ORDER\",INDEX(Data!$DX$33:$EA$82,$D44,2),IF($G$14=\"MEAL\",INDEX(Data!$CR$33:$CU$82,$D44,2),IF($G$14=\"MEMBERSHIP\",INDEX(Data!$CV$33:$CY$82,$D44,2),IF($G$14=\"WINE\",INDEX(Data!$EB$33:$EE$82,$D44,2),\"\")))))))),\"\")","v":0},{"$f":"IFERROR(IF($G$14=\"BEER EXCHANGE\",INDEX(Data!$DD$33:$DG$82,$D44,3),IF($G$14=\"BEER PACKAGE\",INDEX(Data!$CZ$33:$DC$82,$D44,3),IF($G$14=\"BEER SIDE ORDER\",(INDEX(Data!$DH$33:$DK$82,$D44,3)+INDEX(Data!$DL$33:$DO$82,$D44,3)+INDEX(Data!$DP$33:$DS$82,$D44,3)),IF($G$14=\"LIQUOR PACKAGE\",INDEX(Data!$DT$33:$DW$82,$D44,3),IF($G$14=\"LIQUOR SIDE ORDER\",INDEX(Data!$DX$33:$EA$82,$D44,3),IF($G$14=\"MEAL\",INDEX(Data!$CR$33:$CU$82,$D44,3),IF($G$14=\"MEMBERSHIP\",INDEX(Data!$CV$33:$CY$82,$D44,3),IF($G$14=\"WINE\",INDEX(Data!$EB$33:$EE$82,$D44,3),\"\")))))))),\"\")","v":52},{"$f":"IFERROR(IF($G$14=\"BEER EXCHANGE\",INDEX(Data!$DD$33:$DG$82,$D44,4),IF($G$14=\"BEER PACKAGE\",INDEX(Data!$CZ$33:$DC$82,$D44,4),IF($G$14=\"BEER SIDE ORDER\",(INDEX(Data!$DH$33:$DK$82,$D44,4)+INDEX(Data!$DL$33:$DO$82,$D44,4)+INDEX(Data!$DP$33:$DS$82,$D44,4)),IF($G$14=\"LIQUOR PACKAGE\",INDEX(Data!$DT$33:$DW$82,$D44,4),IF($G$14=\"LIQUOR SIDE ORDER\",INDEX(Data!$DX$33:$EA$82,$D44,4),IF($G$14=\"MEAL\",INDEX(Data!$CR$33:$CU$82,$D44,4),IF($G$14=\"MEMBERSHIP\",INDEX(Data!$CV$33:$CY$82,$D44,4),IF($G$14=\"WINE\",INDEX(Data!$EB$33:$EE$82,$D44,4),\"\")))))))),\"\")","v":0},52]
[null,{"$f":"'Report A'!$B47","v":"2014-07-16"},{"$f":"'Report A'!$C47","v":"Wednesday"},{"$f":"'Report A'!$D47","v":16},{"$f":"IFERROR(IF($G$14=\"BEER EXCHANGE\",INDEX(Data!$DD$33:$DG$82,$D45,1),IF($G$14=\"BEER PACKAGE\",INDEX(Data!$CZ$33:$DC$82,$D45,1),IF($G$14=\"BEER SIDE ORDER\",(INDEX(Data!$DH$33:$DK$82,$D45,1)+INDEX(Data!$DL$33:$DO$82,$D45,1)+INDEX(Data!$DP$33:$DS$82,$D45,1)),IF($G$14=\"LIQUOR PACKAGE\",INDEX(Data!$DT$33:$DW$82,$D45,1),IF($G$14=\"LIQUOR SIDE ORDER\",INDEX(Data!$DX$33:$EA$82,$D45,1),IF($G$14=\"MEAL\",INDEX(Data!$CR$33:$CU$82,$D45,1),IF($G$14=\"MEMBERSHIP\",INDEX(Data!$CV$33:$CY$82,$D45,1),IF($G$14=\"WINE\",INDEX(Data!$EB$33:$EE$82,$D45,1),\"\")))))))),\"\")","v":0},{"$f":"IFERROR(IF($G$14=\"BEER EXCHANGE\",INDEX(Data!$DD$33:$DG$82,$D45,2),IF($G$14=\"BEER PACKAGE\",INDEX(Data!$CZ$33:$DC$82,$D45,2),IF($G$14=\"BEER SIDE ORDER\",(INDEX(Data!$DH$33:$DK$82,$D45,2)+INDEX(Data!$DL$33:$DO$82,$D45,2)+INDEX(Data!$DP$33:$DS$82,$D45,2)),IF($G$14=\"LIQUOR PACKAGE\",INDEX(Data!$DT$33:$DW$82,$D45,2),IF($G$14=\"LIQUOR SIDE ORDER\",INDEX(Data!$DX$33:$EA$82,$D45,2),IF($G$14=\"MEAL\",INDEX(Data!$CR$33:$CU$82,$D45,2),IF($G$14=\"MEMBERSHIP\",INDEX(Data!$CV$33:$CY$82,$D45,2),IF($G$14=\"WINE\",INDEX(Data!$EB$33:$EE$82,$D45,2),\"\")))))))),\"\")","v":0},{"$f":"IFERROR(IF($G$14=\"BEER EXCHANGE\",INDEX(Data!$DD$33:$DG$82,$D45,3),IF($G$14=\"BEER PACKAGE\",INDEX(Data!$CZ$33:$DC$82,$D45,3),IF($G$14=\"BEER SIDE ORDER\",(INDEX(Data!$DH$33:$DK$82,$D45,3)+INDEX(Data!$DL$33:$DO$82,$D45,3)+INDEX(Data!$DP$33:$DS$82,$D45,3)),IF($G$14=\"LIQUOR PACKAGE\",INDEX(Data!$DT$33:$DW$82,$D45,3),IF($G$14=\"LIQUOR SIDE ORDER\",INDEX(Data!$DX$33:$EA$82,$D45,3),IF($G$14=\"MEAL\",INDEX(Data!$CR$33:$CU$82,$D45,3),IF($G$14=\"MEMBERSHIP\",INDEX(Data!$CV$33:$CY$82,$D45,3),IF($G$14=\"WINE\",INDEX(Data!$EB$33:$EE$82,$D45,3),\"\")))))))),\"\")","v":56},{"$f":"IFERROR(IF($G$14=\"BEER EXCHANGE\",INDEX(Data!$DD$33:$DG$82,$D45,4),IF($G$14=\"BEER PACKAGE\",INDEX(Data!$CZ$33:$DC$82,$D45,4),IF($G$14=\"BEER SIDE ORDER\",(INDEX(Data!$DH$33:$DK$82,$D45,4)+INDEX(Data!$DL$33:$DO$82,$D45,4)+INDEX(Data!$DP$33:$DS$82,$D45,4)),IF($G$14=\"LIQUOR PACKAGE\",INDEX(Data!$DT$33:$DW$82,$D45,4),IF($G$14=\"LIQUOR SIDE ORDER\",INDEX(Data!$DX$33:$EA$82,$D45,4),IF($G$14=\"MEAL\",INDEX(Data!$CR$33:$CU$82,$D45,4),IF($G$14=\"MEMBERSHIP\",INDEX(Data!$CV$33:$CY$82,$D45,4),IF($G$14=\"WINE\",INDEX(Data!$EB$33:$EE$82,$D45,4),\"\")))))))),\"\")","v":0},56]
[null,{"$f":"'Report A'!$B48","v":"2014-07-17"},{"$f":"'Report A'!$C48","v":"Thursday"},{"$f":"'Report A'!$D48","v":17},{"$f":"IFERROR(IF($G$14=\"BEER EXCHANGE\",INDEX(Data!$DD$33:$DG$82,$D46,1),IF($G$14=\"BEER PACKAGE\",INDEX(Data!$CZ$33:$DC$82,$D46,1),IF($G$14=\"BEER SIDE ORDER\",(INDEX(Data!$DH$33:$DK$82,$D46,1)+INDEX(Data!$DL$33:$DO$82,$D46,1)+INDEX(Data!$DP$33:$DS$82,$D46,1)),IF($G$14=\"LIQUOR PACKAGE\",INDEX(Data!$DT$33:$DW$82,$D46,1),IF($G$14=\"LIQUOR SIDE ORDER\",INDEX(Data!$DX$33:$EA$82,$D46,1),IF($G$14=\"MEAL\",INDEX(Data!$CR$33:$CU$82,$D46,1),IF($G$14=\"MEMBERSHIP\",INDEX(Data!$CV$33:$CY$82,$D46,1),IF($G$14=\"WINE\",INDEX(Data!$EB$33:$EE$82,$D46,1),\"\")))))))),\"\")","v":0},{"$f":"IFERROR(IF($G$14=\"BEER EXCHANGE\",INDEX(Data!$DD$33:$DG$82,$D46,2),IF($G$14=\"BEER PACKAGE\",INDEX(Data!$CZ$33:$DC$82,$D46,2),IF($G$14=\"BEER SIDE ORDER\",(INDEX(Data!$DH$33:$DK$82,$D46,2)+INDEX(Data!$DL$33:$DO$82,$D46,2)+INDEX(Data!$DP$33:$DS$82,$D46,2)),IF($G$14=\"LIQUOR PACKAGE\",INDEX(Data!$DT$33:$DW$82,$D46,2),IF($G$14=\"LIQUOR SIDE ORDER\",INDEX(Data!$DX$33:$EA$82,$D46,2),IF($G$14=\"MEAL\",INDEX(Data!$CR$33:$CU$82,$D46,2),IF($G$14=\"MEMBERSHIP\",INDEX(Data!$CV$33:$CY$82,$D46,2),IF($G$14=\"WINE\",INDEX(Data!$EB$33:$EE$82,$D46,2),\"\")))))))),\"\")","v":0},{"$f":"IFERROR(IF($G$14=\"BEER EXCHANGE\",INDEX(Data!$DD$33:$DG$82,$D46,3),IF($G$14=\"BEER PACKAGE\",INDEX(Data!$CZ$33:$DC$82,$D46,3),IF($G$14=\"BEER SIDE ORDER\",(INDEX(Data!$DH$33:$DK$82,$D46,3)+INDEX(Data!$DL$33:$DO$82,$D46,3)+INDEX(Data!$DP$33:$DS$82,$D46,3)),IF($G$14=\"LIQUOR PACKAGE\",INDEX(Data!$DT$33:$DW$82,$D46,3),IF($G$14=\"LIQUOR SIDE ORDER\",INDEX(Data!$DX$33:$EA$82,$D46,3),IF($G$14=\"MEAL\",INDEX(Data!$CR$33:$CU$82,$D46,3),IF($G$14=\"MEMBERSHIP\",INDEX(Data!$CV$33:$CY$82,$D46,3),IF($G$14=\"WINE\",INDEX(Data!$EB$33:$EE$82,$D46,3),\"\")))))))),\"\")","v":59},{"$f":"IFERROR(IF($G$14=\"BEER EXCHANGE\",INDEX(Data!$DD$33:$DG$82,$D46,4),IF($G$14=\"BEER PACKAGE\",INDEX(Data!$CZ$33:$DC$82,$D46,4),IF($G$14=\"BEER SIDE ORDER\",(INDEX(Data!$DH$33:$DK$82,$D46,4)+INDEX(Data!$DL$33:$DO$82,$D46,4)+INDEX(Data!$DP$33:$DS$82,$D46,4)),IF($G$14=\"LIQUOR PACKAGE\",INDEX(Data!$DT$33:$DW$82,$D46,4),IF($G$14=\"LIQUOR SIDE ORDER\",INDEX(Data!$DX$33:$EA$82,$D46,4),IF($G$14=\"MEAL\",INDEX(Data!$CR$33:$CU$82,$D46,4),IF($G$14=\"MEMBERSHIP\",INDEX(Data!$CV$33:$CY$82,$D46,4),IF($G$14=\"WINE\",INDEX(Data!$EB$33:$EE$82,$D46,4),\"\")))))))),\"\")","v":0},59]
[null,{"$f":"'Report A'!$B49","v":"2014-07-18"},{"$f":"'Report A'!$C49","v":"Friday"},{"$f":"'Report A'!$D49","v":18},{"$f":"IFERROR(IF($G$14=\"BEER EXCHANGE\",INDEX(Data!$DD$33:$DG$82,$D47,1),IF($G$14=\"BEER PACKAGE\",INDEX(Data!$CZ$33:$DC$82,$D47,1),IF($G$14=\"BEER SIDE ORDER\",(INDEX(Data!$DH$33:$DK$82,$D47,1)+INDEX(Data!$DL$33:$DO$82,$D47,1)+INDEX(Data!$DP$33:$DS$82,$D47,1)),IF($G$14=\"LIQUOR PACKAGE\",INDEX(Data!$DT$33:$DW$82,$D47,1),IF($G$14=\"LIQUOR SIDE ORDER\",INDEX(Data!$DX$33:$EA$82,$D47,1),IF($G$14=\"MEAL\",INDEX(Data!$CR$33:$CU$82,$D47,1),IF($G$14=\"MEMBERSHIP\",INDEX(Data!$CV$33:$CY$82,$D47,1),IF($G$14=\"WINE\",INDEX(Data!$EB$33:$EE$82,$D47,1),\"\")))))))),\"\")","v":0},{"$f":"IFERROR(IF($G$14=\"BEER EXCHANGE\",INDEX(Data!$DD$33:$DG$82,$D47,2),IF($G$14=\"BEER PACKAGE\",INDEX(Data!$CZ$33:$DC$82,$D47,2),IF($G$14=\"BEER SIDE ORDER\",(INDEX(Data!$DH$33:$DK$82,$D47,2)+INDEX(Data!$DL$33:$DO$82,$D47,2)+INDEX(Data!$DP$33:$DS$82,$D47,2)),IF($G$14=\"LIQUOR PACKAGE\",INDEX(Data!$DT$33:$DW$82,$D47,2),IF($G$14=\"LIQUOR SIDE ORDER\",INDEX(Data!$DX$33:$EA$82,$D47,2),IF($G$14=\"MEAL\",INDEX(Data!$CR$33:$CU$82,$D47,2),IF($G$14=\"MEMBERSHIP\",INDEX(Data!$CV$33:$CY$82,$D47,2),IF($G$14=\"WINE\",INDEX(Data!$EB$33:$EE$82,$D47,2),\"\")))))))),\"\")","v":0},{"$f":"IFERROR(IF($G$14=\"BEER EXCHANGE\",INDEX(Data!$DD$33:$DG$82,$D47,3),IF($G$14=\"BEER PACKAGE\",INDEX(Data!$CZ$33:$DC$82,$D47,3),IF($G$14=\"BEER SIDE ORDER\",(INDEX(Data!$DH$33:$DK$82,$D47,3)+INDEX(Data!$DL$33:$DO$82,$D47,3)+INDEX(Data!$DP$33:$DS$82,$D47,3)),IF($G$14=\"LIQUOR PACKAGE\",INDEX(Data!$DT$33:$DW$82,$D47,3),IF($G$14=\"LIQUOR SIDE ORDER\",INDEX(Data!$DX$33:$EA$82,$D47,3),IF($G$14=\"MEAL\",INDEX(Data!$CR$33:$CU$82,$D47,3),IF($G$14=\"MEMBERSHIP\",INDEX(Data!$CV$33:$CY$82,$D47,3),IF($G$14=\"WINE\",INDEX(Data!$EB$33:$EE$82,$D47,3),\"\")))))))),\"\")","v":73},{"$f":"IFERROR(IF($G$14=\"BEER EXCHANGE\",INDEX(Data!$DD$33:$DG$82,$D47,4),IF($G$14=\"BEER PACKAGE\",INDEX(Data!$CZ$33:$DC$82,$D47,4),IF($G$14=\"BEER SIDE ORDER\",(INDEX(Data!$DH$33:$DK$82,$D47,4)+INDEX(Data!$DL$33:$DO$82,$D47,4)+INDEX(Data!$DP$33:$DS$82,$D47,4)),IF($G$14=\"LIQUOR PACKAGE\",INDEX(Data!$DT$33:$DW$82,$D47,4),IF($G$14=\"LIQUOR SIDE ORDER\",INDEX(Data!$DX$33:$EA$82,$D47,4),IF($G$14=\"MEAL\",INDEX(Data!$CR$33:$CU$82,$D47,4),IF($G$14=\"MEMBERSHIP\",INDEX(Data!$CV$33:$CY$82,$D47,4),IF($G$14=\"WINE\",INDEX(Data!$EB$33:$EE$82,$D47,4),\"\")))))))),\"\")","v":0},73]
[null,{"$f":"'Report A'!$B50","v":"2014-07-19"},{"$f":"'Report A'!$C50","v":"Saturday"},{"$f":"'Report A'!$D50","v":19},{"$f":"IFERROR(IF($G$14=\"BEER EXCHANGE\",INDEX(Data!$DD$33:$DG$82,$D48,1),IF($G$14=\"BEER PACKAGE\",INDEX(Data!$CZ$33:$DC$82,$D48,1),IF($G$14=\"BEER SIDE ORDER\",(INDEX(Data!$DH$33:$DK$82,$D48,1)+INDEX(Data!$DL$33:$DO$82,$D48,1)+INDEX(Data!$DP$33:$DS$82,$D48,1)),IF($G$14=\"LIQUOR PACKAGE\",INDEX(Data!$DT$33:$DW$82,$D48,1),IF($G$14=\"LIQUOR SIDE ORDER\",INDEX(Data!$DX$33:$EA$82,$D48,1),IF($G$14=\"MEAL\",INDEX(Data!$CR$33:$CU$82,$D48,1),IF($G$14=\"MEMBERSHIP\",INDEX(Data!$CV$33:$CY$82,$D48,1),IF($G$14=\"WINE\",INDEX(Data!$EB$33:$EE$82,$D48,1),\"\")))))))),\"\")","v":0},{"$f":"IFERROR(IF($G$14=\"BEER EXCHANGE\",INDEX(Data!$DD$33:$DG$82,$D48,2),IF($G$14=\"BEER PACKAGE\",INDEX(Data!$CZ$33:$DC$82,$D48,2),IF($G$14=\"BEER SIDE ORDER\",(INDEX(Data!$DH$33:$DK$82,$D48,2)+INDEX(Data!$DL$33:$DO$82,$D48,2)+INDEX(Data!$DP$33:$DS$82,$D48,2)),IF($G$14=\"LIQUOR PACKAGE\",INDEX(Data!$DT$33:$DW$82,$D48,2),IF($G$14=\"LIQUOR SIDE ORDER\",INDEX(Data!$DX$33:$EA$82,$D48,2),IF($G$14=\"MEAL\",INDEX(Data!$CR$33:$CU$82,$D48,2),IF($G$14=\"MEMBERSHIP\",INDEX(Data!$CV$33:$CY$82,$D48,2),IF($G$14=\"WINE\",INDEX(Data!$EB$33:$EE$82,$D48,2),\"\")))))))),\"\")","v":0},{"$f":"IFERROR(IF($G$14=\"BEER EXCHANGE\",INDEX(Data!$DD$33:$DG$82,$D48,3),IF($G$14=\"BEER PACKAGE\",INDEX(Data!$CZ$33:$DC$82,$D48,3),IF($G$14=\"BEER SIDE ORDER\",(INDEX(Data!$DH$33:$DK$82,$D48,3)+INDEX(Data!$DL$33:$DO$82,$D48,3)+INDEX(Data!$DP$33:$DS$82,$D48,3)),IF($G$14=\"LIQUOR PACKAGE\",INDEX(Data!$DT$33:$DW$82,$D48,3),IF($G$14=\"LIQUOR SIDE ORDER\",INDEX(Data!$DX$33:$EA$82,$D48,3),IF($G$14=\"MEAL\",INDEX(Data!$CR$33:$CU$82,$D48,3),IF($G$14=\"MEMBERSHIP\",INDEX(Data!$CV$33:$CY$82,$D48,3),IF($G$14=\"WINE\",INDEX(Data!$EB$33:$EE$82,$D48,3),\"\")))))))),\"\")","v":119},{"$f":"IFERROR(IF($G$14=\"BEER EXCHANGE\",INDEX(Data!$DD$33:$DG$82,$D48,4),IF($G$14=\"BEER PACKAGE\",INDEX(Data!$CZ$33:$DC$82,$D48,4),IF($G$14=\"BEER SIDE ORDER\",(INDEX(Data!$DH$33:$DK$82,$D48,4)+INDEX(Data!$DL$33:$DO$82,$D48,4)+INDEX(Data!$DP$33:$DS$82,$D48,4)),IF($G$14=\"LIQUOR PACKAGE\",INDEX(Data!$DT$33:$DW$82,$D48,4),IF($G$14=\"LIQUOR SIDE ORDER\",INDEX(Data!$DX$33:$EA$82,$D48,4),IF($G$14=\"MEAL\",INDEX(Data!$CR$33:$CU$82,$D48,4),IF($G$14=\"MEMBERSHIP\",INDEX(Data!$CV$33:$CY$82,$D48,4),IF($G$14=\"WINE\",INDEX(Data!$EB$33:$EE$82,$D48,4),\"\")))))))),\"\")","v":0},119]
[null,{"$f":"'Report A'!$B51","v":"2014-07-20"},{"$f":"'Report A'!$C51","v":"Sunday"},{"$f":"'Report A'!$D51","v":20},{"$f":"IFERROR(IF($G$14=\"BEER EXCHANGE\",INDEX(Data!$DD$33:$DG$82,$D49,1),IF($G$14=\"BEER PACKAGE\",INDEX(Data!$CZ$33:$DC$82,$D49,1),IF($G$14=\"BEER SIDE ORDER\",(INDEX(Data!$DH$33:$DK$82,$D49,1)+INDEX(Data!$DL$33:$DO$82,$D49,1)+INDEX(Data!$DP$33:$DS$82,$D49,1)),IF($G$14=\"LIQUOR PACKAGE\",INDEX(Data!$DT$33:$DW$82,$D49,1),IF($G$14=\"LIQUOR SIDE ORDER\",INDEX(Data!$DX$33:$EA$82,$D49,1),IF($G$14=\"MEAL\",INDEX(Data!$CR$33:$CU$82,$D49,1),IF($G$14=\"MEMBERSHIP\",INDEX(Data!$CV$33:$CY$82,$D49,1),IF($G$14=\"WINE\",INDEX(Data!$EB$33:$EE$82,$D49,1),\"\")))))))),\"\")","v":0},{"$f":"IFERROR(IF($G$14=\"BEER EXCHANGE\",INDEX(Data!$DD$33:$DG$82,$D49,2),IF($G$14=\"BEER PACKAGE\",INDEX(Data!$CZ$33:$DC$82,$D49,2),IF($G$14=\"BEER SIDE ORDER\",(INDEX(Data!$DH$33:$DK$82,$D49,2)+INDEX(Data!$DL$33:$DO$82,$D49,2)+INDEX(Data!$DP$33:$DS$82,$D49,2)),IF($G$14=\"LIQUOR PACKAGE\",INDEX(Data!$DT$33:$DW$82,$D49,2),IF($G$14=\"LIQUOR SIDE ORDER\",INDEX(Data!$DX$33:$EA$82,$D49,2),IF($G$14=\"MEAL\",INDEX(Data!$CR$33:$CU$82,$D49,2),IF($G$14=\"MEMBERSHIP\",INDEX(Data!$CV$33:$CY$82,$D49,2),IF($G$14=\"WINE\",INDEX(Data!$EB$33:$EE$82,$D49,2),\"\")))))))),\"\")","v":0},{"$f":"IFERROR(IF($G$14=\"BEER EXCHANGE\",INDEX(Data!$DD$33:$DG$82,$D49,3),IF($G$14=\"BEER PACKAGE\",INDEX(Data!$CZ$33:$DC$82,$D49,3),IF($G$14=\"BEER SIDE ORDER\",(INDEX(Data!$DH$33:$DK$82,$D49,3)+INDEX(Data!$DL$33:$DO$82,$D49,3)+INDEX(Data!$DP$33:$DS$82,$D49,3)),IF($G$14=\"LIQUOR PACKAGE\",INDEX(Data!$DT$33:$DW$82,$D49,3),IF($G$14=\"LIQUOR SIDE ORDER\",INDEX(Data!$DX$33:$EA$82,$D49,3),IF($G$14=\"MEAL\",INDEX(Data!$CR$33:$CU$82,$D49,3),IF($G$14=\"MEMBERSHIP\",INDEX(Data!$CV$33:$CY$82,$D49,3),IF($G$14=\"WINE\",INDEX(Data!$EB$33:$EE$82,$D49,3),\"\")))))))),\"\")","v":57},{"$f":"IFERROR(IF($G$14=\"BEER EXCHANGE\",INDEX(Data!$DD$33:$DG$82,$D49,4),IF($G$14=\"BEER PACKAGE\",INDEX(Data!$CZ$33:$DC$82,$D49,4),IF($G$14=\"BEER SIDE ORDER\",(INDEX(Data!$DH$33:$DK$82,$D49,4)+INDEX(Data!$DL$33:$DO$82,$D49,4)+INDEX(Data!$DP$33:$DS$82,$D49,4)),IF($G$14=\"LIQUOR PACKAGE\",INDEX(Data!$DT$33:$DW$82,$D49,4),IF($G$14=\"LIQUOR SIDE ORDER\",INDEX(Data!$DX$33:$EA$82,$D49,4),IF($G$14=\"MEAL\",INDEX(Data!$CR$33:$CU$82,$D49,4),IF($G$14=\"MEMBERSHIP\",INDEX(Data!$CV$33:$CY$82,$D49,4),IF($G$14=\"WINE\",INDEX(Data!$EB$33:$EE$82,$D49,4),\"\")))))))),\"\")","v":0},57]
[null,{"$f":"'Report A'!$B52","v":"2014-07-21"},{"$f":"'Report A'!$C52","v":"Monday"},{"$f":"'Report A'!$D52","v":21},{"$f":"IFERROR(IF($G$14=\"BEER EXCHANGE\",INDEX(Data!$DD$33:$DG$82,$D50,1),IF($G$14=\"BEER PACKAGE\",INDEX(Data!$CZ$33:$DC$82,$D50,1),IF($G$14=\"BEER SIDE ORDER\",(INDEX(Data!$DH$33:$DK$82,$D50,1)+INDEX(Data!$DL$33:$DO$82,$D50,1)+INDEX(Data!$DP$33:$DS$82,$D50,1)),IF($G$14=\"LIQUOR PACKAGE\",INDEX(Data!$DT$33:$DW$82,$D50,1),IF($G$14=\"LIQUOR SIDE ORDER\",INDEX(Data!$DX$33:$EA$82,$D50,1),IF($G$14=\"MEAL\",INDEX(Data!$CR$33:$CU$82,$D50,1),IF($G$14=\"MEMBERSHIP\",INDEX(Data!$CV$33:$CY$82,$D50,1),IF($G$14=\"WINE\",INDEX(Data!$EB$33:$EE$82,$D50,1),\"\")))))))),\"\")","v":0},{"$f":"IFERROR(IF($G$14=\"BEER EXCHANGE\",INDEX(Data!$DD$33:$DG$82,$D50,2),IF($G$14=\"BEER PACKAGE\",INDEX(Data!$CZ$33:$DC$82,$D50,2),IF($G$14=\"BEER SIDE ORDER\",(INDEX(Data!$DH$33:$DK$82,$D50,2)+INDEX(Data!$DL$33:$DO$82,$D50,2)+INDEX(Data!$DP$33:$DS$82,$D50,2)),IF($G$14=\"LIQUOR PACKAGE\",INDEX(Data!$DT$33:$DW$82,$D50,2),IF($G$14=\"LIQUOR SIDE ORDER\",INDEX(Data!$DX$33:$EA$82,$D50,2),IF($G$14=\"MEAL\",INDEX(Data!$CR$33:$CU$82,$D50,2),IF($G$14=\"MEMBERSHIP\",INDEX(Data!$CV$33:$CY$82,$D50,2),IF($G$14=\"WINE\",INDEX(Data!$EB$33:$EE$82,$D50,2),\"\")))))))),\"\")","v":0},{"$f":"IFERROR(IF($G$14=\"BEER EXCHANGE\",INDEX(Data!$DD$33:$DG$82,$D50,3),IF($G$14=\"BEER PACKAGE\",INDEX(Data!$CZ$33:$DC$82,$D50,3),IF($G$14=\"BEER SIDE ORDER\",(INDEX(Data!$DH$33:$DK$82,$D50,3)+INDEX(Data!$DL$33:$DO$82,$D50,3)+INDEX(Data!$DP$33:$DS$82,$D50,3)),IF($G$14=\"LIQUOR PACKAGE\",INDEX(Data!$DT$33:$DW$82,$D50,3),IF($G$14=\"LIQUOR SIDE ORDER\",INDEX(Data!$DX$33:$EA$82,$D50,3),IF($G$14=\"MEAL\",INDEX(Data!$CR$33:$CU$82,$D50,3),IF($G$14=\"MEMBERSHIP\",INDEX(Data!$CV$33:$CY$82,$D50,3),IF($G$14=\"WINE\",INDEX(Data!$EB$33:$EE$82,$D50,3),\"\")))))))),\"\")","v":49},{"$f":"IFERROR(IF($G$14=\"BEER EXCHANGE\",INDEX(Data!$DD$33:$DG$82,$D50,4),IF($G$14=\"BEER PACKAGE\",INDEX(Data!$CZ$33:$DC$82,$D50,4),IF($G$14=\"BEER SIDE ORDER\",(INDEX(Data!$DH$33:$DK$82,$D50,4)+INDEX(Data!$DL$33:$DO$82,$D50,4)+INDEX(Data!$DP$33:$DS$82,$D50,4)),IF($G$14=\"LIQUOR PACKAGE\",INDEX(Data!$DT$33:$DW$82,$D50,4),IF($G$14=\"LIQUOR SIDE ORDER\",INDEX(Data!$DX$33:$EA$82,$D50,4),IF($G$14=\"MEAL\",INDEX(Data!$CR$33:$CU$82,$D50,4),IF($G$14=\"MEMBERSHIP\",INDEX(Data!$CV$33:$CY$82,$D50,4),IF($G$14=\"WINE\",INDEX(Data!$EB$33:$EE$82,$D50,4),\"\")))))))),\"\")","v":0},49]
[null,{"$f":"'Report A'!$B53","v":"2014-07-22"},{"$f":"'Report A'!$C53","v":"Tuesday"},{"$f":"'Report A'!$D53","v":22},{"$f":"IFERROR(IF($G$14=\"BEER EXCHANGE\",INDEX(Data!$DD$33:$DG$82,$D51,1),IF($G$14=\"BEER PACKAGE\",INDEX(Data!$CZ$33:$DC$82,$D51,1),IF($G$14=\"BEER SIDE ORDER\",(INDEX(Data!$DH$33:$DK$82,$D51,1)+INDEX(Data!$DL$33:$DO$82,$D51,1)+INDEX(Data!$DP$33:$DS$82,$D51,1)),IF($G$14=\"LIQUOR PACKAGE\",INDEX(Data!$DT$33:$DW$82,$D51,1),IF($G$14=\"LIQUOR SIDE ORDER\",INDEX(Data!$DX$33:$EA$82,$D51,1),IF($G$14=\"MEAL\",INDEX(Data!$CR$33:$CU$82,$D51,1),IF($G$14=\"MEMBERSHIP\",INDEX(Data!$CV$33:$CY$82,$D51,1),IF($G$14=\"WINE\",INDEX(Data!$EB$33:$EE$82,$D51,1),\"\")))))))),\"\")","v":0},{"$f":"IFERROR(IF($G$14=\"BEER EXCHANGE\",INDEX(Data!$DD$33:$DG$82,$D51,2),IF($G$14=\"BEER PACKAGE\",INDEX(Data!$CZ$33:$DC$82,$D51,2),IF($G$14=\"BEER SIDE ORDER\",(INDEX(Data!$DH$33:$DK$82,$D51,2)+INDEX(Data!$DL$33:$DO$82,$D51,2)+INDEX(Data!$DP$33:$DS$82,$D51,2)),IF($G$14=\"LIQUOR PACKAGE\",INDEX(Data!$DT$33:$DW$82,$D51,2),IF($G$14=\"LIQUOR SIDE ORDER\",INDEX(Data!$DX$33:$EA$82,$D51,2),IF($G$14=\"MEAL\",INDEX(Data!$CR$33:$CU$82,$D51,2),IF($G$14=\"MEMBERSHIP\",INDEX(Data!$CV$33:$CY$82,$D51,2),IF($G$14=\"WINE\",INDEX(Data!$EB$33:$EE$82,$D51,2),\"\")))))))),\"\")","v":0},{"$f":"IFERROR(IF($G$14=\"BEER EXCHANGE\",INDEX(Data!$DD$33:$DG$82,$D51,3),IF($G$14=\"BEER PACKAGE\",INDEX(Data!$CZ$33:$DC$82,$D51,3),IF($G$14=\"BEER SIDE ORDER\",(INDEX(Data!$DH$33:$DK$82,$D51,3)+INDEX(Data!$DL$33:$DO$82,$D51,3)+INDEX(Data!$DP$33:$DS$82,$D51,3)),IF($G$14=\"LIQUOR PACKAGE\",INDEX(Data!$DT$33:$DW$82,$D51,3),IF($G$14=\"LIQUOR SIDE ORDER\",INDEX(Data!$DX$33:$EA$82,$D51,3),IF($G$14=\"MEAL\",INDEX(Data!$CR$33:$CU$82,$D51,3),IF($G$14=\"MEMBERSHIP\",INDEX(Data!$CV$33:$CY$82,$D51,3),IF($G$14=\"WINE\",INDEX(Data!$EB$33:$EE$82,$D51,3),\"\")))))))),\"\")","v":50},{"$f":"IFERROR(IF($G$14=\"BEER EXCHANGE\",INDEX(Data!$DD$33:$DG$82,$D51,4),IF($G$14=\"BEER PACKAGE\",INDEX(Data!$CZ$33:$DC$82,$D51,4),IF($G$14=\"BEER SIDE ORDER\",(INDEX(Data!$DH$33:$DK$82,$D51,4)+INDEX(Data!$DL$33:$DO$82,$D51,4)+INDEX(Data!$DP$33:$DS$82,$D51,4)),IF($G$14=\"LIQUOR PACKAGE\",INDEX(Data!$DT$33:$DW$82,$D51,4),IF($G$14=\"LIQUOR SIDE ORDER\",INDEX(Data!$DX$33:$EA$82,$D51,4),IF($G$14=\"MEAL\",INDEX(Data!$CR$33:$CU$82,$D51,4),IF($G$14=\"MEMBERSHIP\",INDEX(Data!$CV$33:$CY$82,$D51,4),IF($G$14=\"WINE\",INDEX(Data!$EB$33:$EE$82,$D51,4),\"\")))))))),\"\")","v":0},50]
[null,{"$f":"'Report A'!$B54","v":"2014-07-23"},{"$f":"'Report A'!$C54","v":"Wednesday"},{"$f":"'Report A'!$D54","v":23},{"$f":"IFERROR(IF($G$14=\"BEER EXCHANGE\",INDEX(Data!$DD$33:$DG$82,$D52,1),IF($G$14=\"BEER PACKAGE\",INDEX(Data!$CZ$33:$DC$82,$D52,1),IF($G$14=\"BEER SIDE ORDER\",(INDEX(Data!$DH$33:$DK$82,$D52,1)+INDEX(Data!$DL$33:$DO$82,$D52,1)+INDEX(Data!$DP$33:$DS$82,$D52,1)),IF($G$14=\"LIQUOR PACKAGE\",INDEX(Data!$DT$33:$DW$82,$D52,1),IF($G$14=\"LIQUOR SIDE ORDER\",INDEX(Data!$DX$33:$EA$82,$D52,1),IF($G$14=\"MEAL\",INDEX(Data!$CR$33:$CU$82,$D52,1),IF($G$14=\"MEMBERSHIP\",INDEX(Data!$CV$33:$CY$82,$D52,1),IF($G$14=\"WINE\",INDEX(Data!$EB$33:$EE$82,$D52,1),\"\")))))))),\"\")","v":0},{"$f":"IFERROR(IF($G$14=\"BEER EXCHANGE\",INDEX(Data!$DD$33:$DG$82,$D52,2),IF($G$14=\"BEER PACKAGE\",INDEX(Data!$CZ$33:$DC$82,$D52,2),IF($G$14=\"BEER SIDE ORDER\",(INDEX(Data!$DH$33:$DK$82,$D52,2)+INDEX(Data!$DL$33:$DO$82,$D52,2)+INDEX(Data!$DP$33:$DS$82,$D52,2)),IF($G$14=\"LIQUOR PACKAGE\",INDEX(Data!$DT$33:$DW$82,$D52,2),IF($G$14=\"LIQUOR SIDE ORDER\",INDEX(Data!$DX$33:$EA$82,$D52,2),IF($G$14=\"MEAL\",INDEX(Data!$CR$33:$CU$82,$D52,2),IF($G$14=\"MEMBERSHIP\",INDEX(Data!$CV$33:$CY$82,$D52,2),IF($G$14=\"WINE\",INDEX(Data!$EB$33:$EE$82,$D52,2),\"\")))))))),\"\")","v":0},{"$f":"IFERROR(IF($G$14=\"BEER EXCHANGE\",INDEX(Data!$DD$33:$DG$82,$D52,3),IF($G$14=\"BEER PACKAGE\",INDEX(Data!$CZ$33:$DC$82,$D52,3),IF($G$14=\"BEER SIDE ORDER\",(INDEX(Data!$DH$33:$DK$82,$D52,3)+INDEX(Data!$DL$33:$DO$82,$D52,3)+INDEX(Data!$DP$33:$DS$82,$D52,3)),IF($G$14=\"LIQUOR PACKAGE\",INDEX(Data!$DT$33:$DW$82,$D52,3),IF($G$14=\"LIQUOR SIDE ORDER\",INDEX(Data!$DX$33:$EA$82,$D52,3),IF($G$14=\"MEAL\",INDEX(Data!$CR$33:$CU$82,$D52,3),IF($G$14=\"MEMBERSHIP\",INDEX(Data!$CV$33:$CY$82,$D52,3),IF($G$14=\"WINE\",INDEX(Data!$EB$33:$EE$82,$D52,3),\"\")))))))),\"\")","v":38},{"$f":"IFERROR(IF($G$14=\"BEER EXCHANGE\",INDEX(Data!$DD$33:$DG$82,$D52,4),IF($G$14=\"BEER PACKAGE\",INDEX(Data!$CZ$33:$DC$82,$D52,4),IF($G$14=\"BEER SIDE ORDER\",(INDEX(Data!$DH$33:$DK$82,$D52,4)+INDEX(Data!$DL$33:$DO$82,$D52,4)+INDEX(Data!$DP$33:$DS$82,$D52,4)),IF($G$14=\"LIQUOR PACKAGE\",INDEX(Data!$DT$33:$DW$82,$D52,4),IF($G$14=\"LIQUOR SIDE ORDER\",INDEX(Data!$DX$33:$EA$82,$D52,4),IF($G$14=\"MEAL\",INDEX(Data!$CR$33:$CU$82,$D52,4),IF($G$14=\"MEMBERSHIP\",INDEX(Data!$CV$33:$CY$82,$D52,4),IF($G$14=\"WINE\",INDEX(Data!$EB$33:$EE$82,$D52,4),\"\")))))))),\"\")","v":0},38]
[null,{"$f":"'Report A'!$B55","v":"2014-07-24"},{"$f":"'Report A'!$C55","v":"Thursday"},{"$f":"'Report A'!$D55","v":24},{"$f":"IFERROR(IF($G$14=\"BEER EXCHANGE\",INDEX(Data!$DD$33:$DG$82,$D53,1),IF($G$14=\"BEER PACKAGE\",INDEX(Data!$CZ$33:$DC$82,$D53,1),IF($G$14=\"BEER SIDE ORDER\",(INDEX(Data!$DH$33:$DK$82,$D53,1)+INDEX(Data!$DL$33:$DO$82,$D53,1)+INDEX(Data!$DP$33:$DS$82,$D53,1)),IF($G$14=\"LIQUOR PACKAGE\",INDEX(Data!$DT$33:$DW$82,$D53,1),IF($G$14=\"LIQUOR SIDE ORDER\",INDEX(Data!$DX$33:$EA$82,$D53,1),IF($G$14=\"MEAL\",INDEX(Data!$CR$33:$CU$82,$D53,1),IF($G$14=\"MEMBERSHIP\",INDEX(Data!$CV$33:$CY$82,$D53,1),IF($G$14=\"WINE\",INDEX(Data!$EB$33:$EE$82,$D53,1),\"\")))))))),\"\")","v":0},{"$f":"IFERROR(IF($G$14=\"BEER EXCHANGE\",INDEX(Data!$DD$33:$DG$82,$D53,2),IF($G$14=\"BEER PACKAGE\",INDEX(Data!$CZ$33:$DC$82,$D53,2),IF($G$14=\"BEER SIDE ORDER\",(INDEX(Data!$DH$33:$DK$82,$D53,2)+INDEX(Data!$DL$33:$DO$82,$D53,2)+INDEX(Data!$DP$33:$DS$82,$D53,2)),IF($G$14=\"LIQUOR PACKAGE\",INDEX(Data!$DT$33:$DW$82,$D53,2),IF($G$14=\"LIQUOR SIDE ORDER\",INDEX(Data!$DX$33:$EA$82,$D53,2),IF($G$14=\"MEAL\",INDEX(Data!$CR$33:$CU$82,$D53,2),IF($G$14=\"MEMBERSHIP\",INDEX(Data!$CV$33:$CY$82,$D53,2),IF($G$14=\"WINE\",INDEX(Data!$EB$33:$EE$82,$D53,2),\"\")))))))),\"\")","v":0},{"$f":"IFERROR(IF($G$14=\"BEER EXCHANGE\",INDEX(Data!$DD$33:$DG$82,$D53,3),IF($G$14=\"BEER PACKAGE\",INDEX(Data!$CZ$33:$DC$82,$D53,3),IF($G$14=\"BEER SIDE ORDER\",(INDEX(Data!$DH$33:$DK$82,$D53,3)+INDEX(Data!$DL$33:$DO$82,$D53,3)+INDEX(Data!$DP$33:$DS$82,$D53,3)),IF($G$14=\"LIQUOR PACKAGE\",INDEX(Data!$DT$33:$DW$82,$D53,3),IF($G$14=\"LIQUOR SIDE ORDER\",INDEX(Data!$DX$33:$EA$82,$D53,3),IF($G$14=\"MEAL\",INDEX(Data!$CR$33:$CU$82,$D53,3),IF($G$14=\"MEMBERSHIP\",INDEX(Data!$CV$33:$CY$82,$D53,3),IF($G$14=\"WINE\",INDEX(Data!$EB$33:$EE$82,$D53,3),\"\")))))))),\"\")","v":15},{"$f":"IFERROR(IF($G$14=\"BEER EXCHANGE\",INDEX(Data!$DD$33:$DG$82,$D53,4),IF($G$14=\"BEER PACKAGE\",INDEX(Data!$CZ$33:$DC$82,$D53,4),IF($G$14=\"BEER SIDE ORDER\",(INDEX(Data!$DH$33:$DK$82,$D53,4)+INDEX(Data!$DL$33:$DO$82,$D53,4)+INDEX(Data!$DP$33:$DS$82,$D53,4)),IF($G$14=\"LIQUOR PACKAGE\",INDEX(Data!$DT$33:$DW$82,$D53,4),IF($G$14=\"LIQUOR SIDE ORDER\",INDEX(Data!$DX$33:$EA$82,$D53,4),IF($G$14=\"MEAL\",INDEX(Data!$CR$33:$CU$82,$D53,4),IF($G$14=\"MEMBERSHIP\",INDEX(Data!$CV$33:$CY$82,$D53,4),IF($G$14=\"WINE\",INDEX(Data!$EB$33:$EE$82,$D53,4),\"\")))))))),\"\")","v":0},15]
[null,{"$f":"'Report A'!$B56","v":"2014-07-25"},{"$f":"'Report A'!$C56","v":"Friday"},{"$f":"'Report A'!$D56","v":25},{"$f":"IFERROR(IF($G$14=\"BEER EXCHANGE\",INDEX(Data!$DD$33:$DG$82,$D54,1),IF($G$14=\"BEER PACKAGE\",INDEX(Data!$CZ$33:$DC$82,$D54,1),IF($G$14=\"BEER SIDE ORDER\",(INDEX(Data!$DH$33:$DK$82,$D54,1)+INDEX(Data!$DL$33:$DO$82,$D54,1)+INDEX(Data!$DP$33:$DS$82,$D54,1)),IF($G$14=\"LIQUOR PACKAGE\",INDEX(Data!$DT$33:$DW$82,$D54,1),IF($G$14=\"LIQUOR SIDE ORDER\",INDEX(Data!$DX$33:$EA$82,$D54,1),IF($G$14=\"MEAL\",INDEX(Data!$CR$33:$CU$82,$D54,1),IF($G$14=\"MEMBERSHIP\",INDEX(Data!$CV$33:$CY$82,$D54,1),IF($G$14=\"WINE\",INDEX(Data!$EB$33:$EE$82,$D54,1),\"\")))))))),\"\")","v":0},{"$f":"IFERROR(IF($G$14=\"BEER EXCHANGE\",INDEX(Data!$DD$33:$DG$82,$D54,2),IF($G$14=\"BEER PACKAGE\",INDEX(Data!$CZ$33:$DC$82,$D54,2),IF($G$14=\"BEER SIDE ORDER\",(INDEX(Data!$DH$33:$DK$82,$D54,2)+INDEX(Data!$DL$33:$DO$82,$D54,2)+INDEX(Data!$DP$33:$DS$82,$D54,2)),IF($G$14=\"LIQUOR PACKAGE\",INDEX(Data!$DT$33:$DW$82,$D54,2),IF($G$14=\"LIQUOR SIDE ORDER\",INDEX(Data!$DX$33:$EA$82,$D54,2),IF($G$14=\"MEAL\",INDEX(Data!$CR$33:$CU$82,$D54,2),IF($G$14=\"MEMBERSHIP\",INDEX(Data!$CV$33:$CY$82,$D54,2),IF($G$14=\"WINE\",INDEX(Data!$EB$33:$EE$82,$D54,2),\"\")))))))),\"\")","v":0},{"$f":"IFERROR(IF($G$14=\"BEER EXCHANGE\",INDEX(Data!$DD$33:$DG$82,$D54,3),IF($G$14=\"BEER PACKAGE\",INDEX(Data!$CZ$33:$DC$82,$D54,3),IF($G$14=\"BEER SIDE ORDER\",(INDEX(Data!$DH$33:$DK$82,$D54,3)+INDEX(Data!$DL$33:$DO$82,$D54,3)+INDEX(Data!$DP$33:$DS$82,$D54,3)),IF($G$14=\"LIQUOR PACKAGE\",INDEX(Data!$DT$33:$DW$82,$D54,3),IF($G$14=\"LIQUOR SIDE ORDER\",INDEX(Data!$DX$33:$EA$82,$D54,3),IF($G$14=\"MEAL\",INDEX(Data!$CR$33:$CU$82,$D54,3),IF($G$14=\"MEMBERSHIP\",INDEX(Data!$CV$33:$CY$82,$D54,3),IF($G$14=\"WINE\",INDEX(Data!$EB$33:$EE$82,$D54,3),\"\")))))))),\"\")","v":57},{"$f":"IFERROR(IF($G$14=\"BEER EXCHANGE\",INDEX(Data!$DD$33:$DG$82,$D54,4),IF($G$14=\"BEER PACKAGE\",INDEX(Data!$CZ$33:$DC$82,$D54,4),IF($G$14=\"BEER SIDE ORDER\",(INDEX(Data!$DH$33:$DK$82,$D54,4)+INDEX(Data!$DL$33:$DO$82,$D54,4)+INDEX(Data!$DP$33:$DS$82,$D54,4)),IF($G$14=\"LIQUOR PACKAGE\",INDEX(Data!$DT$33:$DW$82,$D54,4),IF($G$14=\"LIQUOR SIDE ORDER\",INDEX(Data!$DX$33:$EA$82,$D54,4),IF($G$14=\"MEAL\",INDEX(Data!$CR$33:$CU$82,$D54,4),IF($G$14=\"MEMBERSHIP\",INDEX(Data!$CV$33:$CY$82,$D54,4),IF($G$14=\"WINE\",INDEX(Data!$EB$33:$EE$82,$D54,4),\"\")))))))),\"\")","v":0},57]
[null,{"$f":"'Report A'!$B57","v":"2014-07-26"},{"$f":"'Report A'!$C57","v":"Saturday"},{"$f":"'Report A'!$D57","v":26},{"$f":"IFERROR(IF($G$14=\"BEER EXCHANGE\",INDEX(Data!$DD$33:$DG$82,$D55,1),IF($G$14=\"BEER PACKAGE\",INDEX(Data!$CZ$33:$DC$82,$D55,1),IF($G$14=\"BEER SIDE ORDER\",(INDEX(Data!$DH$33:$DK$82,$D55,1)+INDEX(Data!$DL$33:$DO$82,$D55,1)+INDEX(Data!$DP$33:$DS$82,$D55,1)),IF($G$14=\"LIQUOR PACKAGE\",INDEX(Data!$DT$33:$DW$82,$D55,1),IF($G$14=\"LIQUOR SIDE ORDER\",INDEX(Data!$DX$33:$EA$82,$D55,1),IF($G$14=\"MEAL\",INDEX(Data!$CR$33:$CU$82,$D55,1),IF($G$14=\"MEMBERSHIP\",INDEX(Data!$CV$33:$CY$82,$D55,1),IF($G$14=\"WINE\",INDEX(Data!$EB$33:$EE$82,$D55,1),\"\")))))))),\"\")","v":0},{"$f":"IFERROR(IF($G$14=\"BEER EXCHANGE\",INDEX(Data!$DD$33:$DG$82,$D55,2),IF($G$14=\"BEER PACKAGE\",INDEX(Data!$CZ$33:$DC$82,$D55,2),IF($G$14=\"BEER SIDE ORDER\",(INDEX(Data!$DH$33:$DK$82,$D55,2)+INDEX(Data!$DL$33:$DO$82,$D55,2)+INDEX(Data!$DP$33:$DS$82,$D55,2)),IF($G$14=\"LIQUOR PACKAGE\",INDEX(Data!$DT$33:$DW$82,$D55,2),IF($G$14=\"LIQUOR SIDE ORDER\",INDEX(Data!$DX$33:$EA$82,$D55,2),IF($G$14=\"MEAL\",INDEX(Data!$CR$33:$CU$82,$D55,2),IF($G$14=\"MEMBERSHIP\",INDEX(Data!$CV$33:$CY$82,$D55,2),IF($G$14=\"WINE\",INDEX(Data!$EB$33:$EE$82,$D55,2),\"\")))))))),\"\")","v":0},{"$f":"IFERROR(IF($G$14=\"BEER EXCHANGE\",INDEX(Data!$DD$33:$DG$82,$D55,3),IF($G$14=\"BEER PACKAGE\",INDEX(Data!$CZ$33:$DC$82,$D55,3),IF($G$14=\"BEER SIDE ORDER\",(INDEX(Data!$DH$33:$DK$82,$D55,3)+INDEX(Data!$DL$33:$DO$82,$D55,3)+INDEX(Data!$DP$33:$DS$82,$D55,3)),IF($G$14=\"LIQUOR PACKAGE\",INDEX(Data!$DT$33:$DW$82,$D55,3),IF($G$14=\"LIQUOR SIDE ORDER\",INDEX(Data!$DX$33:$EA$82,$D55,3),IF($G$14=\"MEAL\",INDEX(Data!$CR$33:$CU$82,$D55,3),IF($G$14=\"MEMBERSHIP\",INDEX(Data!$CV$33:$CY$82,$D55,3),IF($G$14=\"WINE\",INDEX(Data!$EB$33:$EE$82,$D55,3),\"\")))))))),\"\")","v":98},{"$f":"IFERROR(IF($G$14=\"BEER EXCHANGE\",INDEX(Data!$DD$33:$DG$82,$D55,4),IF($G$14=\"BEER PACKAGE\",INDEX(Data!$CZ$33:$DC$82,$D55,4),IF($G$14=\"BEER SIDE ORDER\",(INDEX(Data!$DH$33:$DK$82,$D55,4)+INDEX(Data!$DL$33:$DO$82,$D55,4)+INDEX(Data!$DP$33:$DS$82,$D55,4)),IF($G$14=\"LIQUOR PACKAGE\",INDEX(Data!$DT$33:$DW$82,$D55,4),IF($G$14=\"LIQUOR SIDE ORDER\",INDEX(Data!$DX$33:$EA$82,$D55,4),IF($G$14=\"MEAL\",INDEX(Data!$CR$33:$CU$82,$D55,4),IF($G$14=\"MEMBERSHIP\",INDEX(Data!$CV$33:$CY$82,$D55,4),IF($G$14=\"WINE\",INDEX(Data!$EB$33:$EE$82,$D55,4),\"\")))))))),\"\")","v":0},98]
[null,{"$f":"'Report A'!$B58","v":"2014-07-27"},{"$f":"'Report A'!$C58","v":"Sunday +"},{"$f":"'Report A'!$D58","v":27},{"$f":"IFERROR(IF($G$14=\"BEER EXCHANGE\",INDEX(Data!$DD$33:$DG$82,$D56,1),IF($G$14=\"BEER PACKAGE\",INDEX(Data!$CZ$33:$DC$82,$D56,1),IF($G$14=\"BEER SIDE ORDER\",(INDEX(Data!$DH$33:$DK$82,$D56,1)+INDEX(Data!$DL$33:$DO$82,$D56,1)+INDEX(Data!$DP$33:$DS$82,$D56,1)),IF($G$14=\"LIQUOR PACKAGE\",INDEX(Data!$DT$33:$DW$82,$D56,1),IF($G$14=\"LIQUOR SIDE ORDER\",INDEX(Data!$DX$33:$EA$82,$D56,1),IF($G$14=\"MEAL\",INDEX(Data!$CR$33:$CU$82,$D56,1),IF($G$14=\"MEMBERSHIP\",INDEX(Data!$CV$33:$CY$82,$D56,1),IF($G$14=\"WINE\",INDEX(Data!$EB$33:$EE$82,$D56,1),\"\")))))))),\"\")","v":0},{"$f":"IFERROR(IF($G$14=\"BEER EXCHANGE\",INDEX(Data!$DD$33:$DG$82,$D56,2),IF($G$14=\"BEER PACKAGE\",INDEX(Data!$CZ$33:$DC$82,$D56,2),IF($G$14=\"BEER SIDE ORDER\",(INDEX(Data!$DH$33:$DK$82,$D56,2)+INDEX(Data!$DL$33:$DO$82,$D56,2)+INDEX(Data!$DP$33:$DS$82,$D56,2)),IF($G$14=\"LIQUOR PACKAGE\",INDEX(Data!$DT$33:$DW$82,$D56,2),IF($G$14=\"LIQUOR SIDE ORDER\",INDEX(Data!$DX$33:$EA$82,$D56,2),IF($G$14=\"MEAL\",INDEX(Data!$CR$33:$CU$82,$D56,2),IF($G$14=\"MEMBERSHIP\",INDEX(Data!$CV$33:$CY$82,$D56,2),IF($G$14=\"WINE\",INDEX(Data!$EB$33:$EE$82,$D56,2),\"\")))))))),\"\")","v":0},{"$f":"IFERROR(IF($G$14=\"BEER EXCHANGE\",INDEX(Data!$DD$33:$DG$82,$D56,3),IF($G$14=\"BEER PACKAGE\",INDEX(Data!$CZ$33:$DC$82,$D56,3),IF($G$14=\"BEER SIDE ORDER\",(INDEX(Data!$DH$33:$DK$82,$D56,3)+INDEX(Data!$DL$33:$DO$82,$D56,3)+INDEX(Data!$DP$33:$DS$82,$D56,3)),IF($G$14=\"LIQUOR PACKAGE\",INDEX(Data!$DT$33:$DW$82,$D56,3),IF($G$14=\"LIQUOR SIDE ORDER\",INDEX(Data!$DX$33:$EA$82,$D56,3),IF($G$14=\"MEAL\",INDEX(Data!$CR$33:$CU$82,$D56,3),IF($G$14=\"MEMBERSHIP\",INDEX(Data!$CV$33:$CY$82,$D56,3),IF($G$14=\"WINE\",INDEX(Data!$EB$33:$EE$82,$D56,3),\"\")))))))),\"\")","v":96},{"$f":"IFERROR(IF($G$14=\"BEER EXCHANGE\",INDEX(Data!$DD$33:$DG$82,$D56,4),IF($G$14=\"BEER PACKAGE\",INDEX(Data!$CZ$33:$DC$82,$D56,4),IF($G$14=\"BEER SIDE ORDER\",(INDEX(Data!$DH$33:$DK$82,$D56,4)+INDEX(Data!$DL$33:$DO$82,$D56,4)+INDEX(Data!$DP$33:$DS$82,$D56,4)),IF($G$14=\"LIQUOR PACKAGE\",INDEX(Data!$DT$33:$DW$82,$D56,4),IF($G$14=\"LIQUOR SIDE ORDER\",INDEX(Data!$DX$33:$EA$82,$D56,4),IF($G$14=\"MEAL\",INDEX(Data!$CR$33:$CU$82,$D56,4),IF($G$14=\"MEMBERSHIP\",INDEX(Data!$CV$33:$CY$82,$D56,4),IF($G$14=\"WINE\",INDEX(Data!$EB$33:$EE$82,$D56,4),\"\")))))))),\"\")","v":0},96]
[null,{"$f":"'Report A'!$B59","v":"2014-07-28"},{"$f":"'Report A'!$C59","v":"Monday ++"},{"$f":"'Report A'!$D59","v":28},{"$f":"IFERROR(IF($G$14=\"BEER EXCHANGE\",INDEX(Data!$DD$33:$DG$82,$D57,1),IF($G$14=\"BEER PACKAGE\",INDEX(Data!$CZ$33:$DC$82,$D57,1),IF($G$14=\"BEER SIDE ORDER\",(INDEX(Data!$DH$33:$DK$82,$D57,1)+INDEX(Data!$DL$33:$DO$82,$D57,1)+INDEX(Data!$DP$33:$DS$82,$D57,1)),IF($G$14=\"LIQUOR PACKAGE\",INDEX(Data!$DT$33:$DW$82,$D57,1),IF($G$14=\"LIQUOR SIDE ORDER\",INDEX(Data!$DX$33:$EA$82,$D57,1),IF($G$14=\"MEAL\",INDEX(Data!$CR$33:$CU$82,$D57,1),IF($G$14=\"MEMBERSHIP\",INDEX(Data!$CV$33:$CY$82,$D57,1),IF($G$14=\"WINE\",INDEX(Data!$EB$33:$EE$82,$D57,1),\"\")))))))),\"\")","v":0},{"$f":"IFERROR(IF($G$14=\"BEER EXCHANGE\",INDEX(Data!$DD$33:$DG$82,$D57,2),IF($G$14=\"BEER PACKAGE\",INDEX(Data!$CZ$33:$DC$82,$D57,2),IF($G$14=\"BEER SIDE ORDER\",(INDEX(Data!$DH$33:$DK$82,$D57,2)+INDEX(Data!$DL$33:$DO$82,$D57,2)+INDEX(Data!$DP$33:$DS$82,$D57,2)),IF($G$14=\"LIQUOR PACKAGE\",INDEX(Data!$DT$33:$DW$82,$D57,2),IF($G$14=\"LIQUOR SIDE ORDER\",INDEX(Data!$DX$33:$EA$82,$D57,2),IF($G$14=\"MEAL\",INDEX(Data!$CR$33:$CU$82,$D57,2),IF($G$14=\"MEMBERSHIP\",INDEX(Data!$CV$33:$CY$82,$D57,2),IF($G$14=\"WINE\",INDEX(Data!$EB$33:$EE$82,$D57,2),\"\")))))))),\"\")","v":0},{"$f":"IFERROR(IF($G$14=\"BEER EXCHANGE\",INDEX(Data!$DD$33:$DG$82,$D57,3),IF($G$14=\"BEER PACKAGE\",INDEX(Data!$CZ$33:$DC$82,$D57,3),IF($G$14=\"BEER SIDE ORDER\",(INDEX(Data!$DH$33:$DK$82,$D57,3)+INDEX(Data!$DL$33:$DO$82,$D57,3)+INDEX(Data!$DP$33:$DS$82,$D57,3)),IF($G$14=\"LIQUOR PACKAGE\",INDEX(Data!$DT$33:$DW$82,$D57,3),IF($G$14=\"LIQUOR SIDE ORDER\",INDEX(Data!$DX$33:$EA$82,$D57,3),IF($G$14=\"MEAL\",INDEX(Data!$CR$33:$CU$82,$D57,3),IF($G$14=\"MEMBERSHIP\",INDEX(Data!$CV$33:$CY$82,$D57,3),IF($G$14=\"WINE\",INDEX(Data!$EB$33:$EE$82,$D57,3),\"\")))))))),\"\")","v":110},{"$f":"IFERROR(IF($G$14=\"BEER EXCHANGE\",INDEX(Data!$DD$33:$DG$82,$D57,4),IF($G$14=\"BEER PACKAGE\",INDEX(Data!$CZ$33:$DC$82,$D57,4),IF($G$14=\"BEER SIDE ORDER\",(INDEX(Data!$DH$33:$DK$82,$D57,4)+INDEX(Data!$DL$33:$DO$82,$D57,4)+INDEX(Data!$DP$33:$DS$82,$D57,4)),IF($G$14=\"LIQUOR PACKAGE\",INDEX(Data!$DT$33:$DW$82,$D57,4),IF($G$14=\"LIQUOR SIDE ORDER\",INDEX(Data!$DX$33:$EA$82,$D57,4),IF($G$14=\"MEAL\",INDEX(Data!$CR$33:$CU$82,$D57,4),IF($G$14=\"MEMBERSHIP\",INDEX(Data!$CV$33:$CY$82,$D57,4),IF($G$14=\"WINE\",INDEX(Data!$EB$33:$EE$82,$D57,4),\"\")))))))),\"\")","v":0},110]
[null,{"$f":"'Report A'!$B60","v":"2014-07-29"},{"$f":"'Report A'!$C60","v":"Tuesday ++"},{"$f":"'Report A'!$D60","v":29},{"$f":"IFERROR(IF($G$14=\"BEER EXCHANGE\",INDEX(Data!$DD$33:$DG$82,$D58,1),IF($G$14=\"BEER PACKAGE\",INDEX(Data!$CZ$33:$DC$82,$D58,1),IF($G$14=\"BEER SIDE ORDER\",(INDEX(Data!$DH$33:$DK$82,$D58,1)+INDEX(Data!$DL$33:$DO$82,$D58,1)+INDEX(Data!$DP$33:$DS$82,$D58,1)),IF($G$14=\"LIQUOR PACKAGE\",INDEX(Data!$DT$33:$DW$82,$D58,1),IF($G$14=\"LIQUOR SIDE ORDER\",INDEX(Data!$DX$33:$EA$82,$D58,1),IF($G$14=\"MEAL\",INDEX(Data!$CR$33:$CU$82,$D58,1),IF($G$14=\"MEMBERSHIP\",INDEX(Data!$CV$33:$CY$82,$D58,1),IF($G$14=\"WINE\",INDEX(Data!$EB$33:$EE$82,$D58,1),\"\")))))))),\"\")","v":0},{"$f":"IFERROR(IF($G$14=\"BEER EXCHANGE\",INDEX(Data!$DD$33:$DG$82,$D58,2),IF($G$14=\"BEER PACKAGE\",INDEX(Data!$CZ$33:$DC$82,$D58,2),IF($G$14=\"BEER SIDE ORDER\",(INDEX(Data!$DH$33:$DK$82,$D58,2)+INDEX(Data!$DL$33:$DO$82,$D58,2)+INDEX(Data!$DP$33:$DS$82,$D58,2)),IF($G$14=\"LIQUOR PACKAGE\",INDEX(Data!$DT$33:$DW$82,$D58,2),IF($G$14=\"LIQUOR SIDE ORDER\",INDEX(Data!$DX$33:$EA$82,$D58,2),IF($G$14=\"MEAL\",INDEX(Data!$CR$33:$CU$82,$D58,2),IF($G$14=\"MEMBERSHIP\",INDEX(Data!$CV$33:$CY$82,$D58,2),IF($G$14=\"WINE\",INDEX(Data!$EB$33:$EE$82,$D58,2),\"\")))))))),\"\")","v":0},{"$f":"IFERROR(IF($G$14=\"BEER EXCHANGE\",INDEX(Data!$DD$33:$DG$82,$D58,3),IF($G$14=\"BEER PACKAGE\",INDEX(Data!$CZ$33:$DC$82,$D58,3),IF($G$14=\"BEER SIDE ORDER\",(INDEX(Data!$DH$33:$DK$82,$D58,3)+INDEX(Data!$DL$33:$DO$82,$D58,3)+INDEX(Data!$DP$33:$DS$82,$D58,3)),IF($G$14=\"LIQUOR PACKAGE\",INDEX(Data!$DT$33:$DW$82,$D58,3),IF($G$14=\"LIQUOR SIDE ORDER\",INDEX(Data!$DX$33:$EA$82,$D58,3),IF($G$14=\"MEAL\",INDEX(Data!$CR$33:$CU$82,$D58,3),IF($G$14=\"MEMBERSHIP\",INDEX(Data!$CV$33:$CY$82,$D58,3),IF($G$14=\"WINE\",INDEX(Data!$EB$33:$EE$82,$D58,3),\"\")))))))),\"\")","v":84},{"$f":"IFERROR(IF($G$14=\"BEER EXCHANGE\",INDEX(Data!$DD$33:$DG$82,$D58,4),IF($G$14=\"BEER PACKAGE\",INDEX(Data!$CZ$33:$DC$82,$D58,4),IF($G$14=\"BEER SIDE ORDER\",(INDEX(Data!$DH$33:$DK$82,$D58,4)+INDEX(Data!$DL$33:$DO$82,$D58,4)+INDEX(Data!$DP$33:$DS$82,$D58,4)),IF($G$14=\"LIQUOR PACKAGE\",INDEX(Data!$DT$33:$DW$82,$D58,4),IF($G$14=\"LIQUOR SIDE ORDER\",INDEX(Data!$DX$33:$EA$82,$D58,4),IF($G$14=\"MEAL\",INDEX(Data!$CR$33:$CU$82,$D58,4),IF($G$14=\"MEMBERSHIP\",INDEX(Data!$CV$33:$CY$82,$D58,4),IF($G$14=\"WINE\",INDEX(Data!$EB$33:$EE$82,$D58,4),\"\")))))))),\"\")","v":0},84]
[null,{"$f":"'Report A'!$B61","v":"2014-07-30"},{"$f":"'Report A'!$C61","v":"Wednesday"},{"$f":"'Report A'!$D61","v":30},{"$f":"IFERROR(IF($G$14=\"BEER EXCHANGE\",INDEX(Data!$DD$33:$DG$82,$D59,1),IF($G$14=\"BEER PACKAGE\",INDEX(Data!$CZ$33:$DC$82,$D59,1),IF($G$14=\"BEER SIDE ORDER\",(INDEX(Data!$DH$33:$DK$82,$D59,1)+INDEX(Data!$DL$33:$DO$82,$D59,1)+INDEX(Data!$DP$33:$DS$82,$D59,1)),IF($G$14=\"LIQUOR PACKAGE\",INDEX(Data!$DT$33:$DW$82,$D59,1),IF($G$14=\"LIQUOR SIDE ORDER\",INDEX(Data!$DX$33:$EA$82,$D59,1),IF($G$14=\"MEAL\",INDEX(Data!$CR$33:$CU$82,$D59,1),IF($G$14=\"MEMBERSHIP\",INDEX(Data!$CV$33:$CY$82,$D59,1),IF($G$14=\"WINE\",INDEX(Data!$EB$33:$EE$82,$D59,1),\"\")))))))),\"\")","v":0},{"$f":"IFERROR(IF($G$14=\"BEER EXCHANGE\",INDEX(Data!$DD$33:$DG$82,$D59,2),IF($G$14=\"BEER PACKAGE\",INDEX(Data!$CZ$33:$DC$82,$D59,2),IF($G$14=\"BEER SIDE ORDER\",(INDEX(Data!$DH$33:$DK$82,$D59,2)+INDEX(Data!$DL$33:$DO$82,$D59,2)+INDEX(Data!$DP$33:$DS$82,$D59,2)),IF($G$14=\"LIQUOR PACKAGE\",INDEX(Data!$DT$33:$DW$82,$D59,2),IF($G$14=\"LIQUOR SIDE ORDER\",INDEX(Data!$DX$33:$EA$82,$D59,2),IF($G$14=\"MEAL\",INDEX(Data!$CR$33:$CU$82,$D59,2),IF($G$14=\"MEMBERSHIP\",INDEX(Data!$CV$33:$CY$82,$D59,2),IF($G$14=\"WINE\",INDEX(Data!$EB$33:$EE$82,$D59,2),\"\")))))))),\"\")","v":0},{"$f":"IFERROR(IF($G$14=\"BEER EXCHANGE\",INDEX(Data!$DD$33:$DG$82,$D59,3),IF($G$14=\"BEER PACKAGE\",INDEX(Data!$CZ$33:$DC$82,$D59,3),IF($G$14=\"BEER SIDE ORDER\",(INDEX(Data!$DH$33:$DK$82,$D59,3)+INDEX(Data!$DL$33:$DO$82,$D59,3)+INDEX(Data!$DP$33:$DS$82,$D59,3)),IF($G$14=\"LIQUOR PACKAGE\",INDEX(Data!$DT$33:$DW$82,$D59,3),IF($G$14=\"LIQUOR SIDE ORDER\",INDEX(Data!$DX$33:$EA$82,$D59,3),IF($G$14=\"MEAL\",INDEX(Data!$CR$33:$CU$82,$D59,3),IF($G$14=\"MEMBERSHIP\",INDEX(Data!$CV$33:$CY$82,$D59,3),IF($G$14=\"WINE\",INDEX(Data!$EB$33:$EE$82,$D59,3),\"\")))))))),\"\")","v":102},{"$f":"IFERROR(IF($G$14=\"BEER EXCHANGE\",INDEX(Data!$DD$33:$DG$82,$D59,4),IF($G$14=\"BEER PACKAGE\",INDEX(Data!$CZ$33:$DC$82,$D59,4),IF($G$14=\"BEER SIDE ORDER\",(INDEX(Data!$DH$33:$DK$82,$D59,4)+INDEX(Data!$DL$33:$DO$82,$D59,4)+INDEX(Data!$DP$33:$DS$82,$D59,4)),IF($G$14=\"LIQUOR PACKAGE\",INDEX(Data!$DT$33:$DW$82,$D59,4),IF($G$14=\"LIQUOR SIDE ORDER\",INDEX(Data!$DX$33:$EA$82,$D59,4),IF($G$14=\"MEAL\",INDEX(Data!$CR$33:$CU$82,$D59,4),IF($G$14=\"MEMBERSHIP\",INDEX(Data!$CV$33:$CY$82,$D59,4),IF($G$14=\"WINE\",INDEX(Data!$EB$33:$EE$82,$D59,4),\"\")))))))),\"\")","v":0},102]
[null,{"$f":"'Report A'!$B62","v":"2014-07-31"},{"$f":"'Report A'!$C62","v":"Thursday"},{"$f":"'Report A'!$D62","v":31},{"$f":"IFERROR(IF($G$14=\"BEER EXCHANGE\",INDEX(Data!$DD$33:$DG$82,$D60,1),IF($G$14=\"BEER PACKAGE\",INDEX(Data!$CZ$33:$DC$82,$D60,1),IF($G$14=\"BEER SIDE ORDER\",(INDEX(Data!$DH$33:$DK$82,$D60,1)+INDEX(Data!$DL$33:$DO$82,$D60,1)+INDEX(Data!$DP$33:$DS$82,$D60,1)),IF($G$14=\"LIQUOR PACKAGE\",INDEX(Data!$DT$33:$DW$82,$D60,1),IF($G$14=\"LIQUOR SIDE ORDER\",INDEX(Data!$DX$33:$EA$82,$D60,1),IF($G$14=\"MEAL\",INDEX(Data!$CR$33:$CU$82,$D60,1),IF($G$14=\"MEMBERSHIP\",INDEX(Data!$CV$33:$CY$82,$D60,1),IF($G$14=\"WINE\",INDEX(Data!$EB$33:$EE$82,$D60,1),\"\")))))))),\"\")","v":0},{"$f":"IFERROR(IF($G$14=\"BEER EXCHANGE\",INDEX(Data!$DD$33:$DG$82,$D60,2),IF($G$14=\"BEER PACKAGE\",INDEX(Data!$CZ$33:$DC$82,$D60,2),IF($G$14=\"BEER SIDE ORDER\",(INDEX(Data!$DH$33:$DK$82,$D60,2)+INDEX(Data!$DL$33:$DO$82,$D60,2)+INDEX(Data!$DP$33:$DS$82,$D60,2)),IF($G$14=\"LIQUOR PACKAGE\",INDEX(Data!$DT$33:$DW$82,$D60,2),IF($G$14=\"LIQUOR SIDE ORDER\",INDEX(Data!$DX$33:$EA$82,$D60,2),IF($G$14=\"MEAL\",INDEX(Data!$CR$33:$CU$82,$D60,2),IF($G$14=\"MEMBERSHIP\",INDEX(Data!$CV$33:$CY$82,$D60,2),IF($G$14=\"WINE\",INDEX(Data!$EB$33:$EE$82,$D60,2),\"\")))))))),\"\")","v":0},{"$f":"IFERROR(IF($G$14=\"BEER EXCHANGE\",INDEX(Data!$DD$33:$DG$82,$D60,3),IF($G$14=\"BEER PACKAGE\",INDEX(Data!$CZ$33:$DC$82,$D60,3),IF($G$14=\"BEER SIDE ORDER\",(INDEX(Data!$DH$33:$DK$82,$D60,3)+INDEX(Data!$DL$33:$DO$82,$D60,3)+INDEX(Data!$DP$33:$DS$82,$D60,3)),IF($G$14=\"LIQUOR PACKAGE\",INDEX(Data!$DT$33:$DW$82,$D60,3),IF($G$14=\"LIQUOR SIDE ORDER\",INDEX(Data!$DX$33:$EA$82,$D60,3),IF($G$14=\"MEAL\",INDEX(Data!$CR$33:$CU$82,$D60,3),IF($G$14=\"MEMBERSHIP\",INDEX(Data!$CV$33:$CY$82,$D60,3),IF($G$14=\"WINE\",INDEX(Data!$EB$33:$EE$82,$D60,3),\"\")))))))),\"\")","v":54},{"$f":"IFERROR(IF($G$14=\"BEER EXCHANGE\",INDEX(Data!$DD$33:$DG$82,$D60,4),IF($G$14=\"BEER PACKAGE\",INDEX(Data!$CZ$33:$DC$82,$D60,4),IF($G$14=\"BEER SIDE ORDER\",(INDEX(Data!$DH$33:$DK$82,$D60,4)+INDEX(Data!$DL$33:$DO$82,$D60,4)+INDEX(Data!$DP$33:$DS$82,$D60,4)),IF($G$14=\"LIQUOR PACKAGE\",INDEX(Data!$DT$33:$DW$82,$D60,4),IF($G$14=\"LIQUOR SIDE ORDER\",INDEX(Data!$DX$33:$EA$82,$D60,4),IF($G$14=\"MEAL\",INDEX(Data!$CR$33:$CU$82,$D60,4),IF($G$14=\"MEMBERSHIP\",INDEX(Data!$CV$33:$CY$82,$D60,4),IF($G$14=\"WINE\",INDEX(Data!$EB$33:$EE$82,$D60,4),\"\")))))))),\"\")","v":0},54]

{"sheet":"Report G","index":8,"n_rows":59,"n_cols":33,"rows_kept":59,"cut":false,"hidden":false,"merged":[]}
[]
[]
[null,null,"MONTHLY SERVICE REPORTING BY OUTLET"]
[]
[]
[null,"SUBJECT","REPORT G : CUSTOMER SATISFACTION FROM FEEDBACK"]
[]
[null,"OUTLET",{"$f":"Data!$C$8","v":"TSU"}]
[]
[null,"MONTH / YEAR",{"$f":"Data!$C$10","v":"July 2014"}]
[]
[null,"MENU"]
[]
[null,"DATE","DAY","ROW","RATINGS FROM FEEDBACK FORMS",null,null,null,null,null,null,null,null,null,null,null,"QUESTIONAIRE FROM FEEDBACK FORMS",null,null,null,null,null,null,"OTHER VALUABLE COMMENTS FROM CUSTOMERS",null,null,null,null,null,null,null,null,"CHART G1 : MONTHLY % RATING FROM FEEDBACK FORMS"]
[null,null,null,null,"CHOOSE AREA OF RATING",null,null,null,null,null,"F&B",null,null,null,null,null,"QUESTION 01",null,null,null,null,"QUESTION 02",null,null,null,null,null,null,null,null,null,null,"CHART G2 : MONTHLY % RESPONSE TO QUESTIONAIRE FROM FEEDBACK FORMS"]
[null,null,null,null,"TOTAL","EXCELLENT","GOOD","NORMAL","POOR","EXCELLENT","GOOD","NORMAL","POOR","TOTAL","YES","NO","YES","NO","TOTAL","YES","NO","YES","NO","TOTAL","J","L","LL","LLL","J","L","LL","LLL","CHART G3 : MONTHLY % ( UNSOLICITED ) COMMENTS FROM FEEDBACK FORMS"]
[null,null,null,null,"( rating )","( rating )","( rating )","( rating )","( rating )","( % )","( % )","( % )","( % )","( rating )","( rating )","( rating )","( % )","( % )","( rating )","( rating )","( rating )","( % )","( % )","( rating )","( rating )","( rating )","( rating )","( rating )","( % )","( % )","( % )","( % )"]
[null,"SUMMARY FOR MONTH"]
[null,"% RATING FOR MONTH",null,null,{"$f":"SUM(E$29:E$59)","v":0},{"$f":"SUM(F$29:F$59)","v":0},0,0,0,{"$f":"IFERROR($F19/$E19,\"\")","v":""},{"$f":"IFERROR($G19/$E19,\"\")","v":""},{"$f":"IFERROR($H19/$E19,\"\")","v":""},{"$f":"IFERROR($I19/$E19,\"\")","v":""},{"$f":"SUM(N$29:N$59)","v":0},{"$f":"SUM(O$29:O$59)","v":0},0,{"$f":"IFERROR($O19/$N19,\"\")","v":""},{"$f":"IFERROR($P19/$N19,\"\")","v":""},{"$f":"SUM(S$29:S$59)","v":0},{"$f":"SUM(T$29:T$59)","v":0},0,{"$f":"IFERROR($T19/$S19,\"\")","v":""},{"$f":"IFERROR($U19/$S19,\"\")","v":""},{"$f":"SUM(X$29:X$59)","v":0},{"$f":"SUM(Y$29:Y$59)","v":0},0,0,0,{"$f":"IFERROR($Y19/$X19,\"\")","v":""},{"$f":"IFERROR($Z19/$X19,\"\")","v":""},{"$f":"IFERROR($AA19/$X19,\"\")","v":""},{"$f":"IFERROR($AB19/$X19,\"\")","v":""},"CHART G1"]
[null,"HIGHEST % RATING",null,null,{"$f":"IFERROR(IF(LARGE(E$29:E$59,1)>0,LARGE(E$29:E$59,1),\"NIL\"),\"NIL\")","v":"NIL"},{"$f":"IFERROR(IF(LARGE(F$29:F$59,1)>0,LARGE(F$29:F$59,1),\"NIL\"),\"NIL\")","v":"NIL"},"NIL","NIL","NIL",{"$f":"IFERROR(IF(LARGE(J$29:J$59,1)>0,LARGE(J$29:J$59,1),\"NIL\"),\"NIL\")","v":"NIL"},"NIL","NIL","NIL",{"$f":"IFERROR(IF(LARGE(N$29:N$59,1)>0,LARGE(N$29:N$59,1),\"NIL\"),\"NIL\")","v":"NIL"},{"$f":"IFERROR(IF(LARGE(O$29:O$59,1)>0,LARGE(O$29:O$59,1),\"NIL\"),\"NIL\")","v":"NIL"},"NIL","NIL","NIL",{"$f":"IFERROR(IF(LARGE(S$29:S$59,1)>0,LARGE(S$29:S$59,1),\"NIL\"),\"NIL\")","v":"NIL"},{"$f":"IFERROR(IF(LARGE(T$29:T$59,1)>0,LARGE(T$29:T$59,1),\"NIL\"),\"NIL\")","v":"NIL"},"NIL","NIL","NIL",{"$f":"IFERROR(IF(LARGE(X$29:X$59,1)>0,LARGE(X$29:X$59,1),\"NIL\"),\"NIL\")","v":"NIL"},{"$f":"IFERROR(IF(LARGE(Y$29:Y$59,1)>0,LARGE(Y$29:Y$59,1),\"NIL\"),\"NIL\")","v":"NIL"},"NIL","NIL","NIL","NIL","NIL","NIL","NIL"]
[null,"LOWEST % RATING",null,null,{"$f":"IFERROR(IF(LARGE(E$29:E$59,COUNTIF(E$29:E$59,\">0\"))<>E$20,LARGE(E$29:E$59,COUNTIF(E$29:E$59,\">0\")),\"NIL\"),\"NIL\")","v":"NIL"},{"$f":"IFERROR(IF(LARGE(F$29:F$59,COUNTIF(F$29:F$59,\">0\"))<>F$20,LARGE(F$29:F$59,COUNTIF(F$29:F$59,\">0\")),\"NIL\"),\"NIL\")","v":"NIL"},"NIL","NIL","NIL","NIL","NIL","NIL","NIL","NIL","NIL","NIL","NIL","NIL","NIL","NIL","NIL","NIL","NIL","NIL","NIL","NIL","NIL","NIL","NIL","NIL","NIL","NIL"]
[null,"% RATING FOR","MONDAY",null,{"$f":"IFERROR(SUMIF($C$29:$C$59,\"Monday*\",E$29:E$59),\"\")","v":0},{"$f":"IFERROR(SUMIF($C$29:$C$59,\"Monday*\",F$29:F$59),\"\")","v":0},0,0,0,{"$f":"IFERROR($F22/$E22,\"\")","v":""},{"$f":"IFERROR($G22/$E22,\"\")","v":""},{"$f":"IFERROR($H22/$E22,\"\")","v":""},{"$f":"IFERROR($I22/$E22,\"\")","v":""},{"$f":"IFERROR(SUMIF($C$29:$C$59,\"Monday*\",N$29:N$59),\"\")","v":0},{"$f":"IFERROR(SUMIF($C$29:$C$59,\"Monday*\",O$29:O$59),\"\")","v":0},0,{"$f":"IFERROR(SUMIF($C$29:$C$59,\"Monday*\",Q$29:Q$59)/COUNTIF($C$29:$C$59,\"Monday*\"),\"\")","v":0},{"$f":"IFERROR(SUMIF($C$29:$C$59,\"Monday*\",R$29:R$59)/COUNTIF($C$29:$C$59,\"Monday*\"),\"\")","v":0},{"$f":"IFERROR(SUMIF($C$29:$C$59,\"Monday*\",S$29:S$59),\"\")","v":0},{"$f":"IFERROR(SUMIF($C$29:$C$59,\"Monday*\",T$29:T$59),\"\")","v":0},0,{"$f":"IFERROR(SUMIF($C$29:$C$59,\"Monday*\",V$29:V$59)/COUNTIF($C$29:$C$59,\"Monday*\"),\"\")","v":0},{"$f":"IFERROR(SUMIF($C$29:$C$59,\"Monday*\",W$29:W$59)/COUNTIF($C$29:$C$59,\"Monday*\"),\"\")","v":0},{"$f":"IFERROR(SUMIF($C$29:$C$59,\"Monday*\",X$29:X$59),\"\")","v":0},{"$f":"IFERROR(SUMIF($C$29:$C$59,\"Monday*\",Y$29:Y$59),\"\")","v":0},0,0,0,{"$f":"IFERROR(SUMIF($C$29:$C$59,\"Monday*\",AC$29:AC$59)/COUNTIF($C$29:$C$59,\"Monday*\"),\"\")","v":0},{"$f":"IFERROR(SUMIF($C$29:$C$59,\"Monday*\",AD$29:AD$59)/COUNTIF($C$29:$C$59,\"Monday*\"),\"\")","v":0},{"$f":"IFERROR(SUMIF($C$29:$C$59,\"Monday*\",AE$29:AE$59)/COUNTIF($C$29:$C$59,\"Monday*\"),\"\")","v":0},{"$f":"IFERROR(SUMIF($C$29:$C$59,\"Monday*\",AF$29:AF$59)/COUNTIF($C$29:$C$59,\"Monday*\"),\"\")","v":0}]
[null,null,"TUESDAY",null,{"$f":"IFERROR(SUMIF($C$29:$C$59,\"Tuesday*\",E$29:E$59),\"\")","v":0},{"$f":"IFERROR(SUMIF($C$29:$C$59,\"Tuesday*\",F$29:F$59),\"\")","v":0},0,0,0,{"$f":"IFERROR($F23/$E23,\"\")","v":""},{"$f":"IFERROR($G23/$E23,\"\")","v":""},{"$f":"IFERROR($H23/$E23,\"\")","v":""},{"$f":"IFERROR($I23/$E23,\"\")","v":""},{"$f":"IFERROR(SUMIF($C$29:$C$59,\"Tuesday*\",N$29:N$59),\"\")","v":0},{"$f":"IFERROR(SUMIF($C$29:$C$59,\"Tuesday*\",O$29:O$59),\"\")","v":0},0,{"$f":"IFERROR(SUMIF($C$29:$C$59,\"Tuesday*\",Q$29:Q$59)/COUNTIF($C$29:$C$59,\"Tuesday*\"),\"\")","v":0},{"$f":"IFERROR(SUMIF($C$29:$C$59,\"Tuesday*\",R$29:R$59)/COUNTIF($C$29:$C$59,\"Tuesday*\"),\"\")","v":0},{"$f":"IFERROR(SUMIF($C$29:$C$59,\"Tuesday*\",S$29:S$59),\"\")","v":0},{"$f":"IFERROR(SUMIF($C$29:$C$59,\"Tuesday*\",T$29:T$59),\"\")","v":0},0,{"$f":"IFERROR(SUMIF($C$29:$C$59,\"Tuesday*\",V$29:V$59)/COUNTIF($C$29:$C$59,\"Tuesday*\"),\"\")","v":0},{"$f":"IFERROR(SUMIF($C$29:$C$59,\"Tuesday*\",W$29:W$59)/COUNTIF($C$29:$C$59,\"Tuesday*\"),\"\")","v":0},{"$f":"IFERROR(SUMIF($C$29:$C$59,\"Tuesday*\",X$29:X$59),\"\")","v":0},{"$f":"IFERROR(SUMIF($C$29:$C$59,\"Tuesday*\",Y$29:Y$59),\"\")","v":0},0,0,0,{"$f":"IFERROR(SUMIF($C$29:$C$59,\"Tuesday*\",AC$29:AC$59)/COUNTIF($C$29:$C$59,\"Tuesday*\"),\"\")","v":0},{"$f":"IFERROR(SUMIF($C$29:$C$59,\"Tuesday*\",AD$29:AD$59)/COUNTIF($C$29:$C$59,\"Tuesday*\"),\"\")","v":0},{"$f":"IFERROR(SUMIF($C$29:$C$59,\"Tuesday*\",AE$29:AE$59)/COUNTIF($C$29:$C$59,\"Tuesday*\"),\"\")","v":0},{"$f":"IFERROR(SUMIF($C$29:$C$59,\"Tuesday*\",AF$29:AF$59)/COUNTIF($C$29:$C$59,\"Tuesday*\"),\"\")","v":0}]
[null,null,"WEDNESDAY",null,{"$f":"IFERROR(SUMIF($C$29:$C$59,\"Wednesday*\",E$29:E$59),\"\")","v":0},{"$f":"IFERROR(SUMIF($C$29:$C$59,\"Wednesday*\",F$29:F$59),\"\")","v":0},0,0,0,"","","","",{"$f":"IFERROR(SUMIF($C$29:$C$59,\"Wednesday*\",N$29:N$59),\"\")","v":0},{"$f":"IFERROR(SUMIF($C$29:$C$59,\"Wednesday*\",O$29:O$59),\"\")","v":0},0,{"$f":"IFERROR(SUMIF($C$29:$C$59,\"Wednesday*\",Q$29:Q$59)/COUNTIF($C$29:$C$59,\"Wednesday*\"),\"\")","v":0},{"$f":"IFERROR(SUMIF($C$29:$C$59,\"Wednesday*\",R$29:R$59)/COUNTIF($C$29:$C$59,\"Wednesday*\"),\"\")","v":0},{"$f":"IFERROR(SUMIF($C$29:$C$59,\"Wednesday*\",S$29:S$59),\"\")","v":0},{"$f":"IFERROR(SUMIF($C$29:$C$59,\"Wednesday*\",T$29:T$59),\"\")","v":0},0,{"$f":"IFERROR(SUMIF($C$29:$C$59,\"Wednesday*\",V$29:V$59)/COUNTIF($C$29:$C$59,\"Wednesday*\"),\"\")","v":0},{"$f":"IFERROR(SUMIF($C$29:$C$59,\"Wednesday*\",W$29:W$59)/COUNTIF($C$29:$C$59,\"Wednesday*\"),\"\")","v":0},{"$f":"IFERROR(SUMIF($C$29:$C$59,\"Wednesday*\",X$29:X$59),\"\")","v":0},{"$f":"IFERROR(SUMIF($C$29:$C$59,\"Wednesday*\",Y$29:Y$59),\"\")","v":0},0,0,0,{"$f":"IFERROR(SUMIF($C$29:$C$59,\"Wednesday*\",AC$29:AC$59)/COUNTIF($C$29:$C$59,\"Wednesday*\"),\"\")","v":0},{"$f":"IFERROR(SUMIF($C$29:$C$59,\"Wednesday*\",AD$29:AD$59)/COUNTIF($C$29:$C$59,\"Wednesday*\"),\"\")","v":0},{"$f":"IFERROR(SUMIF($C$29:$C$59,\"Wednesday*\",AE$29:AE$59)/COUNTIF($C$29:$C$59,\"Wednesday*\"),\"\")","v":0},{"$f":"IFERROR(SUMIF($C$29:$C$59,\"Wednesday*\",AF$29:AF$59)/COUNTIF($C$29:$C$59,\"Wednesday*\"),\"\")","v":0}]
[null,null,"THURSDAY",null,{"$f":"IFERROR(SUMIF($C$29:$C$59,\"Thursday*\",E$29:E$59),\"\")","v":0},{"$f":"IFERROR(SUMIF($C$29:$C$59,\"Thursday*\",F$29:F$59),\"\")","v":0},0,0,0,"","","","",{"$f":"IFERROR(SUMIF($C$29:$C$59,\"Thursday*\",N$29:N$59),\"\")","v":0},{"$f":"IFERROR(SUMIF($C$29:$C$59,\"Thursday*\",O$29:O$59),\"\")","v":0},0,{"$f":"IFERROR(SUMIF($C$29:$C$59,\"Thursday*\",Q$29:Q$59)/COUNTIF($C$29:$C$59,\"Thursday*\"),\"\")","v":0},{"$f":"IFERROR(SUMIF($C$29:$C$59,\"Thursday*\",R$29:R$59)/COUNTIF($C$29:$C$59,\"Thursday*\"),\"\")","v":0},{"$f":"IFERROR(SUMIF($C$29:$C$59,\"Thursday*\",S$29:S$59),\"\")","v":0},{"$f":"IFERROR(SUMIF($C$29:$C$59,\"Thursday*\",T$29:T$59),\"\")","v":0},0,{"$f":"IFERROR(SUMIF($C$29:$C$59,\"Thursday*\",V$29:V$59)/COUNTIF($C$29:$C$59,\"Thursday*\"),\"\")","v":0},{"$f":"IFERROR(SUMIF($C$29:$C$59,\"Thursday*\",W$29:W$59)/COUNTIF($C$29:$C$59,\"Thursday*\"),\"\")","v":0},{"$f":"IFERROR(SUMIF($C$29:$C$59,\"Thursday*\",X$29:X$59),\"\")","v":0},{"$f":"IFERROR(SUMIF($C$29:$C$59,\"Thursday*\",Y$29:Y$59),\"\")","v":0},0,0,0,{"$f":"IFERROR(SUMIF($C$29:$C$59,\"Thursday*\",AC$29:AC$59)/COUNTIF($C$29:$C$59,\"Thursday*\"),\"\")","v":0},{"$f":"IFERROR(SUMIF($C$29:$C$59,\"Thursday*\",AD$29:AD$59)/COUNTIF($C$29:$C$59,\"Thursday*\"),\"\")","v":0},{"$f":"IFERROR(SUMIF($C$29:$C$59,\"Thursday*\",AE$29:AE$59)/COUNTIF($C$29:$C$59,\"Thursday*\"),\"\")","v":0},{"$f":"IFERROR(SUMIF($C$29:$C$59,\"Thursday*\",AF$29:AF$59)/COUNTIF($C$29:$C$59,\"Thursday*\"),\"\")","v":0}]
[null,null,"FRIDAY",null,{"$f":"IFERROR(SUMIF($C$29:$C$59,\"Friday*\",E$29:E$59),\"\")","v":0},{"$f":"IFERROR(SUMIF($C$29:$C$59,\"Friday*\",F$29:F$59),\"\")","v":0},0,0,0,"","","","",{"$f":"IFERROR(SUMIF($C$29:$C$59,\"Friday*\",N$29:N$59),\"\")","v":0},{"$f":"IFERROR(SUMIF($C$29:$C$59,\"Friday*\",O$29:O$59),\"\")","v":0},0,{"$f":"IFERROR(SUMIF($C$29:$C$59,\"Friday*\",Q$29:Q$59)/COUNTIF($C$29:$C$59,\"Friday*\"),\"\")","v":0},{"$f":"IFERROR(SUMIF($C$29:$C$59,\"Friday*\",R$29:R$59)/COUNTIF($C$29:$C$59,\"Friday*\"),\"\")","v":0},{"$f":"IFERROR(SUMIF($C$29:$C$59,\"Friday*\",S$29:S$59),\"\")","v":0},{"$f":"IFERROR(SUMIF($C$29:$C$59,\"Friday*\",T$29:T$59),\"\")","v":0},0,{"$f":"IFERROR(SUMIF($C$29:$C$59,\"Friday*\",V$29:V$59)/COUNTIF($C$29:$C$59,\"Friday*\"),\"\")","v":0},{"$f":"IFERROR(SUMIF($C$29:$C$59,\"Friday*\",W$29:W$59)/COUNTIF($C$29:$C$59,\"Friday*\"),\"\")","v":0},{"$f":"IFERROR(SUMIF($C$29:$C$59,\"Friday*\",X$29:X$59),\"\")","v":0},{"$f":"IFERROR(SUMIF($C$29:$C$59,\"Friday*\",Y$29:Y$59),\"\")","v":0},0,0,0,{"$f":"IFERROR(SUMIF($C$29:$C$59,\"Friday*\",AC$29:AC$59)/COUNTIF($C$29:$C$59,\"Friday*\"),\"\")","v":0},{"$f":"IFERROR(SUMIF($C$29:$C$59,\"Friday*\",AD$29:AD$59)/COUNTIF($C$29:$C$59,\"Friday*\"),\"\")","v":0},{"$f":"IFERROR(SUMIF($C$29:$C$59,\"Friday*\",AE$29:AE$59)/COUNTIF($C$29:$C$59,\"Friday*\"),\"\")","v":0},{"$f":"IFERROR(SUMIF($C$29:$C$59,\"Friday*\",AF$29:AF$59)/COUNTIF($C$29:$C$59,\"Friday*\"),\"\")","v":0}]
[null,null,"SATURDAY",null,{"$f":"IFERROR(SUMIF($C$29:$C$59,\"Saturday*\",E$29:E$59),\"\")","v":0},{"$f":"IFERROR(SUMIF($C$29:$C$59,\"Saturday*\",F$29:F$59),\"\")","v":0},0,0,0,"","","","",{"$f":"IFERROR(SUMIF($C$29:$C$59,\"Saturday*\",N$29:N$59),\"\")","v":0},{"$f":"IFERROR(SUMIF($C$29:$C$59,\"Saturday*\",O$29:O$59),\"\")","v":0},0,{"$f":"IFERROR(SUMIF($C$29:$C$59,\"Saturday*\",Q$29:Q$59)/COUNTIF($C$29:$C$59,\"Saturday*\"),\"\")","v":0},{"$f":"IFERROR(SUMIF($C$29:$C$59,\"Saturday*\",R$29:R$59)/COUNTIF($C$29:$C$59,\"Saturday*\"),\"\")","v":0},{"$f":"IFERROR(SUMIF($C$29:$C$59,\"Saturday*\",S$29:S$59),\"\")","v":0},{"$f":"IFERROR(SUMIF($C$29:$C$59,\"Saturday*\",T$29:T$59),\"\")","v":0},0,{"$f":"IFERROR(SUMIF($C$29:$C$59,\"Saturday*\",V$29:V$59)/COUNTIF($C$29:$C$59,\"Saturday*\"),\"\")","v":0},{"$f":"IFERROR(SUMIF($C$29:$C$59,\"Saturday*\",W$29:W$59)/COUNTIF($C$29:$C$59,\"Saturday*\"),\"\")","v":0},{"$f":"IFERROR(SUMIF($C$29:$C$59,\"Saturday*\",X$29:X$59),\"\")","v":0},{"$f":"IFERROR(SUMIF($C$29:$C$59,\"Saturday*\",Y$29:Y$59),\"\")","v":0},0,0,0,{"$f":"IFERROR(SUMIF($C$29:$C$59,\"Saturday*\",AC$29:AC$59)/COUNTIF($C$29:$C$59,\"Saturday*\"),\"\")","v":0},{"$f":"IFERROR(SUMIF($C$29:$C$59,\"Saturday*\",AD$29:AD$59)/COUNTIF($C$29:$C$59,\"Saturday*\"),\"\")","v":0},{"$f":"IFERROR(SUMIF($C$29:$C$59,\"Saturday*\",AE$29:AE$59)/COUNTIF($C$29:$C$59,\"Saturday*\"),\"\")","v":0},{"$f":"IFERROR(SUMIF($C$29:$C$59,\"Saturday*\",AF$29:AF$59)/COUNTIF($C$29:$C$59,\"Saturday*\"),\"\")","v":0}]
[null,null,"SUNDAY",null,{"$f":"IFERROR(SUMIF($C$29:$C$59,\"Sunday*\",E$29:E$59),\"\")","v":0},{"$f":"IFERROR(SUMIF($C$29:$C$59,\"Sunday*\",F$29:F$59),\"\")","v":0},0,0,0,"","","","",{"$f":"IFERROR(SUMIF($C$29:$C$59,\"Sunday*\",N$29:N$59),\"\")","v":0},{"$f":"IFERROR(SUMIF($C$29:$C$59,\"Sunday*\",O$29:O$59),\"\")","v":0},0,{"$f":"IFERROR(SUMIF($C$29:$C$59,\"Sunday*\",Q$29:Q$59)/COUNTIF($C$29:$C$59,\"Sunday*\"),\"\")","v":0},{"$f":"IFERROR(SUMIF($C$29:$C$59,\"Sunday*\",R$29:R$59)/COUNTIF($C$29:$C$59,\"Sunday*\"),\"\")","v":0},{"$f":"IFERROR(SUMIF($C$29:$C$59,\"Sunday*\",S$29:S$59),\"\")","v":0},{"$f":"IFERROR(SUMIF($C$29:$C$59,\"Sunday*\",T$29:T$59),\"\")","v":0},0,{"$f":"IFERROR(SUMIF($C$29:$C$59,\"Sunday*\",V$29:V$59)/COUNTIF($C$29:$C$59,\"Sunday*\"),\"\")","v":0},{"$f":"IFERROR(SUMIF($C$29:$C$59,\"Sunday*\",W$29:W$59)/COUNTIF($C$29:$C$59,\"Sunday*\"),\"\")","v":0},{"$f":"IFERROR(SUMIF($C$29:$C$59,\"Sunday*\",X$29:X$59),\"\")","v":0},{"$f":"IFERROR(SUMIF($C$29:$C$59,\"Sunday*\",Y$29:Y$59),\"\")","v":0},0,0,0,{"$f":"IFERROR(SUMIF($C$29:$C$59,\"Sunday*\",AC$29:AC$59)/COUNTIF($C$29:$C$59,\"Sunday*\"),\"\")","v":0},{"$f":"IFERROR(SUMIF($C$29:$C$59,\"Sunday*\",AD$29:AD$59)/COUNTIF($C$29:$C$59,\"Sunday*\"),\"\")","v":0},{"$f":"IFERROR(SUMIF($C$29:$C$59,\"Sunday*\",AE$29:AE$59)/COUNTIF($C$29:$C$59,\"Sunday*\"),\"\")","v":0},{"$f":"IFERROR(SUMIF($C$29:$C$59,\"Sunday*\",AF$29:AF$59)/COUNTIF($C$29:$C$59,\"Sunday*\"),\"\")","v":0}]
[null,{"$f":"'Report A'!$B32","v":"2014-07-01"},{"$f":"'Report A'!$C32","v":"Tuesday"},{"$f":"'Report A'!$D32","v":1},{"$f":"IFERROR(SUM($F29:$I29),\"\")","v":0},{"$f":"IFERROR(IF($K$15=Data!$J$14,INDEX(Data!$EF$33:$EI$82,$D29,1),IF($K$15=Data!$J$15,INDEX(Data!$EJ$33:$EM$82,$D29,1),IF($K$15=Data!$J$16,INDEX(Data!$EN$33:$EQ$82,$D29,1),IF($K$15=Data!$J$17,INDEX(Data!$ER$33:$EU$82,$D29,1),\"\")))),\"\")","v":0},{"$f":"IFERROR(IF($K$15=Data!$J$14,INDEX(Data!$EF$33:$EI$82,$D29,2),IF($K$15=Data!$J$15,INDEX(Data!$EJ$33:$EM$82,$D29,2),IF($K$15=Data!$J$16,INDEX(Data!$EN$33:$EQ$82,$D29,2),IF($K$15=Data!$J$17,INDEX(Data!$ER$33:$EU$82,$D29,2),\"\")))),\"\")","v":0},{"$f":"IFERROR(IF($K$15=Data!$J$14,INDEX(Data!$EF$33:$EI$82,$D29,3),IF($K$15=Data!$J$15,INDEX(Data!$EJ$33:$EM$82,$D29,3),IF($K$15=Data!$J$16,INDEX(Data!$EN$33:$EQ$82,$D29,3),IF($K$15=Data!$J$17,INDEX(Data!$ER$33:$EU$82,$D29,3),\"\")))),\"\")","v":0},{"$f":"IFERROR(IF($K$15=Data!$J$14,INDEX(Data!$EF$33:$EI$82,$D29,4),IF($K$15=Data!$J$15,INDEX(Data!$EJ$33:$EM$82,$D29,4),IF($K$15=Data!$J$16,INDEX(Data!$EN$33:$EQ$82,$D29,4),IF($K$15=Data!$J$17,INDEX(Data!$ER$33:$EU$82,$D29,4),\"\")))),\"\")","v":0},{"$f":"IFERROR($F29/$E29,\"\")","v":""},{"$f":"IFERROR($G29/$E29,\"\")","v":""},{"$f":"IFERROR($H29/$E29,\"\")","v":""},{"$f":"IFERROR($I29/$E29,\"\")","v":""},{"$f":"IFERROR(SUM($O29:$P29),\"\")","v":0},{"$f":"IFERROR(INDIRECT(\"Data!$EV$\"&$D29+32),\"\")","v":0},{"$f":"IFERROR(INDIRECT(\"Data!$EW$\"&$D29+32),\"\")","v":0},{"$f":"IFERROR($O29/$N29,\"\")","v":""},{"$f":"IFERROR($P29/$N29,\"\")","v":""},{"$f":"IFERROR(SUM($T29:$U29),\"\")","v":0},{"$f":"IFERROR(INDIRECT(\"Data!$EX$\"&$D29+32),\"\")","v":0},{"$f":"IFERROR(INDIRECT(\"Data!$EY$\"&$D29+32),\"\")","v":0},{"$f":"IFERROR($T29/$S29,\"\")","v":""},{"$f":"IFERROR($U29/$S29,\"\")","v":""},{"$f":"IFERROR(SUM($Y29:$AB29),\"\")","v":0},{"$f":"IFERROR(INDIRECT(\"Data!$EZ$\"&$D29+32),\"\")","v":0},{"$f":"IFERROR(INDIRECT(\"Data!$FA$\"&$D29+32),\"\")","v":0},{"$f":"IFERROR(INDIRECT(\"Data!$FB$\"&$D29+32),\"\")","v":0},{"$f":"IFERROR(INDIRECT(\"Data!$FC$\"&$D29+32),\"\")","v":0},{"$f":"IFERROR($Y29/$X29,\"\")","v":""},{"$f":"IFERROR($Z29/$X29,\"\")","v":""},{"$f":"IFERROR($AA29/$X29,\"\")","v":""},{"$f":"IFERROR($AB29/$X29,\"\")","v":""}]
[null,{"$f":"'Report A'!$B33","v":"2014-07-02"},{"$f":"'Report A'!$C33","v":"Wednesday"},{"$f":"'Report A'!$D33","v":2},{"$f":"IFERROR(SUM($F30:$I30),\"\")","v":0},{"$f":"IFERROR(IF($K$15=Data!$J$14,INDEX(Data!$EF$33:$EI$82,$D30,1),IF($K$15=Data!$J$15,INDEX(Data!$EJ$33:$EM$82,$D30,1),IF($K$15=Data!$J$16,INDEX(Data!$EN$33:$EQ$82,$D30,1),IF($K$15=Data!$J$17,INDEX(Data!$ER$33:$EU$82,$D30,1),\"\")))),\"\")","v":0},{"$f":"IFERROR(IF($K$15=Data!$J$14,INDEX(Data!$EF$33:$EI$82,$D30,2),IF($K$15=Data!$J$15,INDEX(Data!$EJ$33:$EM$82,$D30,2),IF($K$15=Data!$J$16,INDEX(Data!$EN$33:$EQ$82,$D30,2),IF($K$15=Data!$J$17,INDEX(Data!$ER$33:$EU$82,$D30,2),\"\")))),\"\")","v":0},{"$f":"IFERROR(IF($K$15=Data!$J$14,INDEX(Data!$EF$33:$EI$82,$D30,3),IF($K$15=Data!$J$15,INDEX(Data!$EJ$33:$EM$82,$D30,3),IF($K$15=Data!$J$16,INDEX(Data!$EN$33:$EQ$82,$D30,3),IF($K$15=Data!$J$17,INDEX(Data!$ER$33:$EU$82,$D30,3),\"\")))),\"\")","v":0},{"$f":"IFERROR(IF($K$15=Data!$J$14,INDEX(Data!$EF$33:$EI$82,$D30,4),IF($K$15=Data!$J$15,INDEX(Data!$EJ$33:$EM$82,$D30,4),IF($K$15=Data!$J$16,INDEX(Data!$EN$33:$EQ$82,$D30,4),IF($K$15=Data!$J$17,INDEX(Data!$ER$33:$EU$82,$D30,4),\"\")))),\"\")","v":0},{"$f":"IFERROR($F30/$E30,\"\")","v":""},{"$f":"IFERROR($G30/$E30,\"\")","v":""},{"$f":"IFERROR($H30/$E30,\"\")","v":""},{"$f":"IFERROR($I30/$E30,\"\")","v":""},{"$f":"IFERROR(SUM($O30:$P30),\"\")","v":0},{"$f":"IFERROR(INDIRECT(\"Data!$EV$\"&$D30+32),\"\")","v":0},{"$f":"IFERROR(INDIRECT(\"Data!$EW$\"&$D30+32),\"\")","v":0},{"$f":"IFERROR($O30/$N30,\"\")","v":""},{"$f":"IFERROR($P30/$N30,\"\")","v":""},{"$f":"IFERROR(SUM($T30:$U30),\"\")","v":0},{"$f":"IFERROR(INDIRECT(\"Data!$EX$\"&$D30+32),\"\")","v":0},{"$f":"IFERROR(INDIRECT(\"Data!$EY$\"&$D30+32),\"\")","v":0},{"$f":"IFERROR($T30/$S30,\"\")","v":""},{"$f":"IFERROR($U30/$S30,\"\")","v":""},{"$f":"IFERROR(SUM($Y30:$AB30),\"\")","v":0},{"$f":"IFERROR(INDIRECT(\"Data!$EZ$\"&$D30+32),\"\")","v":0},{"$f":"IFERROR(INDIRECT(\"Data!$FA$\"&$D30+32),\"\")","v":0},{"$f":"IFERROR(INDIRECT(\"Data!$FB$\"&$D30+32),\"\")","v":0},{"$f":"IFERROR(INDIRECT(\"Data!$FC$\"&$D30+32),\"\")","v":0},{"$f":"IFERROR($Y30/$X30,\"\")","v":""},{"$f":"IFERROR($Z30/$X30,\"\")","v":""},{"$f":"IFERROR($AA30/$X30,\"\")","v":""},{"$f":"IFERROR($AB30/$X30,\"\")","v":""}]
[null,{"$f":"'Report A'!$B34","v":"2014-07-03"},{"$f":"'Report A'!$C34","v":"Thursday"},{"$f":"'Report A'!$D34","v":3},0,{"$f":"IFERROR(IF($K$15=Data!$J$14,INDEX(Data!$EF$33:$EI$82,$D31,1),IF($K$15=Data!$J$15,INDEX(Data!$EJ$33:$EM$82,$D31,1),IF($K$15=Data!$J$16,INDEX(Data!$EN$33:$EQ$82,$D31,1),IF($K$15=Data!$J$17,INDEX(Data!$ER$33:$EU$82,$D31,1),\"\")))),\"\")","v":0},{"$f":"IFERROR(IF($K$15=Data!$J$14,INDEX(Data!$EF$33:$EI$82,$D31,2),IF($K$15=Data!$J$15,INDEX(Data!$EJ$33:$EM$82,$D31,2),IF($K$15=Data!$J$16,INDEX(Data!$EN$33:$EQ$82,$D31,2),IF($K$15=Data!$J$17,INDEX(Data!$ER$33:$EU$82,$D31,2),\"\")))),\"\")","v":0},{"$f":"IFERROR(IF($K$15=Data!$J$14,INDEX(Data!$EF$33:$EI$82,$D31,3),IF($K$15=Data!$J$15,INDEX(Data!$EJ$33:$EM$82,$D31,3),IF($K$15=Data!$J$16,INDEX(Data!$EN$33:$EQ$82,$D31,3),IF($K$15=Data!$J$17,INDEX(Data!$ER$33:$EU$82,$D31,3),\"\")))),\"\")","v":0},{"$f":"IFERROR(IF($K$15=Data!$J$14,INDEX(Data!$EF$33:$EI$82,$D31,4),IF($K$15=Data!$J$15,INDEX(Data!$EJ$33:$EM$82,$D31,4),IF($K$15=Data!$J$16,INDEX(Data!$EN$33:$EQ$82,$D31,4),IF($K$15=Data!$J$17,INDEX(Data!$ER$33:$EU$82,$D31,4),\"\")))),\"\")","v":0},"","","","",0,0,0,"","",0,0,0,"","",0,0,0,0,0,"","","",""]
[null,{"$f":"'Report A'!$B35","v":"2014-07-04"},{"$f":"'Report A'!$C35","v":"Friday"},{"$f":"'Report A'!$D35","v":4},0,{"$f":"IFERROR(IF($K$15=Data!$J$14,INDEX(Data!$EF$33:$EI$82,$D32,1),IF($K$15=Data!$J$15,INDEX(Data!$EJ$33:$EM$82,$D32,1),IF($K$15=Data!$J$16,INDEX(Data!$EN$33:$EQ$82,$D32,1),IF($K$15=Data!$J$17,INDEX(Data!$ER$33:$EU$82,$D32,1),\"\")))),\"\")","v":0},{"$f":"IFERROR(IF($K$15=Data!$J$14,INDEX(Data!$EF$33:$EI$82,$D32,2),IF($K$15=Data!$J$15,INDEX(Data!$EJ$33:$EM$82,$D32,2),IF($K$15=Data!$J$16,INDEX(Data!$EN$33:$EQ$82,$D32,2),IF($K$15=Data!$J$17,INDEX(Data!$ER$33:$EU$82,$D32,2),\"\")))),\"\")","v":0},{"$f":"IFERROR(IF($K$15=Data!$J$14,INDEX(Data!$EF$33:$EI$82,$D32,3),IF($K$15=Data!$J$15,INDEX(Data!$EJ$33:$EM$82,$D32,3),IF($K$15=Data!$J$16,INDEX(Data!$EN$33:$EQ$82,$D32,3),IF($K$15=Data!$J$17,INDEX(Data!$ER$33:$EU$82,$D32,3),\"\")))),\"\")","v":0},{"$f":"IFERROR(IF($K$15=Data!$J$14,INDEX(Data!$EF$33:$EI$82,$D32,4),IF($K$15=Data!$J$15,INDEX(Data!$EJ$33:$EM$82,$D32,4),IF($K$15=Data!$J$16,INDEX(Data!$EN$33:$EQ$82,$D32,4),IF($K$15=Data!$J$17,INDEX(Data!$ER$33:$EU$82,$D32,4),\"\")))),\"\")","v":0},"","","","",0,0,0,"","",0,0,0,"","",0,0,0,0,0,"","","","","CHART G3"]
[null,{"$f":"'Report A'!$B36","v":"2014-07-05"},{"$f":"'Report A'!$C36","v":"Saturday"},{"$f":"'Report A'!$D36","v":5},0,{"$f":"IFERROR(IF($K$15=Data!$J$14,INDEX(Data!$EF$33:$EI$82,$D33,1),IF($K$15=Data!$J$15,INDEX(Data!$EJ$33:$EM$82,$D33,1),IF($K$15=Data!$J$16,INDEX(Data!$EN$33:$EQ$82,$D33,1),IF($K$15=Data!$J$17,INDEX(Data!$ER$33:$EU$82,$D33,1),\"\")))),\"\")","v":0},{"$f":"IFERROR(IF($K$15=Data!$J$14,INDEX(Data!$EF$33:$EI$82,$D33,2),IF($K$15=Data!$J$15,INDEX(Data!$EJ$33:$EM$82,$D33,2),IF($K$15=Data!$J$16,INDEX(Data!$EN$33:$EQ$82,$D33,2),IF($K$15=Data!$J$17,INDEX(Data!$ER$33:$EU$82,$D33,2),\"\")))),\"\")","v":0},{"$f":"IFERROR(IF($K$15=Data!$J$14,INDEX(Data!$EF$33:$EI$82,$D33,3),IF($K$15=Data!$J$15,INDEX(Data!$EJ$33:$EM$82,$D33,3),IF($K$15=Data!$J$16,INDEX(Data!$EN$33:$EQ$82,$D33,3),IF($K$15=Data!$J$17,INDEX(Data!$ER$33:$EU$82,$D33,3),\"\")))),\"\")","v":0},{"$f":"IFERROR(IF($K$15=Data!$J$14,INDEX(Data!$EF$33:$EI$82,$D33,4),IF($K$15=Data!$J$15,INDEX(Data!$EJ$33:$EM$82,$D33,4),IF($K$15=Data!$J$16,INDEX(Data!$EN$33:$EQ$82,$D33,4),IF($K$15=Data!$J$17,INDEX(Data!$ER$33:$EU$82,$D33,4),\"\")))),\"\")","v":0},"","","","",0,0,0,"","",0,0,0,"","",0,0,0,0,0,"","","",""]
[null,{"$f":"'Report A'!$B37","v":"2014-07-06"},{"$f":"'Report A'!$C37","v":"Sunday"},{"$f":"'Report A'!$D37","v":6},0,{"$f":"IFERROR(IF($K$15=Data!$J$14,INDEX(Data!$EF$33:$EI$82,$D34,1),IF($K$15=Data!$J$15,INDEX(Data!$EJ$33:$EM$82,$D34,1),IF($K$15=Data!$J$16,INDEX(Data!$EN$33:$EQ$82,$D34,1),IF($K$15=Data!$J$17,INDEX(Data!$ER$33:$EU$82,$D34,1),\"\")))),\"\")","v":0},{"$f":"IFERROR(IF($K$15=Data!$J$14,INDEX(Data!$EF$33:$EI$82,$D34,2),IF($K$15=Data!$J$15,INDEX(Data!$EJ$33:$EM$82,$D34,2),IF($K$15=Data!$J$16,INDEX(Data!$EN$33:$EQ$82,$D34,2),IF($K$15=Data!$J$17,INDEX(Data!$ER$33:$EU$82,$D34,2),\"\")))),\"\")","v":0},{"$f":"IFERROR(IF($K$15=Data!$J$14,INDEX(Data!$EF$33:$EI$82,$D34,3),IF($K$15=Data!$J$15,INDEX(Data!$EJ$33:$EM$82,$D34,3),IF($K$15=Data!$J$16,INDEX(Data!$EN$33:$EQ$82,$D34,3),IF($K$15=Data!$J$17,INDEX(Data!$ER$33:$EU$82,$D34,3),\"\")))),\"\")","v":0},{"$f":"IFERROR(IF($K$15=Data!$J$14,INDEX(Data!$EF$33:$EI$82,$D34,4),IF($K$15=Data!$J$15,INDEX(Data!$EJ$33:$EM$82,$D34,4),IF($K$15=Data!$J$16,INDEX(Data!$EN$33:$EQ$82,$D34,4),IF($K$15=Data!$J$17,INDEX(Data!$ER$33:$EU$82,$D34,4),\"\")))),\"\")","v":0},"","","","",0,0,0,"","",0,0,0,"","",0,0,0,0,0,"","","",""]
[null,{"$f":"'Report A'!$B38","v":"2014-07-07"},{"$f":"'Report A'!$C38","v":"Monday"},{"$f":"'Report A'!$D38","v":7},0,{"$f":"IFERROR(IF($K$15=Data!$J$14,INDEX(Data!$EF$33:$EI$82,$D35,1),IF($K$15=Data!$J$15,INDEX(Data!$EJ$33:$EM$82,$D35,1),IF($K$15=Data!$J$16,INDEX(Data!$EN$33:$EQ$82,$D35,1),IF($K$15=Data!$J$17,INDEX(Data!$ER$33:$EU$82,$D35,1),\"\")))),\"\")","v":0},{"$f":"IFERROR(IF($K$15=Data!$J$14,INDEX(Data!$EF$33:$EI$82,$D35,2),IF($K$15=Data!$J$15,INDEX(Data!$EJ$33:$EM$82,$D35,2),IF($K$15=Data!$J$16,INDEX(Data!$EN$33:$EQ$82,$D35,2),IF($K$15=Data!$J$17,INDEX(Data!$ER$33:$EU$82,$D35,2),\"\")))),\"\")","v":0},{"$f":"IFERROR(IF($K$15=Data!$J$14,INDEX(Data!$EF$33:$EI$82,$D35,3),IF($K$15=Data!$J$15,INDEX(Data!$EJ$33:$EM$82,$D35,3),IF($K$15=Data!$J$16,INDEX(Data!$EN$33:$EQ$82,$D35,3),IF($K$15=Data!$J$17,INDEX(Data!$ER$33:$EU$82,$D35,3),\"\")))),\"\")","v":0},{"$f":"IFERROR(IF($K$15=Data!$J$14,INDEX(Data!$EF$33:$EI$82,$D35,4),IF($K$15=Data!$J$15,INDEX(Data!$EJ$33:$EM$82,$D35,4),IF($K$15=Data!$J$16,INDEX(Data!$EN$33:$EQ$82,$D35,4),IF($K$15=Data!$J$17,INDEX(Data!$ER$33:$EU$82,$D35,4),\"\")))),\"\")","v":0},"","","","",0,0,0,"","",0,0,0,"","",0,0,0,0,0,"","","",""]
[null,{"$f":"'Report A'!$B39","v":"2014-07-08"},{"$f":"'Report A'!$C39","v":"Tuesday"},{"$f":"'Report A'!$D39","v":8},0,{"$f":"IFERROR(IF($K$15=Data!$J$14,INDEX(Data!$EF$33:$EI$82,$D36,1),IF($K$15=Data!$J$15,INDEX(Data!$EJ$33:$EM$82,$D36,1),IF($K$15=Data!$J$16,INDEX(Data!$EN$33:$EQ$82,$D36,1),IF($K$15=Data!$J$17,INDEX(Data!$ER$33:$EU$82,$D36,1),\"\")))),\"\")","v":0},{"$f":"IFERROR(IF($K$15=Data!$J$14,INDEX(Data!$EF$33:$EI$82,$D36,2),IF($K$15=Data!$J$15,INDEX(Data!$EJ$33:$EM$82,$D36,2),IF($K$15=Data!$J$16,INDEX(Data!$EN$33:$EQ$82,$D36,2),IF($K$15=Data!$J$17,INDEX(Data!$ER$33:$EU$82,$D36,2),\"\")))),\"\")","v":0},{"$f":"IFERROR(IF($K$15=Data!$J$14,INDEX(Data!$EF$33:$EI$82,$D36,3),IF($K$15=Data!$J$15,INDEX(Data!$EJ$33:$EM$82,$D36,3),IF($K$15=Data!$J$16,INDEX(Data!$EN$33:$EQ$82,$D36,3),IF($K$15=Data!$J$17,INDEX(Data!$ER$33:$EU$82,$D36,3),\"\")))),\"\")","v":0},{"$f":"IFERROR(IF($K$15=Data!$J$14,INDEX(Data!$EF$33:$EI$82,$D36,4),IF($K$15=Data!$J$15,INDEX(Data!$EJ$33:$EM$82,$D36,4),IF($K$15=Data!$J$16,INDEX(Data!$EN$33:$EQ$82,$D36,4),IF($K$15=Data!$J$17,INDEX(Data!$ER$33:$EU$82,$D36,4),\"\")))),\"\")","v":0},"","","","",0,0,0,"","",0,0,0,"","",0,0,0,0,0,"","","",""]
[null,{"$f":"'Report A'!$B40","v":"2014-07-09"},{"$f":"'Report A'!$C40","v":"Wednesday"},{"$f":"'Report A'!$D40","v":9},0,{"$f":"IFERROR(IF($K$15=Data!$J$14,INDEX(Data!$EF$33:$EI$82,$D37,1),IF($K$15=Data!$J$15,INDEX(Data!$EJ$33:$EM$82,$D37,1),IF($K$15=Data!$J$16,INDEX(Data!$EN$33:$EQ$82,$D37,1),IF($K$15=Data!$J$17,INDEX(Data!$ER$33:$EU$82,$D37,1),\"\")))),\"\")","v":0},{"$f":"IFERROR(IF($K$15=Data!$J$14,INDEX(Data!$EF$33:$EI$82,$D37,2),IF($K$15=Data!$J$15,INDEX(Data!$EJ$33:$EM$82,$D37,2),IF($K$15=Data!$J$16,INDEX(Data!$EN$33:$EQ$82,$D37,2),IF($K$15=Data!$J$17,INDEX(Data!$ER$33:$EU$82,$D37,2),\"\")))),\"\")","v":0},{"$f":"IFERROR(IF($K$15=Data!$J$14,INDEX(Data!$EF$33:$EI$82,$D37,3),IF($K$15=Data!$J$15,INDEX(Data!$EJ$33:$EM$82,$D37,3),IF($K$15=Data!$J$16,INDEX(Data!$EN$33:$EQ$82,$D37,3),IF($K$15=Data!$J$17,INDEX(Data!$ER$33:$EU$82,$D37,3),\"\")))),\"\")","v":0},{"$f":"IFERROR(IF($K$15=Data!$J$14,INDEX(Data!$EF$33:$EI$82,$D37,4),IF($K$15=Data!$J$15,INDEX(Data!$EJ$33:$EM$82,$D37,4),IF($K$15=Data!$J$16,INDEX(Data!$EN$33:$EQ$82,$D37,4),IF($K$15=Data!$J$17,INDEX(Data!$ER$33:$EU$82,$D37,4),\"\")))),\"\")","v":0},"","","","",0,0,0,"","",0,0,0,"","",0,0,0,0,0,"","","",""]
[null,{"$f":"'Report A'!$B41","v":"2014-07-10"},{"$f":"'Report A'!$C41","v":"Thursday"},{"$f":"'Report A'!$D41","v":10},0,{"$f":"IFERROR(IF($K$15=Data!$J$14,INDEX(Data!$EF$33:$EI$82,$D38,1),IF($K$15=Data!$J$15,INDEX(Data!$EJ$33:$EM$82,$D38,1),IF($K$15=Data!$J$16,INDEX(Data!$EN$33:$EQ$82,$D38,1),IF($K$15=Data!$J$17,INDEX(Data!$ER$33:$EU$82,$D38,1),\"\")))),\"\")","v":0},{"$f":"IFERROR(IF($K$15=Data!$J$14,INDEX(Data!$EF$33:$EI$82,$D38,2),IF($K$15=Data!$J$15,INDEX(Data!$EJ$33:$EM$82,$D38,2),IF($K$15=Data!$J$16,INDEX(Data!$EN$33:$EQ$82,$D38,2),IF($K$15=Data!$J$17,INDEX(Data!$ER$33:$EU$82,$D38,2),\"\")))),\"\")","v":0},{"$f":"IFERROR(IF($K$15=Data!$J$14,INDEX(Data!$EF$33:$EI$82,$D38,3),IF($K$15=Data!$J$15,INDEX(Data!$EJ$33:$EM$82,$D38,3),IF($K$15=Data!$J$16,INDEX(Data!$EN$33:$EQ$82,$D38,3),IF($K$15=Data!$J$17,INDEX(Data!$ER$33:$EU$82,$D38,3),\"\")))),\"\")","v":0},{"$f":"IFERROR(IF($K$15=Data!$J$14,INDEX(Data!$EF$33:$EI$82,$D38,4),IF($K$15=Data!$J$15,INDEX(Data!$EJ$33:$EM$82,$D38,4),IF($K$15=Data!$J$16,INDEX(Data!$EN$33:$EQ$82,$D38,4),IF($K$15=Data!$J$17,INDEX(Data!$ER$33:$EU$82,$D38,4),\"\")))),\"\")","v":0},"","","","",0,0,0,"","",0,0,0,"","",0,0,0,0,0,"","","",""]
[null,{"$f":"'Report A'!$B42","v":"2014-07-11"},{"$f":"'Report A'!$C42","v":"Friday"},{"$f":"'Report A'!$D42","v":11},0,{"$f":"IFERROR(IF($K$15=Data!$J$14,INDEX(Data!$EF$33:$EI$82,$D39,1),IF($K$15=Data!$J$15,INDEX(Data!$EJ$33:$EM$82,$D39,1),IF($K$15=Data!$J$16,INDEX(Data!$EN$33:$EQ$82,$D39,1),IF($K$15=Data!$J$17,INDEX(Data!$ER$33:$EU$82,$D39,1),\"\")))),\"\")","v":0},{"$f":"IFERROR(IF($K$15=Data!$J$14,INDEX(Data!$EF$33:$EI$82,$D39,2),IF($K$15=Data!$J$15,INDEX(Data!$EJ$33:$EM$82,$D39,2),IF($K$15=Data!$J$16,INDEX(Data!$EN$33:$EQ$82,$D39,2),IF($K$15=Data!$J$17,INDEX(Data!$ER$33:$EU$82,$D39,2),\"\")))),\"\")","v":0},{"$f":"IFERROR(IF($K$15=Data!$J$14,INDEX(Data!$EF$33:$EI$82,$D39,3),IF($K$15=Data!$J$15,INDEX(Data!$EJ$33:$EM$82,$D39,3),IF($K$15=Data!$J$16,INDEX(Data!$EN$33:$EQ$82,$D39,3),IF($K$15=Data!$J$17,INDEX(Data!$ER$33:$EU$82,$D39,3),\"\")))),\"\")","v":0},{"$f":"IFERROR(IF($K$15=Data!$J$14,INDEX(Data!$EF$33:$EI$82,$D39,4),IF($K$15=Data!$J$15,INDEX(Data!$EJ$33:$EM$82,$D39,4),IF($K$15=Data!$J$16,INDEX(Data!$EN$33:$EQ$82,$D39,4),IF($K$15=Data!$J$17,INDEX(Data!$ER$33:$EU$82,$D39,4),\"\")))),\"\")","v":0},"","","","",0,0,0,"","",0,0,0,"","",0,0,0,0,0,"","","",""]
[null,{"$f":"'Report A'!$B43","v":"2014-07-12"},{"$f":"'Report A'!$C43","v":"Saturday"},{"$f":"'Report A'!$D43","v":12},0,{"$f":"IFERROR(IF($K$15=Data!$J$14,INDEX(Data!$EF$33:$EI$82,$D40,1),IF($K$15=Data!$J$15,INDEX(Data!$EJ$33:$EM$82,$D40,1),IF($K$15=Data!$J$16,INDEX(Data!$EN$33:$EQ$82,$D40,1),IF($K$15=Data!$J$17,INDEX(Data!$ER$33:$EU$82,$D40,1),\"\")))),\"\")","v":0},{"$f":"IFERROR(IF($K$15=Data!$J$14,INDEX(Data!$EF$33:$EI$82,$D40,2),IF($K$15=Data!$J$15,INDEX(Data!$EJ$33:$EM$82,$D40,2),IF($K$15=Data!$J$16,INDEX(Data!$EN$33:$EQ$82,$D40,2),IF($K$15=Data!$J$17,INDEX(Data!$ER$33:$EU$82,$D40,2),\"\")))),\"\")","v":0},{"$f":"IFERROR(IF($K$15=Data!$J$14,INDEX(Data!$EF$33:$EI$82,$D40,3),IF($K$15=Data!$J$15,INDEX(Data!$EJ$33:$EM$82,$D40,3),IF($K$15=Data!$J$16,INDEX(Data!$EN$33:$EQ$82,$D40,3),IF($K$15=Data!$J$17,INDEX(Data!$ER$33:$EU$82,$D40,3),\"\")))),\"\")","v":0},{"$f":"IFERROR(IF($K$15=Data!$J$14,INDEX(Data!$EF$33:$EI$82,$D40,4),IF($K$15=Data!$J$15,INDEX(Data!$EJ$33:$EM$82,$D40,4),IF($K$15=Data!$J$16,INDEX(Data!$EN$33:$EQ$82,$D40,4),IF($K$15=Data!$J$17,INDEX(Data!$ER$33:$EU$82,$D40,4),\"\")))),\"\")","v":0},"","","","",0,0,0,"","",0,0,0,"","",0,0,0,0,0,"","","",""]
[null,{"$f":"'Report A'!$B44","v":"2014-07-13"},{"$f":"'Report A'!$C44","v":"Sunday"},{"$f":"'Report A'!$D44","v":13},0,{"$f":"IFERROR(IF($K$15=Data!$J$14,INDEX(Data!$EF$33:$EI$82,$D41,1),IF($K$15=Data!$J$15,INDEX(Data!$EJ$33:$EM$82,$D41,1),IF($K$15=Data!$J$16,INDEX(Data!$EN$33:$EQ$82,$D41,1),IF($K$15=Data!$J$17,INDEX(Data!$ER$33:$EU$82,$D41,1),\"\")))),\"\")","v":0},{"$f":"IFERROR(IF($K$15=Data!$J$14,INDEX(Data!$EF$33:$EI$82,$D41,2),IF($K$15=Data!$J$15,INDEX(Data!$EJ$33:$EM$82,$D41,2),IF($K$15=Data!$J$16,INDEX(Data!$EN$33:$EQ$82,$D41,2),IF($K$15=Data!$J$17,INDEX(Data!$ER$33:$EU$82,$D41,2),\"\")))),\"\")","v":0},{"$f":"IFERROR(IF($K$15=Data!$J$14,INDEX(Data!$EF$33:$EI$82,$D41,3),IF($K$15=Data!$J$15,INDEX(Data!$EJ$33:$EM$82,$D41,3),IF($K$15=Data!$J$16,INDEX(Data!$EN$33:$EQ$82,$D41,3),IF($K$15=Data!$J$17,INDEX(Data!$ER$33:$EU$82,$D41,3),\"\")))),\"\")","v":0},{"$f":"IFERROR(IF($K$15=Data!$J$14,INDEX(Data!$EF$33:$EI$82,$D41,4),IF($K$15=Data!$J$15,INDEX(Data!$EJ$33:$EM$82,$D41,4),IF($K$15=Data!$J$16,INDEX(Data!$EN$33:$EQ$82,$D41,4),IF($K$15=Data!$J$17,INDEX(Data!$ER$33:$EU$82,$D41,4),\"\")))),\"\")","v":0},"","","","",0,0,0,"","",0,0,0,"","",0,0,0,0,0,"","","",""]
[null,{"$f":"'Report A'!$B45","v":"2014-07-14"},{"$f":"'Report A'!$C45","v":"Monday"},{"$f":"'Report A'!$D45","v":14},0,{"$f":"IFERROR(IF($K$15=Data!$J$14,INDEX(Data!$EF$33:$EI$82,$D42,1),IF($K$15=Data!$J$15,INDEX(Data!$EJ$33:$EM$82,$D42,1),IF($K$15=Data!$J$16,INDEX(Data!$EN$33:$EQ$82,$D42,1),IF($K$15=Data!$J$17,INDEX(Data!$ER$33:$EU$82,$D42,1),\"\")))),\"\")","v":0},{"$f":"IFERROR(IF($K$15=Data!$J$14,INDEX(Data!$EF$33:$EI$82,$D42,2),IF($K$15=Data!$J$15,INDEX(Data!$EJ$33:$EM$82,$D42,2),IF($K$15=Data!$J$16,INDEX(Data!$EN$33:$EQ$82,$D42,2),IF($K$15=Data!$J$17,INDEX(Data!$ER$33:$EU$82,$D42,2),\"\")))),\"\")","v":0},{"$f":"IFERROR(IF($K$15=Data!$J$14,INDEX(Data!$EF$33:$EI$82,$D42,3),IF($K$15=Data!$J$15,INDEX(Data!$EJ$33:$EM$82,$D42,3),IF($K$15=Data!$J$16,INDEX(Data!$EN$33:$EQ$82,$D42,3),IF($K$15=Data!$J$17,INDEX(Data!$ER$33:$EU$82,$D42,3),\"\")))),\"\")","v":0},{"$f":"IFERROR(IF($K$15=Data!$J$14,INDEX(Data!$EF$33:$EI$82,$D42,4),IF($K$15=Data!$J$15,INDEX(Data!$EJ$33:$EM$82,$D42,4),IF($K$15=Data!$J$16,INDEX(Data!$EN$33:$EQ$82,$D42,4),IF($K$15=Data!$J$17,INDEX(Data!$ER$33:$EU$82,$D42,4),\"\")))),\"\")","v":0},"","","","",0,0,0,"","",0,0,0,"","",0,0,0,0,0,"","","",""]
[null,{"$f":"'Report A'!$B46","v":"2014-07-15"},{"$f":"'Report A'!$C46","v":"Tuesday"},{"$f":"'Report A'!$D46","v":15},0,{"$f":"IFERROR(IF($K$15=Data!$J$14,INDEX(Data!$EF$33:$EI$82,$D43,1),IF($K$15=Data!$J$15,INDEX(Data!$EJ$33:$EM$82,$D43,1),IF($K$15=Data!$J$16,INDEX(Data!$EN$33:$EQ$82,$D43,1),IF($K$15=Data!$J$17,INDEX(Data!$ER$33:$EU$82,$D43,1),\"\")))),\"\")","v":0},{"$f":"IFERROR(IF($K$15=Data!$J$14,INDEX(Data!$EF$33:$EI$82,$D43,2),IF($K$15=Data!$J$15,INDEX(Data!$EJ$33:$EM$82,$D43,2),IF($K$15=Data!$J$16,INDEX(Data!$EN$33:$EQ$82,$D43,2),IF($K$15=Data!$J$17,INDEX(Data!$ER$33:$EU$82,$D43,2),\"\")))),\"\")","v":0},{"$f":"IFERROR(IF($K$15=Data!$J$14,INDEX(Data!$EF$33:$EI$82,$D43,3),IF($K$15=Data!$J$15,INDEX(Data!$EJ$33:$EM$82,$D43,3),IF($K$15=Data!$J$16,INDEX(Data!$EN$33:$EQ$82,$D43,3),IF($K$15=Data!$J$17,INDEX(Data!$ER$33:$EU$82,$D43,3),\"\")))),\"\")","v":0},{"$f":"IFERROR(IF($K$15=Data!$J$14,INDEX(Data!$EF$33:$EI$82,$D43,4),IF($K$15=Data!$J$15,INDEX(Data!$EJ$33:$EM$82,$D43,4),IF($K$15=Data!$J$16,INDEX(Data!$EN$33:$EQ$82,$D43,4),IF($K$15=Data!$J$17,INDEX(Data!$ER$33:$EU$82,$D43,4),\"\")))),\"\")","v":0},"","","","",0,0,0,"","",0,0,0,"","",0,0,0,0,0,"","","",""]
[null,{"$f":"'Report A'!$B47","v":"2014-07-16"},{"$f":"'Report A'!$C47","v":"Wednesday"},{"$f":"'Report A'!$D47","v":16},0,{"$f":"IFERROR(IF($K$15=Data!$J$14,INDEX(Data!$EF$33:$EI$82,$D44,1),IF($K$15=Data!$J$15,INDEX(Data!$EJ$33:$EM$82,$D44,1),IF($K$15=Data!$J$16,INDEX(Data!$EN$33:$EQ$82,$D44,1),IF($K$15=Data!$J$17,INDEX(Data!$ER$33:$EU$82,$D44,1),\"\")))),\"\")","v":0},{"$f":"IFERROR(IF($K$15=Data!$J$14,INDEX(Data!$EF$33:$EI$82,$D44,2),IF($K$15=Data!$J$15,INDEX(Data!$EJ$33:$EM$82,$D44,2),IF($K$15=Data!$J$16,INDEX(Data!$EN$33:$EQ$82,$D44,2),IF($K$15=Data!$J$17,INDEX(Data!$ER$33:$EU$82,$D44,2),\"\")))),\"\")","v":0},{"$f":"IFERROR(IF($K$15=Data!$J$14,INDEX(Data!$EF$33:$EI$82,$D44,3),IF($K$15=Data!$J$15,INDEX(Data!$EJ$33:$EM$82,$D44,3),IF($K$15=Data!$J$16,INDEX(Data!$EN$33:$EQ$82,$D44,3),IF($K$15=Data!$J$17,INDEX(Data!$ER$33:$EU$82,$D44,3),\"\")))),\"\")","v":0},{"$f":"IFERROR(IF($K$15=Data!$J$14,INDEX(Data!$EF$33:$EI$82,$D44,4),IF($K$15=Data!$J$15,INDEX(Data!$EJ$33:$EM$82,$D44,4),IF($K$15=Data!$J$16,INDEX(Data!$EN$33:$EQ$82,$D44,4),IF($K$15=Data!$J$17,INDEX(Data!$ER$33:$EU$82,$D44,4),\"\")))),\"\")","v":0},"","","","",0,0,0,"","",0,0,0,"","",0,0,0,0,0,"","","",""]
[null,{"$f":"'Report A'!$B48","v":"2014-07-17"},{"$f":"'Report A'!$C48","v":"Thursday"},{"$f":"'Report A'!$D48","v":17},0,{"$f":"IFERROR(IF($K$15=Data!$J$14,INDEX(Data!$EF$33:$EI$82,$D45,1),IF($K$15=Data!$J$15,INDEX(Data!$EJ$33:$EM$82,$D45,1),IF($K$15=Data!$J$16,INDEX(Data!$EN$33:$EQ$82,$D45,1),IF($K$15=Data!$J$17,INDEX(Data!$ER$33:$EU$82,$D45,1),\"\")))),\"\")","v":0},{"$f":"IFERROR(IF($K$15=Data!$J$14,INDEX(Data!$EF$33:$EI$82,$D45,2),IF($K$15=Data!$J$15,INDEX(Data!$EJ$33:$EM$82,$D45,2),IF($K$15=Data!$J$16,INDEX(Data!$EN$33:$EQ$82,$D45,2),IF($K$15=Data!$J$17,INDEX(Data!$ER$33:$EU$82,$D45,2),\"\")))),\"\")","v":0},{"$f":"IFERROR(IF($K$15=Data!$J$14,INDEX(Data!$EF$33:$EI$82,$D45,3),IF($K$15=Data!$J$15,INDEX(Data!$EJ$33:$EM$82,$D45,3),IF($K$15=Data!$J$16,INDEX(Data!$EN$33:$EQ$82,$D45,3),IF($K$15=Data!$J$17,INDEX(Data!$ER$33:$EU$82,$D45,3),\"\")))),\"\")","v":0},{"$f":"IFERROR(IF($K$15=Data!$J$14,INDEX(Data!$EF$33:$EI$82,$D45,4),IF($K$15=Data!$J$15,INDEX(Data!$EJ$33:$EM$82,$D45,4),IF($K$15=Data!$J$16,INDEX(Data!$EN$33:$EQ$82,$D45,4),IF($K$15=Data!$J$17,INDEX(Data!$ER$33:$EU$82,$D45,4),\"\")))),\"\")","v":0},"","","","",0,0,0,"","",0,0,0,"","",0,0,0,0,0,"","","",""]
[null,{"$f":"'Report A'!$B49","v":"2014-07-18"},{"$f":"'Report A'!$C49","v":"Friday"},{"$f":"'Report A'!$D49","v":18},0,{"$f":"IFERROR(IF($K$15=Data!$J$14,INDEX(Data!$EF$33:$EI$82,$D46,1),IF($K$15=Data!$J$15,INDEX(Data!$EJ$33:$EM$82,$D46,1),IF($K$15=Data!$J$16,INDEX(Data!$EN$33:$EQ$82,$D46,1),IF($K$15=Data!$J$17,INDEX(Data!$ER$33:$EU$82,$D46,1),\"\")))),\"\")","v":0},{"$f":"IFERROR(IF($K$15=Data!$J$14,INDEX(Data!$EF$33:$EI$82,$D46,2),IF($K$15=Data!$J$15,INDEX(Data!$EJ$33:$EM$82,$D46,2),IF($K$15=Data!$J$16,INDEX(Data!$EN$33:$EQ$82,$D46,2),IF($K$15=Data!$J$17,INDEX(Data!$ER$33:$EU$82,$D46,2),\"\")))),\"\")","v":0},{"$f":"IFERROR(IF($K$15=Data!$J$14,INDEX(Data!$EF$33:$EI$82,$D46,3),IF($K$15=Data!$J$15,INDEX(Data!$EJ$33:$EM$82,$D46,3),IF($K$15=Data!$J$16,INDEX(Data!$EN$33:$EQ$82,$D46,3),IF($K$15=Data!$J$17,INDEX(Data!$ER$33:$EU$82,$D46,3),\"\")))),\"\")","v":0},{"$f":"IFERROR(IF($K$15=Data!$J$14,INDEX(Data!$EF$33:$EI$82,$D46,4),IF($K$15=Data!$J$15,INDEX(Data!$EJ$33:$EM$82,$D46,4),IF($K$15=Data!$J$16,INDEX(Data!$EN$33:$EQ$82,$D46,4),IF($K$15=Data!$J$17,INDEX(Data!$ER$33:$EU$82,$D46,4),\"\")))),\"\")","v":0},"","","","",0,0,0,"","",0,0,0,"","",0,0,0,0,0,"","","","","CHART G3"]
[null,{"$f":"'Report A'!$B50","v":"2014-07-19"},{"$f":"'Report A'!$C50","v":"Saturday"},{"$f":"'Report A'!$D50","v":19},0,{"$f":"IFERROR(IF($K$15=Data!$J$14,INDEX(Data!$EF$33:$EI$82,$D47,1),IF($K$15=Data!$J$15,INDEX(Data!$EJ$33:$EM$82,$D47,1),IF($K$15=Data!$J$16,INDEX(Data!$EN$33:$EQ$82,$D47,1),IF($K$15=Data!$J$17,INDEX(Data!$ER$33:$EU$82,$D47,1),\"\")))),\"\")","v":0},{"$f":"IFERROR(IF($K$15=Data!$J$14,INDEX(Data!$EF$33:$EI$82,$D47,2),IF($K$15=Data!$J$15,INDEX(Data!$EJ$33:$EM$82,$D47,2),IF($K$15=Data!$J$16,INDEX(Data!$EN$33:$EQ$82,$D47,2),IF($K$15=Data!$J$17,INDEX(Data!$ER$33:$EU$82,$D47,2),\"\")))),\"\")","v":0},{"$f":"IFERROR(IF($K$15=Data!$J$14,INDEX(Data!$EF$33:$EI$82,$D47,3),IF($K$15=Data!$J$15,INDEX(Data!$EJ$33:$EM$82,$D47,3),IF($K$15=Data!$J$16,INDEX(Data!$EN$33:$EQ$82,$D47,3),IF($K$15=Data!$J$17,INDEX(Data!$ER$33:$EU$82,$D47,3),\"\")))),\"\")","v":0},{"$f":"IFERROR(IF($K$15=Data!$J$14,INDEX(Data!$EF$33:$EI$82,$D47,4),IF($K$15=Data!$J$15,INDEX(Data!$EJ$33:$EM$82,$D47,4),IF($K$15=Data!$J$16,INDEX(Data!$EN$33:$EQ$82,$D47,4),IF($K$15=Data!$J$17,INDEX(Data!$ER$33:$EU$82,$D47,4),\"\")))),\"\")","v":0},"","","","",0,0,0,"","",0,0,0,"","",0,0,0,0,0,"","","",""]
[null,{"$f":"'Report A'!$B51","v":"2014-07-20"},{"$f":"'Report A'!$C51","v":"Sunday"},{"$f":"'Report A'!$D51","v":20},0,{"$f":"IFERROR(IF($K$15=Data!$J$14,INDEX(Data!$EF$33:$EI$82,$D48,1),IF($K$15=Data!$J$15,INDEX(Data!$EJ$33:$EM$82,$D48,1),IF($K$15=Data!$J$16,INDEX(Data!$EN$33:$EQ$82,$D48,1),IF($K$15=Data!$J$17,INDEX(Data!$ER$33:$EU$82,$D48,1),\"\")))),\"\")","v":0},{"$f":"IFERROR(IF($K$15=Data!$J$14,INDEX(Data!$EF$33:$EI$82,$D48,2),IF($K$15=Data!$J$15,INDEX(Data!$EJ$33:$EM$82,$D48,2),IF($K$15=Data!$J$16,INDEX(Data!$EN$33:$EQ$82,$D48,2),IF($K$15=Data!$J$17,INDEX(Data!$ER$33:$EU$82,$D48,2),\"\")))),\"\")","v":0},{"$f":"IFERROR(IF($K$15=Data!$J$14,INDEX(Data!$EF$33:$EI$82,$D48,3),IF($K$15=Data!$J$15,INDEX(Data!$EJ$33:$EM$82,$D48,3),IF($K$15=Data!$J$16,INDEX(Data!$EN$33:$EQ$82,$D48,3),IF($K$15=Data!$J$17,INDEX(Data!$ER$33:$EU$82,$D48,3),\"\")))),\"\")","v":0},{"$f":"IFERROR(IF($K$15=Data!$J$14,INDEX(Data!$EF$33:$EI$82,$D48,4),IF($K$15=Data!$J$15,INDEX(Data!$EJ$33:$EM$82,$D48,4),IF($K$15=Data!$J$16,INDEX(Data!$EN$33:$EQ$82,$D48,4),IF($K$15=Data!$J$17,INDEX(Data!$ER$33:$EU$82,$D48,4),\"\")))),\"\")","v":0},"","","","",0,0,0,"","",0,0,0,"","",0,0,0,0,0,"","","",""]
[null,{"$f":"'Report A'!$B52","v":"2014-07-21"},{"$f":"'Report A'!$C52","v":"Monday"},{"$f":"'Report A'!$D52","v":21},0,{"$f":"IFERROR(IF($K$15=Data!$J$14,INDEX(Data!$EF$33:$EI$82,$D49,1),IF($K$15=Data!$J$15,INDEX(Data!$EJ$33:$EM$82,$D49,1),IF($K$15=Data!$J$16,INDEX(Data!$EN$33:$EQ$82,$D49,1),IF($K$15=Data!$J$17,INDEX(Data!$ER$33:$EU$82,$D49,1),\"\")))),\"\")","v":0},{"$f":"IFERROR(IF($K$15=Data!$J$14,INDEX(Data!$EF$33:$EI$82,$D49,2),IF($K$15=Data!$J$15,INDEX(Data!$EJ$33:$EM$82,$D49,2),IF($K$15=Data!$J$16,INDEX(Data!$EN$33:$EQ$82,$D49,2),IF($K$15=Data!$J$17,INDEX(Data!$ER$33:$EU$82,$D49,2),\"\")))),\"\")","v":0},{"$f":"IFERROR(IF($K$15=Data!$J$14,INDEX(Data!$EF$33:$EI$82,$D49,3),IF($K$15=Data!$J$15,INDEX(Data!$EJ$33:$EM$82,$D49,3),IF($K$15=Data!$J$16,INDEX(Data!$EN$33:$EQ$82,$D49,3),IF($K$15=Data!$J$17,INDEX(Data!$ER$33:$EU$82,$D49,3),\"\")))),\"\")","v":0},{"$f":"IFERROR(IF($K$15=Data!$J$14,INDEX(Data!$EF$33:$EI$82,$D49,4),IF($K$15=Data!$J$15,INDEX(Data!$EJ$33:$EM$82,$D49,4),IF($K$15=Data!$J$16,INDEX(Data!$EN$33:$EQ$82,$D49,4),IF($K$15=Data!$J$17,INDEX(Data!$ER$33:$EU$82,$D49,4),\"\")))),\"\")","v":0},"","","","",0,0,0,"","",0,0,0,"","",0,0,0,0,0,"","","",""]
[null,{"$f":"'Report A'!$B53","v":"2014-07-22"},{"$f":"'Report A'!$C53","v":"Tuesday"},{"$f":"'Report A'!$D53","v":22},0,{"$f":"IFERROR(IF($K$15=Data!$J$14,INDEX(Data!$EF$33:$EI$82,$D50,1),IF($K$15=Data!$J$15,INDEX(Data!$EJ$33:$EM$82,$D50,1),IF($K$15=Data!$J$16,INDEX(Data!$EN$33:$EQ$82,$D50,1),IF($K$15=Data!$J$17,INDEX(Data!$ER$33:$EU$82,$D50,1),\"\")))),\"\")","v":0},{"$f":"IFERROR(IF($K$15=Data!$J$14,INDEX(Data!$EF$33:$EI$82,$D50,2),IF($K$15=Data!$J$15,INDEX(Data!$EJ$33:$EM$82,$D50,2),IF($K$15=Data!$J$16,INDEX(Data!$EN$33:$EQ$82,$D50,2),IF($K$15=Data!$J$17,INDEX(Data!$ER$33:$EU$82,$D50,2),\"\")))),\"\")","v":0},{"$f":"IFERROR(IF($K$15=Data!$J$14,INDEX(Data!$EF$33:$EI$82,$D50,3),IF($K$15=Data!$J$15,INDEX(Data!$EJ$33:$EM$82,$D50,3),IF($K$15=Data!$J$16,INDEX(Data!$EN$33:$EQ$82,$D50,3),IF($K$15=Data!$J$17,INDEX(Data!$ER$33:$EU$82,$D50,3),\"\")))),\"\")","v":0},{"$f":"IFERROR(IF($K$15=Data!$J$14,INDEX(Data!$EF$33:$EI$82,$D50,4),IF($K$15=Data!$J$15,INDEX(Data!$EJ$33:$EM$82,$D50,4),IF($K$15=Data!$J$16,INDEX(Data!$EN$33:$EQ$82,$D50,4),IF($K$15=Data!$J$17,INDEX(Data!$ER$33:$EU$82,$D50,4),\"\")))),\"\")","v":0},"","","","",0,0,0,"","",0,0,0,"","",0,0,0,0,0,"","","",""]
[null,{"$f":"'Report A'!$B54","v":"2014-07-23"},{"$f":"'Report A'!$C54","v":"Wednesday"},{"$f":"'Report A'!$D54","v":23},0,{"$f":"IFERROR(IF($K$15=Data!$J$14,INDEX(Data!$EF$33:$EI$82,$D51,1),IF($K$15=Data!$J$15,INDEX(Data!$EJ$33:$EM$82,$D51,1),IF($K$15=Data!$J$16,INDEX(Data!$EN$33:$EQ$82,$D51,1),IF($K$15=Data!$J$17,INDEX(Data!$ER$33:$EU$82,$D51,1),\"\")))),\"\")","v":0},{"$f":"IFERROR(IF($K$15=Data!$J$14,INDEX(Data!$EF$33:$EI$82,$D51,2),IF($K$15=Data!$J$15,INDEX(Data!$EJ$33:$EM$82,$D51,2),IF($K$15=Data!$J$16,INDEX(Data!$EN$33:$EQ$82,$D51,2),IF($K$15=Data!$J$17,INDEX(Data!$ER$33:$EU$82,$D51,2),\"\")))),\"\")","v":0},{"$f":"IFERROR(IF($K$15=Data!$J$14,INDEX(Data!$EF$33:$EI$82,$D51,3),IF($K$15=Data!$J$15,INDEX(Data!$EJ$33:$EM$82,$D51,3),IF($K$15=Data!$J$16,INDEX(Data!$EN$33:$EQ$82,$D51,3),IF($K$15=Data!$J$17,INDEX(Data!$ER$33:$EU$82,$D51,3),\"\")))),\"\")","v":0},{"$f":"IFERROR(IF($K$15=Data!$J$14,INDEX(Data!$EF$33:$EI$82,$D51,4),IF($K$15=Data!$J$15,INDEX(Data!$EJ$33:$EM$82,$D51,4),IF($K$15=Data!$J$16,INDEX(Data!$EN$33:$EQ$82,$D51,4),IF($K$15=Data!$J$17,INDEX(Data!$ER$33:$EU$82,$D51,4),\"\")))),\"\")","v":0},"","","","",0,0,0,"","",0,0,0,"","",0,0,0,0,0,"","","",""]
[null,{"$f":"'Report A'!$B55","v":"2014-07-24"},{"$f":"'Report A'!$C55","v":"Thursday"},{"$f":"'Report A'!$D55","v":24},0,{"$f":"IFERROR(IF($K$15=Data!$J$14,INDEX(Data!$EF$33:$EI$82,$D52,1),IF($K$15=Data!$J$15,INDEX(Data!$EJ$33:$EM$82,$D52,1),IF($K$15=Data!$J$16,INDEX(Data!$EN$33:$EQ$82,$D52,1),IF($K$15=Data!$J$17,INDEX(Data!$ER$33:$EU$82,$D52,1),\"\")))),\"\")","v":0},{"$f":"IFERROR(IF($K$15=Data!$J$14,INDEX(Data!$EF$33:$EI$82,$D52,2),IF($K$15=Data!$J$15,INDEX(Data!$EJ$33:$EM$82,$D52,2),IF($K$15=Data!$J$16,INDEX(Data!$EN$33:$EQ$82,$D52,2),IF($K$15=Data!$J$17,INDEX(Data!$ER$33:$EU$82,$D52,2),\"\")))),\"\")","v":0},{"$f":"IFERROR(IF($K$15=Data!$J$14,INDEX(Data!$EF$33:$EI$82,$D52,3),IF($K$15=Data!$J$15,INDEX(Data!$EJ$33:$EM$82,$D52,3),IF($K$15=Data!$J$16,INDEX(Data!$EN$33:$EQ$82,$D52,3),IF($K$15=Data!$J$17,INDEX(Data!$ER$33:$EU$82,$D52,3),\"\")))),\"\")","v":0},{"$f":"IFERROR(IF($K$15=Data!$J$14,INDEX(Data!$EF$33:$EI$82,$D52,4),IF($K$15=Data!$J$15,INDEX(Data!$EJ$33:$EM$82,$D52,4),IF($K$15=Data!$J$16,INDEX(Data!$EN$33:$EQ$82,$D52,4),IF($K$15=Data!$J$17,INDEX(Data!$ER$33:$EU$82,$D52,4),\"\")))),\"\")","v":0},"","","","",0,0,0,"","",0,0,0,"","",0,0,0,0,0,"","","",""]
[null,{"$f":"'Report A'!$B56","v":"2014-07-25"},{"$f":"'Report A'!$C56","v":"Friday"},{"$f":"'Report A'!$D56","v":25},0,{"$f":"IFERROR(IF($K$15=Data!$J$14,INDEX(Data!$EF$33:$EI$82,$D53,1),IF($K$15=Data!$J$15,INDEX(Data!$EJ$33:$EM$82,$D53,1),IF($K$15=Data!$J$16,INDEX(Data!$EN$33:$EQ$82,$D53,1),IF($K$15=Data!$J$17,INDEX(Data!$ER$33:$EU$82,$D53,1),\"\")))),\"\")","v":0},{"$f":"IFERROR(IF($K$15=Data!$J$14,INDEX(Data!$EF$33:$EI$82,$D53,2),IF($K$15=Data!$J$15,INDEX(Data!$EJ$33:$EM$82,$D53,2),IF($K$15=Data!$J$16,INDEX(Data!$EN$33:$EQ$82,$D53,2),IF($K$15=Data!$J$17,INDEX(Data!$ER$33:$EU$82,$D53,2),\"\")))),\"\")","v":0},{"$f":"IFERROR(IF($K$15=Data!$J$14,INDEX(Data!$EF$33:$EI$82,$D53,3),IF($K$15=Data!$J$15,INDEX(Data!$EJ$33:$EM$82,$D53,3),IF($K$15=Data!$J$16,INDEX(Data!$EN$33:$EQ$82,$D53,3),IF($K$15=Data!$J$17,INDEX(Data!$ER$33:$EU$82,$D53,3),\"\")))),\"\")","v":0},{"$f":"IFERROR(IF($K$15=Data!$J$14,INDEX(Data!$EF$33:$EI$82,$D53,4),IF($K$15=Data!$J$15,INDEX(Data!$EJ$33:$EM$82,$D53,4),IF($K$15=Data!$J$16,INDEX(Data!$EN$33:$EQ$82,$D53,4),IF($K$15=Data!$J$17,INDEX(Data!$ER$33:$EU$82,$D53,4),\"\")))),\"\")","v":0},"","","","",0,0,0,"","",0,0,0,"","",0,0,0,0,0,"","","",""]
[null,{"$f":"'Report A'!$B57","v":"2014-07-26"},{"$f":"'Report A'!$C57","v":"Saturday"},{"$f":"'Report A'!$D57","v":26},0,{"$f":"IFERROR(IF($K$15=Data!$J$14,INDEX(Data!$EF$33:$EI$82,$D54,1),IF($K$15=Data!$J$15,INDEX(Data!$EJ$33:$EM$82,$D54,1),IF($K$15=Data!$J$16,INDEX(Data!$EN$33:$EQ$82,$D54,1),IF($K$15=Data!$J$17,INDEX(Data!$ER$33:$EU$82,$D54,1),\"\")))),\"\")","v":0},{"$f":"IFERROR(IF($K$15=Data!$J$14,INDEX(Data!$EF$33:$EI$82,$D54,2),IF($K$15=Data!$J$15,INDEX(Data!$EJ$33:$EM$82,$D54,2),IF($K$15=Data!$J$16,INDEX(Data!$EN$33:$EQ$82,$D54,2),IF($K$15=Data!$J$17,INDEX(Data!$ER$33:$EU$82,$D54,2),\"\")))),\"\")","v":0},{"$f":"IFERROR(IF($K$15=Data!$J$14,INDEX(Data!$EF$33:$EI$82,$D54,3),IF($K$15=Data!$J$15,INDEX(Data!$EJ$33:$EM$82,$D54,3),IF($K$15=Data!$J$16,INDEX(Data!$EN$33:$EQ$82,$D54,3),IF($K$15=Data!$J$17,INDEX(Data!$ER$33:$EU$82,$D54,3),\"\")))),\"\")","v":0},{"$f":"IFERROR(IF($K$15=Data!$J$14,INDEX(Data!$EF$33:$EI$82,$D54,4),IF($K$15=Data!$J$15,INDEX(Data!$EJ$33:$EM$82,$D54,4),IF($K$15=Data!$J$16,INDEX(Data!$EN$33:$EQ$82,$D54,4),IF($K$15=Data!$J$17,INDEX(Data!$ER$33:$EU$82,$D54,4),\"\")))),\"\")","v":0},"","","","",0,0,0,"","",0,0,0,"","",0,0,0,0,0,"","","",""]
[null,{"$f":"'Report A'!$B58","v":"2014-07-27"},{"$f":"'Report A'!$C58","v":"Sunday +"},{"$f":"'Report A'!$D58","v":27},0,{"$f":"IFERROR(IF($K$15=Data!$J$14,INDEX(Data!$EF$33:$EI$82,$D55,1),IF($K$15=Data!$J$15,INDEX(Data!$EJ$33:$EM$82,$D55,1),IF($K$15=Data!$J$16,INDEX(Data!$EN$33:$EQ$82,$D55,1),IF($K$15=Data!$J$17,INDEX(Data!$ER$33:$EU$82,$D55,1),\"\")))),\"\")","v":0},{"$f":"IFERROR(IF($K$15=Data!$J$14,INDEX(Data!$EF$33:$EI$82,$D55,2),IF($K$15=Data!$J$15,INDEX(Data!$EJ$33:$EM$82,$D55,2),IF($K$15=Data!$J$16,INDEX(Data!$EN$33:$EQ$82,$D55,2),IF($K$15=Data!$J$17,INDEX(Data!$ER$33:$EU$82,$D55,2),\"\")))),\"\")","v":0},{"$f":"IFERROR(IF($K$15=Data!$J$14,INDEX(Data!$EF$33:$EI$82,$D55,3),IF($K$15=Data!$J$15,INDEX(Data!$EJ$33:$EM$82,$D55,3),IF($K$15=Data!$J$16,INDEX(Data!$EN$33:$EQ$82,$D55,3),IF($K$15=Data!$J$17,INDEX(Data!$ER$33:$EU$82,$D55,3),\"\")))),\"\")","v":0},{"$f":"IFERROR(IF($K$15=Data!$J$14,INDEX(Data!$EF$33:$EI$82,$D55,4),IF($K$15=Data!$J$15,INDEX(Data!$EJ$33:$EM$82,$D55,4),IF($K$15=Data!$J$16,INDEX(Data!$EN$33:$EQ$82,$D55,4),IF($K$15=Data!$J$17,INDEX(Data!$ER$33:$EU$82,$D55,4),\"\")))),\"\")","v":0},"","","","",0,0,0,"","",0,0,0,"","",0,0,0,0,0,"","","",""]
[null,{"$f":"'Report A'!$B59","v":"2014-07-28"},{"$f":"'Report A'!$C59","v":"Monday ++"},{"$f":"'Report A'!$D59","v":28},0,{"$f":"IFERROR(IF($K$15=Data!$J$14,INDEX(Data!$EF$33:$EI$82,$D56,1),IF($K$15=Data!$J$15,INDEX(Data!$EJ$33:$EM$82,$D56,1),IF($K$15=Data!$J$16,INDEX(Data!$EN$33:$EQ$82,$D56,1),IF($K$15=Data!$J$17,INDEX(Data!$ER$33:$EU$82,$D56,1),\"\")))),\"\")","v":0},{"$f":"IFERROR(IF($K$15=Data!$J$14,INDEX(Data!$EF$33:$EI$82,$D56,2),IF($K$15=Data!$J$15,INDEX(Data!$EJ$33:$EM$82,$D56,2),IF($K$15=Data!$J$16,INDEX(Data!$EN$33:$EQ$82,$D56,2),IF($K$15=Data!$J$17,INDEX(Data!$ER$33:$EU$82,$D56,2),\"\")))),\"\")","v":0},{"$f":"IFERROR(IF($K$15=Data!$J$14,INDEX(Data!$EF$33:$EI$82,$D56,3),IF($K$15=Data!$J$15,INDEX(Data!$EJ$33:$EM$82,$D56,3),IF($K$15=Data!$J$16,INDEX(Data!$EN$33:$EQ$82,$D56,3),IF($K$15=Data!$J$17,INDEX(Data!$ER$33:$EU$82,$D56,3),\"\")))),\"\")","v":0},{"$f":"IFERROR(IF($K$15=Data!$J$14,INDEX(Data!$EF$33:$EI$82,$D56,4),IF($K$15=Data!$J$15,INDEX(Data!$EJ$33:$EM$82,$D56,4),IF($K$15=Data!$J$16,INDEX(Data!$EN$33:$EQ$82,$D56,4),IF($K$15=Data!$J$17,INDEX(Data!$ER$33:$EU$82,$D56,4),\"\")))),\"\")","v":0},"","","","",0,0,0,"","",0,0,0,"","",0,0,0,0,0,"","","",""]
[null,{"$f":"'Report A'!$B60","v":"2014-07-29"},{"$f":"'Report A'!$C60","v":"Tuesday ++"},{"$f":"'Report A'!$D60","v":29},0,{"$f":"IFERROR(IF($K$15=Data!$J$14,INDEX(Data!$EF$33:$EI$82,$D57,1),IF($K$15=Data!$J$15,INDEX(Data!$EJ$33:$EM$82,$D57,1),IF($K$15=Data!$J$16,INDEX(Data!$EN$33:$EQ$82,$D57,1),IF($K$15=Data!$J$17,INDEX(Data!$ER$33:$EU$82,$D57,1),\"\")))),\"\")","v":0},{"$f":"IFERROR(IF($K$15=Data!$J$14,INDEX(Data!$EF$33:$EI$82,$D57,2),IF($K$15=Data!$J$15,INDEX(Data!$EJ$33:$EM$82,$D57,2),IF($K$15=Data!$J$16,INDEX(Data!$EN$33:$EQ$82,$D57,2),IF($K$15=Data!$J$17,INDEX(Data!$ER$33:$EU$82,$D57,2),\"\")))),\"\")","v":0},{"$f":"IFERROR(IF($K$15=Data!$J$14,INDEX(Data!$EF$33:$EI$82,$D57,3),IF($K$15=Data!$J$15,INDEX(Data!$EJ$33:$EM$82,$D57,3),IF($K$15=Data!$J$16,INDEX(Data!$EN$33:$EQ$82,$D57,3),IF($K$15=Data!$J$17,INDEX(Data!$ER$33:$EU$82,$D57,3),\"\")))),\"\")","v":0},{"$f":"IFERROR(IF($K$15=Data!$J$14,INDEX(Data!$EF$33:$EI$82,$D57,4),IF($K$15=Data!$J$15,INDEX(Data!$EJ$33:$EM$82,$D57,4),IF($K$15=Data!$J$16,INDEX(Data!$EN$33:$EQ$82,$D57,4),IF($K$15=Data!$J$17,INDEX(Data!$ER$33:$EU$82,$D57,4),\"\")))),\"\")","v":0},"","","","",0,0,0,"","",0,0,0,"","",0,0,0,0,0,"","","",""]
[null,{"$f":"'Report A'!$B61","v":"2014-07-30"},{"$f":"'Report A'!$C61","v":"Wednesday"},{"$f":"'Report A'!$D61","v":30},0,{"$f":"IFERROR(IF($K$15=Data!$J$14,INDEX(Data!$EF$33:$EI$82,$D58,1),IF($K$15=Data!$J$15,INDEX(Data!$EJ$33:$EM$82,$D58,1),IF($K$15=Data!$J$16,INDEX(Data!$EN$33:$EQ$82,$D58,1),IF($K$15=Data!$J$17,INDEX(Data!$ER$33:$EU$82,$D58,1),\"\")))),\"\")","v":0},{"$f":"IFERROR(IF($K$15=Data!$J$14,INDEX(Data!$EF$33:$EI$82,$D58,2),IF($K$15=Data!$J$15,INDEX(Data!$EJ$33:$EM$82,$D58,2),IF($K$15=Data!$J$16,INDEX(Data!$EN$33:$EQ$82,$D58,2),IF($K$15=Data!$J$17,INDEX(Data!$ER$33:$EU$82,$D58,2),\"\")))),\"\")","v":0},{"$f":"IFERROR(IF($K$15=Data!$J$14,INDEX(Data!$EF$33:$EI$82,$D58,3),IF($K$15=Data!$J$15,INDEX(Data!$EJ$33:$EM$82,$D58,3),IF($K$15=Data!$J$16,INDEX(Data!$EN$33:$EQ$82,$D58,3),IF($K$15=Data!$J$17,INDEX(Data!$ER$33:$EU$82,$D58,3),\"\")))),\"\")","v":0},{"$f":"IFERROR(IF($K$15=Data!$J$14,INDEX(Data!$EF$33:$EI$82,$D58,4),IF($K$15=Data!$J$15,INDEX(Data!$EJ$33:$EM$82,$D58,4),IF($K$15=Data!$J$16,INDEX(Data!$EN$33:$EQ$82,$D58,4),IF($K$15=Data!$J$17,INDEX(Data!$ER$33:$EU$82,$D58,4),\"\")))),\"\")","v":0},"","","","",0,0,0,"","",0,0,0,"","",0,0,0,0,0,"","","",""]
[null,{"$f":"'Report A'!$B62","v":"2014-07-31"},{"$f":"'Report A'!$C62","v":"Thursday"},{"$f":"'Report A'!$D62","v":31},0,{"$f":"IFERROR(IF($K$15=Data!$J$14,INDEX(Data!$EF$33:$EI$82,$D59,1),IF($K$15=Data!$J$15,INDEX(Data!$EJ$33:$EM$82,$D59,1),IF($K$15=Data!$J$16,INDEX(Data!$EN$33:$EQ$82,$D59,1),IF($K$15=Data!$J$17,INDEX(Data!$ER$33:$EU$82,$D59,1),\"\")))),\"\")","v":0},{"$f":"IFERROR(IF($K$15=Data!$J$14,INDEX(Data!$EF$33:$EI$82,$D59,2),IF($K$15=Data!$J$15,INDEX(Data!$EJ$33:$EM$82,$D59,2),IF($K$15=Data!$J$16,INDEX(Data!$EN$33:$EQ$82,$D59,2),IF($K$15=Data!$J$17,INDEX(Data!$ER$33:$EU$82,$D59,2),\"\")))),\"\")","v":0},{"$f":"IFERROR(IF($K$15=Data!$J$14,INDEX(Data!$EF$33:$EI$82,$D59,3),IF($K$15=Data!$J$15,INDEX(Data!$EJ$33:$EM$82,$D59,3),IF($K$15=Data!$J$16,INDEX(Data!$EN$33:$EQ$82,$D59,3),IF($K$15=Data!$J$17,INDEX(Data!$ER$33:$EU$82,$D59,3),\"\")))),\"\")","v":0},{"$f":"IFERROR(IF($K$15=Data!$J$14,INDEX(Data!$EF$33:$EI$82,$D59,4),IF($K$15=Data!$J$15,INDEX(Data!$EJ$33:$EM$82,$D59,4),IF($K$15=Data!$J$16,INDEX(Data!$EN$33:$EQ$82,$D59,4),IF($K$15=Data!$J$17,INDEX(Data!$ER$33:$EU$82,$D59,4),\"\")))),\"\")","v":0},"","","","",0,0,0,"","",0,0,0,"","",0,0,0,0,0,"","","",""]