{"text_format":"1","workbook":"xlsx","n_sheets":9,"sheets":["Form","Data","Report A","Report B","Report C","Report D","Report E","Report F","Report G"],"not_rendered":{"charts":9,"images":13,"macros":1,"external_links":0,"defined_names":7,"comments":0,"pivot_tables":0},"unopened":[{"sheet":"Form","index":0,"reason":"not_a_worksheet"}],"bounds":{"document_bytes":16777216,"sheet_cells":100000,"rows_first":2000,"rows_last":500,"rows_between":2000,"halvings":0,"cell_chars":16384,"cell_head_chars":4096},"cells_cut":0,"cells_raw":0,"read":"whole","date_system":"1900"}

{"sheet":"Data","index":1,"n_rows":82,"n_cols":159,"rows_kept":82,"cut":false,"hidden":true,"merged":[]}
[]
[]
[null,null,"MONTHLY SALES REPORTING BY OUTLET"]
[]
[]
[null,"SUBJECT","DATABASE FOR MONTHLY OUTLET SALES REPORT"]
[]
[null,"OUTLET",{"$f":"MID(CELL(\"FILENAME\",$A$1),FIND(\"[\",CELL(\"FILENAME\",$A$1))+1,3)","v":"SBA"}]
[]
[null,"MONTH / YEAR",{"$f":"INDEX($D$14:$D$25,MONTH(DATE(MID(CELL(\"FILENAME\",$A$1),FIND(\"[\",CELL(\"FILENAME\",$A$1))+4,4),MID(CELL(\"FILENAME\",$A$1),FIND(\"[\",CELL(\"FILENAME\",$A$1))+8,2),1)),1)&\" \"&MID(CELL(\"FILENAME\",$A$1),FIND(\"[\",CELL(\"FILENAME\",$A$1))+4,4)","v":"July 2014"}]
[]
[null,"FILE NAME",{"$f":"MID(CELL(\"FILENAME\",$A$1),1,FIND(\"[\",CELL(\"FILENAME\",$A$1))-1)","v":"C:\\Users\\Lion\\Desktop\\Sales Report\\ROOM OCCUPANCY\\7 JULY 2014\\04SBA\\"}]
[null,null,null,null,null,null,null,null,null,null,null,null,null,null,null,null,null,null,null,null,null,"ROOM"]
[null,"LISTS",2,"January",null,"ALL",null,"BEER EXCHANGE",null,"RECEPTION"]
[null,null,{"$f":"INDEX($C$16:$C$25,$C$14,1)","v":"REPORT B"},"February",null,"NORMAL",null,"BEER PACKAGE",null,"MV / AUDIO"]
[null,null,"REPORT A","March",null,"CHILDREN",null,"BEER SIDE ORDER",null,"F&B"]
[null,null,"REPORT B","April",null,"LADIES",null,"LIQUOR PACKAGE",null,"OVERALL EXPERIENCE"]
[null,null,"REPORT C","May",null,"SENIOR CITIZEN",null,"LIQUOR SIDE ORDER"]
[null,null,"REPORT D","June",null,"STUDENT",null,"MEAL"]
[null,null,"REPORT E","July",null,null,null,"MEMBERSHIP"]
{"$rows_left_out":63}
{"sheet":"Report A","index":2,"n_rows":62,"n_cols":17,"rows_kept":62,"cut":false,"hidden":false,"merged":[]}
[]
[]
[null,null,"MONTHLY SALES REPORTING BY OUTLET"]
[]
[]
[null,"SUBJECT","REPORT A : SALES PERFORMANCE FOR THE MONTH"]
[]
[null,"OUTLET",{"$f":"Data!$C$8","v":"SBA"}]
[]
[null,"MONTH / YEAR",{"$f":"Data!$C$10","v":"July 2014"}]
[]
[null,"MENU"]
[]
[null,"DATE","DAY","ROW",{"$f":"\"SALES FOR \"&IF(MATCH(MID($C$10,1,FIND(\" \",$C$10,1)-1),Data!$D$14:$D$25,0)=1,\"December \"&MID($C$10,FIND(\" \",$C$10,1)+1,4)-1,INDEX(Data!$D$14:$D$25,MATCH(MID($C$10,1,FIND(\" \",$C$10,1)-1),Data!$D$14:$D$25,0)-1,1)&\" \"&MID($C$10,FIND(\" \",$C$10,1)+1,4))","v":"SALES FOR June 2014"},null,null,{"$f":"\"SALES FOR \"&C10","v":"SALES FOR July 2014"},null,null,{"$f":"\"SALES FOR \"&MID(C10,1,FIND(\" \",C10,1)-1)&\" \"&MID($C$10,FIND(\" \",$C$10,1)+1,4)-1","v":"SALES FOR July 2013"},null,null,"COMPARISON OF SALES",null,null,"CHART : COMPARISON OF SALES PERFORMANCE"]
[null,null,null,null,{"$f":"IF(MID(CELL(\"FILENAME\",$A$1),FIND(\"[\",CELL(\"FILENAME\",$A$1))+8,2)=\"01\",MID(CELL(\"FILENAME\",$A$1),1,FIND(\"Y\",CELL(\"FILENAME\",$A$1))-1)&\"YR\"&MID(CELL(\"FILENAME\",$A$1),FIND(\"[\",CELL(\"FILENAME\",$A$1))+4,4)-1&\"\\December\\\"&$C$8&\"\\\",MID(CELL(\"FILENAME\",$A$1),1,FIND(\"Y\",CELL(\"FILENAME\",$A$1))-1)&\"YR\"&MID(CELL(\"FILENAME\",$A$1),FIND(\"[\",CELL(\"FILENAME\",$A$1))+4,4)&\"\\\"&INDEX(Data!$D$14:$D$25,MATCH(MID($C$10,1,FIND(\" \",$C$10,1)-1),Data!$D$14:$D$25,0)-1,1)&\"\\\"&$C$8&\"\\\")","v":"C:\\Users\\Lion\\Desktop\\Sales Report\\ROOM OCCUPANCYR2014\\June\\SBA\\"},null,null,null,null,null,{"$f":"MID(CELL(\"FILENAME\",$A$1),1,FIND(\"R\",CELL(\"FILENAME\",$A$1),1))&MID($C$10,FIND(\" \",$C$10,1)+1,4)-1&\"\\\"&MID($C$10,1,FIND(\" \",$C$10)-1)&\"\\\"&C8&\"\\\"","v":"C:\\Users\\Lion\\Desktop\\Sales R2013\\July\\SBA\\"}]
[null,null,null,null,{"$f":"IF(MID(CELL(\"FILENAME\",$A$1),FIND(\"[\",CELL(\"FILENAME\",$A$1))+8,2)=\"01\",$C$8&MID(CELL(\"FILENAME\",$A$1),FIND(\"[\",CELL(\"FILENAME\",$A$1))+4,4)-1&12&\"Sales.xlsm\",$C$8&MID(CELL(\"FILENAME\",$A$1),FIND(\"[\",CELL(\"FILENAME\",$A$1))+4,4)&TEXT(MATCH(MID($C$10,1,FIND(\" \",$C$10,1)-1),Data!$D$14:$D$25,0)-1,\"00\")&\"Sales.xlsm\")","v":"SBA201406Sales.xlsm"},null,null,null,null,null,{"$f":"$C$8&MID($C$10,FIND(\" \",$C$10,1)+1,4)-1&TEXT(MATCH(MID($C$10,1,FIND(\" \",$C$10,1)-1),Data!$D$14:$D$25,0),\"00\")&\"Sales.xlsm\"","v":"SBA201307Sales.xlsm"}]
[null,null,null,null,"A.M.","P.M.","TOTAL","A.M.","P.M.","TOTAL","A.M.","P.M.","TOTAL","LAST MONTH","THIS MONTH","LAST YEAR","SELECT TO VIEW"]
[null,null,null,null,null,null,null,null,null,null,null,null,null,{"$f":"IF($N$20=TRUE,\"A.M.\",IF($O$20=TRUE,\"P.M.\",\"TOTAL\"))","v":"TOTAL"},{"$f":"$N$18","v":"TOTAL"},{"$f":"$N$18","v":"TOTAL"}]
[null,null,null,null,"( RM )","( RM )","( RM )","( RM )","( RM )","( RM )","( RM )","( RM )","( RM )","( RM )","( RM )","( RM )"]
[null,"SUMMARY FOR MONTH",null,null,null,null,null,null,null,null,null,null,null,false,false,true,"LEGEND"]
{"$rows_left_out":43}
{"sheet":"Report B","index":3,"n_rows":61,"n_cols":24,"rows_kept":61,"cut":false,"hidden":false,"merged":[]}
[]
[]
[null,null,"MONTHLY SALES REPORTING BY OUTLET"]
[]
[]
[null,"SUBJECT","REPORT B : ROOM OCCUPANCY AND USAGE OF PARTY ROOMS"]
[]
[null,"OUTLET",{"$f":"Data!$C$8","v":"SBA"}]
[]
[null,"MONTH / YEAR",{"$f":"Data!$C$10","v":"July 2014"}]
[]
[null,"MENU"]
[]
[null,"DATE","DAY","ROW","TOTAL","OCCUPANCY OF ROOMS",null,null,null,null,"% OCCUPANCY OF ROOMS",null,null,null,"USAGE OF PARTY ROOMS",null,null,null,null,null,null,null,null,"CHART : % ROOM OCCUPANCY BY SESSION"]
[null,null,null,null,"ROOMS"]
[null,null,null,null,null,"SESSION",true,null,null,null,"SESSION",null,null,null,"ROOM","AVERAGE","AVERAGE","ROOM","AVERAGE","AVERAGE","ROOM","AVERAGE","AVERAGE"]
[null,null,null,null,null,"NOON K","HAPPY","NORMAL","MIDNIGHT","ALL","NOON K","HAPPY","NORMAL","MIDNIGHT","V1","PAX","SPENDING","V2","PAX","SPENDING","V3","PAX","SPENDING"]
[null,null,null,null,"( ROOMS )","( rooms )","( rooms )","( rooms )","( rooms )","( rooms )","( % )","( % )","( % )","( % )",null,"( pax )","( RM )",null,"( pax )","( RM )",null,"( pax )","( RM )"]
[null,"SUMMARY FOR MONTH",null,null,null,null,null,null,null,null,null,null,null,null,null,null,null,null,null,null,null,null,null,"LEGEND"]
[null,"TOTAL ROOM OCCUPANCY",null,null,null,{"$f":"IF($G$16=TRUE,SUM(F$31:F$61),\"\")","v":585},{"$f":"IF($G$16=TRUE,SUM(G$31:G$61),\"\")","v":715},1470,434,3204,null,null,null,null,{"$f":"SUM(O$31:O$61)","v":0},0,0,0,0,0,0,0,0]
{"$rows_left_out":42}
{"sheet":"Report C","index":4,"n_rows":61,"n_cols":15,"rows_kept":61,"cut":false,"hidden":false,"merged":[]}
[]
[]
[null,null,"MONTHLY SALES REPORTING BY OUTLET"]
[]
[]
[null,"SUBJECT","REPORT C : PAX BY CATEGORY AND AVERAGE PAX PER ROOM"]
[]
[null,"OUTLET",{"$f":"Data!$C$8","v":"SBA"}]
[]
[null,"MONTH / YEAR",{"$f":"Data!$C$10","v":"July 2014"}]
[]
[null,"MENU"]
[]
[null,"DATE","DAY","ROW","TOTAL PAX PER SESSION BY CATEGORY",null,null,null,null,"AVERAGE PAX PER ROOM BY ALL CATEGORY",null,null,null,null,{"$f":"\"CHART : PAX BY \"&$G$15&\" ( CATEGORY ) AND AVERAGE PAX PER ROOM\"","v":"CHART : PAX BY ALL ( CATEGORY ) AND AVERAGE PAX PER ROOM"}]
[null,null,null,null,"CHOOSE CATEGORY",null,"ALL"]
[null,null,null,null,"NOON K","HAPPY","NORMAL","MIDNIGHT","ALL","NOON K","HAPPY","NORMAL","MIDNIGHT","ALL"]
[null,null,null,null,"( pax )","( pax )","( pax )","( pax )","( pax )","( pax )","( pax )","( pax )","( pax )","( pax )"]
[null,"SUMMARY FOR MONTH",null,null,null,null,null,null,null,null,null,null,null,null,"LEGEND"]
[]
[null,"TOTAL PAX",null,null,{"$f":"SUM(E$31:E$61)","v":2092},{"$f":"SUM(F$31:F$61)","v":3099},5960,2223,13374,109.49284733540216,200.78859802192167,121.91157581970241,165.18873384269671,128.99101234536735]
{"$rows_left_out":42}
{"sheet":"Report D","index":5,"n_rows":59,"n_cols":11,"rows_kept":59,"cut":false,"hidden":false,"merged":[]}
[]
[]
[null,null,"MONTHLY SALES REPORTING BY OUTLET"]
[]
[]
[null,"SUBJECT","REPORT D : AVERAGE SALES PER ROOM AND AVERAGE SALES PER PAX"]
[]
[null,"OUTLET",{"$f":"Data!$C$8","v":"SBA"}]
[]
[null,"MONTH / YEAR",{"$f":"Data!$C$10","v":"July 2014"}]
[]
[null,"MENU"]
[]
[null,"DATE","DAY","ROW","AVERAGE SALES PER ROOM",null,null,"AVERAGE SALES PER PAX",null,null,"CHART : AVERAGE SALES PER ROOM AND AVERAGE SALES PER PAX"]
[null,null,null,null,"A.M.","P.M.","TOTAL","A.M.","P.M.","TOTAL"]
[]
[null,null,null,null,"( RM )","( RM )","( RM )","( RM )","( RM )","( RM )"]
[null,"SUMMARY FOR MONTH",null,null,null,null,null,null,null,null,"LEGEND"]
[null,"AVERAGE SALES",null,null,{"$f":"IFERROR(SUM(E$29:E$59)/COUNTIF($D$29:$D$59,\">0\"),\"\")","v":71.475232212417708},{"$f":"IFERROR(SUM(F$29:F$59)/COUNTIF($D$29:$D$59,\">0\"),\"\")","v":117.50239536833723},99.353351333404248,18.201893522156862,27.408311549027029,23.851088944276484]
[null,"HIGHEST SALES",null,null,{"$f":"IFERROR(IF(LARGE(E$29:E$59,1)>0,LARGE(E$29:E$59,1),\"NIL\"),\"NIL\")","v":142.71875},{"$f":"IFERROR(IF(LARGE(F$29:F$59,1)>0,LARGE(F$29:F$59,1),\"NIL\"),\"NIL\")","v":183.30131578947368},150.7188679245283,29.206153846153846,38.887853107344633,34.916734693877544]
{"$rows_left_out":40}
{"sheet":"Report E","index":6,"n_rows":60,"n_cols":29,"rows_kept":60,"cut":false,"hidden":false,"merged":[]}
[]
[]
[null,null,"MONTHLY SALES REPORTING BY OUTLET"]
[]
[]
[null,"SUBJECT","REPORT E : PERFORMANCE OF PROMOTIONAL SALES"]
[]
[null,"OUTLET",{"$f":"Data!$C$8","v":"SBA"}]
[]
[null,"MONTH / YEAR",{"$f":"Data!$C$10","v":"July 2014"}]
[]
[null,"MENU"]
[]
[null,"DATE","DAY","ROW","TYPE 01","TYPE 02","TYPE 03","TYPE 04","TYPE 05","TYPE 06","TYPE 07","TYPE 08","TYPE 09","TYPE 10","LIST 01","LIST 02","LIST 03","LIST 04","LIST 05","LIST 06","LIST 07","LIST 08","LIST 09","CHOOSE PROMOTION",null,"",null,null,{"$f":"\"CHART : PERFORMANCE OF \"&$Z$14","v":"CHART : PERFORMANCE OF "}]
[null,null,null,null,null,null,null,null,null,null,null,null,null,null,"TYPE 01","TYPE 03","TYPE 05","TYPE 07","TYPE 09","LIST 01","LIST 03","LIST 05","LIST 07"]
[null,null,null,null,null,null,null,null,null,null,null,null,null,null,"TYPE 02","TYPE 04","TYPE 06","TYPE 08","TYPE 10","LIST 02","LIST 04","LIST 06","LIST 08","NOON K","HAPPY","NORMAL","MIDNIGHT","ALL"]
[null,null,null,null,"AT","AY","BD","BI","BN","BS","BX","CC","CH","CM",null,null,null,null,null,null,null,null,null,"( item )","( item )","( item )","( item )","( item )"]
[null,"SUMMARY FOR MONTH",null,null,null,null,null,null,null,null,null,null,null,null,null,null,null,null,null,null,null,null,null,null,null,null,null,null,"LEGEND"]
[null,"TOTAL SALES",null,null,null,null,null,null,null,null,null,null,null,null,null,null,null,null,null,null,null,null,null,{"$f":"SUM(X$30:X$60)","v":0},{"$f":"SUM(Y$30:Y$60)","v":0},0,0,0]
[null,"AVERAGE SALES",null,null,null,null,null,null,null,null,null,null,null,null,null,null,null,null,null,null,null,null,null,{"$f":"IFERROR(SUM(X$30:X$60)/COUNTIF($D$30:$D$60,\">0\"),\"\")","v":0},{"$f":"IFERROR(SUM(Y$30:Y$60)/COUNTIF($D$30:$D$60,\">0\"),\"\")","v":0},0,0,0]
{"$rows_left_out":41}
{"sheet":"Report F","index":7,"n_rows":60,"n_cols":10,"rows_kept":60,"cut":false,"hidden":false,"merged":[]}
[]
[]
[null,null,"MONTHLY SALES REPORTING BY OUTLET"]
[]
[]
[null,"SUBJECT","REPORT F : PERFORMANCE OF F&B SALES AND MEMBERSHIP SUBSCRIPTIONS"]
[]
[null,"OUTLET",{"$f":"Data!$C$8","v":"SBA"}]
[]
[null,"MONTH / YEAR",{"$f":"Data!$C$10","v":"July 2014"}]
[]
[null,"MENU"]
[]
[null,"DATE","DAY","ROW","CHOOSE CATEGORY",null,"BEER EXCHANGE",null,null,{"$f":"\"CHART : SALES PERFORMANCE OF \"&$G$14","v":"CHART : SALES PERFORMANCE OF BEER EXCHANGE"}]
[]
[null,null,null,null,"NOON K","HAPPY","NORMAL","MIDNIGHT","ALL"]
[null,null,null,null,{"$f":"IF(OR($G$14=\"BEER EXCHANGE\",$G$14=\"BEER PACKAGE\",$G$14=\"BEER SIDE ORDER\",$G$14=\"LIQUOR PACKAGE\",$G$14=\"LIQUOR SIDE ORDER\",$G$14=\"WINE\"),\"( bottle )\",IF($G$14=\"MEAL\",\"( set )\",\"( subsription )\"))","v":"( bottle )"},{"$f":"$E$17","v":"( bottle )"},{"$f":"$E$17","v":"( bottle )"},"( bottle )","( bottle )"]
[null,"SUMMARY FOR MONTH",null,null,null,null,null,null,null,"LEGEND"]
[null,{"$f":"\"TOTAL \"&IF($G$14=\"MEMBERSHIP\",\"SUBSCRIPTIONS\",\"SALES\")","v":"TOTAL SALES"},null,null,{"$f":"SUM(E$30:E$60)","v":0},{"$f":"SUM(F$30:F$60)","v":0},0,0,0]
[null,{"$f":"\"AVERAGE \"&IF($G$14=\"MEMBERSHIP\",\"SUBSCRIPTIONS\",\"SALES\")","v":"AVERAGE SALES"},null,null,{"$f":"IFERROR(SUM(E$30:E$60)/COUNTIF($D$30:$D$60,\">0\"),\"\")","v":0},{"$f":"IFERROR(SUM(F$30:F$60)/COUNTIF($D$30:$D$60,\">0\"),\"\")","v":0},0,0,0]
{"$rows_left_out":41}
{"sheet":"Report G","index":8,"n_rows":59,"n_cols":33,"rows_kept":59,"cut":false,"hidden":false,"merged":[]}
[]
[]
[null,null,"MONTHLY SERVICE REPORTING BY OUTLET"]
[]
[]
[null,"SUBJECT","REPORT G : CUSTOMER SATISFACTION FROM FEEDBACK"]
[]
[null,"OUTLET",{"$f":"Data!$C$8","v":"SBA"}]
[]
[null,"MONTH / YEAR",{"$f":"Data!$C$10","v":"July 2014"}]
[]
[null,"MENU"]
[]
[null,"DATE","DAY","ROW","RATINGS FROM FEEDBACK FORMS",null,null,null,null,null,null,null,null,null,null,null,"QUESTIONAIRE FROM FEEDBACK FORMS",null,null,null,null,null,null,"OTHER VALUABLE COMMENTS FROM CUSTOMERS",null,null,null,null,null,null,null,null,"CHART G1 : MONTHLY % RATING FROM FEEDBACK FORMS"]
[null,null,null,null,"CHOOSE AREA OF RATING",null,null,null,null,null,"RECEPTION",null,null,null,null,null,"QUESTION 01",null,null,null,null,"QUESTION 02",null,null,null,null,null,null,null,null,null,null,"CHART G2 : MONTHLY % RESPONSE TO QUESTIONAIRE FROM FEEDBACK FORMS"]
[null,null,null,null,"TOTAL","EXCELLENT","GOOD","NORMAL","POOR","EXCELLENT","GOOD","NORMAL","POOR","TOTAL","YES","NO","YES","NO","TOTAL","YES","NO","YES","NO","TOTAL","J","L","LL","LLL","J","L","LL","LLL","CHART G3 : MONTHLY % ( UNSOLICITED ) COMMENTS FROM FEEDBACK FORMS"]
[null,null,null,null,"( rating )","( rating )","( rating )","( rating )","( rating )","( % )","( % )","( % )","( % )","( rating )","( rating )","( rating )","( % )","( % )","( rating )","( rating )","( rating )","( % )","( % )","( rating )","( rating )","( rating )","( rating )","( rating )","( % )","( % )","( % )","( % )"]
[null,"SUMMARY FOR MONTH"]
[null,"% RATING FOR MONTH",null,null,{"$f":"SUM(E$29:E$59)","v":0},{"$f":"SUM(F$29:F$59)","v":0},0,0,0,{"$f":"IFERROR($F19/$E19,\"\")","v":""},{"$f":"IFERROR($G19/$E19,\"\")","v":""},{"$f":"IFERROR($H19/$E19,\"\")","v":""},{"$f":"IFERROR($I19/$E19,\"\")","v":""},{"$f":"SUM(N$29:N$59)","v":0},{"$f":"SUM(O$29:O$59)","v":0},0,{"$f":"IFERROR($O19/$N19,\"\")","v":""},{"$f":"IFERROR($P19/$N19,\"\")","v":""},{"$f":"SUM(S$29:S$59)","v":0},{"$f":"SUM(T$29:T$59)","v":0},0,{"$f":"IFERROR($T19/$S19,\"\")","v":""},{"$f":"IFERROR($U19/$S19,\"\")","v":""},{"$f":"SUM(X$29:X$59)","v":0},{"$f":"SUM(Y$29:Y$59)","v":0},0,0,0,{"$f":"IFERROR($Y19/$X19,\"\")","v":""},{"$f":"IFERROR($Z19/$X19,\"\")","v":""},{"$f":"IFERROR($AA19/$X19,\"\")","v":""},{"$f":"IFERROR($AB19/$X19,\"\")","v":""},"CHART G1"]
[null,"HIGHEST % RATING",null,null,{"$f":"IFERROR(IF(LARGE(E$29:E$59,1)>0,LARGE(E$29:E$59,1),\"NIL\"),\"NIL\")","v":"NIL"},{"$f":"IFERROR(IF(LARGE(F$29:F$59,1)>0,LARGE(F$29:F$59,1),\"NIL\"),\"NIL\")","v":"NIL"},"NIL","NIL","NIL",{"$f":"IFERROR(IF(LARGE(J$29:J$59,1)>0,LARGE(J$29:J$59,1),\"NIL\"),\"NIL\")","v":"NIL"},"NIL","NIL","NIL",{"$f":"IFERROR(IF(LARGE(N$29:N$59,1)>0,LARGE(N$29:N$59,1),\"NIL\"),\"NIL\")","v":"NIL"},{"$f":"IFERROR(IF(LARGE(O$29:O$59,1)>0,LARGE(O$29:O$59,1),\"NIL\"),\"NIL\")","v":"NIL"},"NIL","NIL","NIL",{"$f":"IFERROR(IF(LARGE(S$29:S$59,1)>0,LARGE(S$29:S$59,1),\"NIL\"),\"NIL\")","v":"NIL"},{"$f":"IFERROR(IF(LARGE(T$29:T$59,1)>0,LARGE(T$29:T$59,1),\"NIL\"),\"NIL\")","v":"NIL"},"NIL","NIL","NIL",{"$f":"IFERROR(IF(LARGE(X$29:X$59,1)>0,LARGE(X$29:X$59,1),\"NIL\"),\"NIL\")","v":"NIL"},{"$f":"IFERROR(IF(LARGE(Y$29:Y$59,1)>0,LARGE(Y$29:Y$59,1),\"NIL\"),\"NIL\")","v":"NIL"},"NIL","NIL","NIL","NIL","NIL","NIL","NIL"]
{"$rows_left_out":39}