{"text_format":"1","workbook":"xlsx","n_sheets":9,"sheets":["Form","Data","Report A","Report B","Report C","Report D","Report E","Report F","Report G"],"not_rendered":{"charts":9,"images":13,"macros":1,"external_links":0,"defined_names":7,"comments":0,"pivot_tables":0},"unopened":[{"sheet":"Form","index":0,"reason":"not_a_worksheet"}],"bounds":{"document_bytes":16777216,"sheet_cells":100000,"rows_first":2000,"rows_last":500,"rows_between":2000,"halvings":0,"cell_chars":16384,"cell_head_chars":4096},"cells_cut":0,"cells_raw":0,"read":"whole","date_system":"1900"}

{"sheet":"Data","index":1,"n_rows":82,"n_cols":159,"rows_kept":82,"cut":false,"hidden":true,"merged":[]}
[]
[]
[null,null,"MONTHLY SALES REPORTING BY OUTLET"]
[]
[]
[null,"SUBJECT","DATABASE FOR MONTHLY OUTLET SALES REPORT"]
[]
[null,"OUTLET",{"$f":"MID(CELL(\"FILENAME\",$A$1),FIND(\"[\",CELL(\"FILENAME\",$A$1))+1,3)","v":"SBA"}]
[]
[null,"MONTH / YEAR",{"$f":"INDEX($D$14:$D$25,MONTH(DATE(MID(CELL(\"FILENAME\",$A$1),FIND(\"[\",CELL(\"FILENAME\",$A$1))+4,4),MID(CELL(\"FILENAME\",$A$1),FIND(\"[\",CELL(\"FILENAME\",$A$1))+8,2),1)),1)&\" \"&MID(CELL(\"FILENAME\",$A$1),FIND(\"[\",CELL(\"FILENAME\",$A$1))+4,4)","v":"July 2014"}]
[]
[null,"FILE NAME",{"$f":"MID(CELL(\"FILENAME\",$A$1),1,FIND(\"[\",CELL(\"FILENAME\",$A$1))-1)","v":"C:\\Users\\Lion\\Desktop\\Sales Report\\ROOM OCCUPANCY\\7 JULY 2014\\04SBA\\"}]
[null,null,null,null,null,null,null,null,null,null,null,null,null,null,null,null,null,null,null,null,null,"ROOM"]
[null,"LISTS",2,"January",null,"ALL",null,"BEER EXCHANGE",null,"RECEPTION"]
[null,null,{"$f":"INDEX($C$16:$C$25,$C$14,1)","v":"REPORT B"},"February",null,"NORMAL",null,"BEER PACKAGE",null,"MV / AUDIO"]
[null,null,"REPORT A","March",null,"CHILDREN",null,"BEER SIDE ORDER",null,"F&B"]
[null,null,"REPORT B","April",null,"LADIES",null,"LIQUOR PACKAGE",null,"OVERALL EXPERIENCE"]
[null,null,"REPORT C","May",null,"SENIOR CITIZEN",null,"LIQUOR SIDE ORDER"]
[null,null,"REPORT D","June",null,"STUDENT",null,"MEAL"]
[null,null,"REPORT E","July",null,null,null,"MEMBERSHIP"]
[null,null,"REPORT F","August",null,null,null,"WINE"]
[null,null,"REPORT G","September"]
[null,null,"DATA","October"]
[null,null,null,"November"]
[null,null,null,"December"]
[]
[null,"MENU"]
[]
[null,"DATE","DATE","PUBLIC","PUBLIC","SALES",null,null,null,"ROOMS USED",null,null,null,null,null,null,null,null,null,null,null,null,null,null,null,null,null,null,null,null,null,null,null,null,"PAX",null,null,null,null,null,null,null,null,null,null,"PROMOTION",null,null,null,null,null,null,null,null,null,null,null,null,null,null,null,null,null,null,null,null,null,null,null,null,null,null,null,null,null,null,null,null,null,null,null,null,null,null,null,null,null,null,null,null,null,null,null,null,null,"KITCHEN",null,null,null,"MEMBERSHIP",null,null,null,"BEER PACKAGE",null,null,null,"BEER EXCHANGE",null,null,null,"BEER BOTTLE",null,null,null,"BEER BUCKET",null,null,null,"BEER ROUND",null,null,null,"LIQUOR PACKAGE",null,null,null,"LIQUOR SIDE ORDER",null,null,null,"WINE PACKAGE",null,null,null,{"$f":"$J$14","v":"RECEPTION"},null,null,null,{"$f":"$J$15","v":"MV / AUDIO"},null,null,null,{"$f":"$J$16","v":"F&B"},null,null,null,{"$f":"$J$17","v":"OVERALL EXPERIENCE"},null,null,null,"QUESTION 01",null,"QUESTION 02",null,"COMPLIMENT / COMPLAINT"]
[null,null,null,"HOLIDAY","HOLIDAY","CASH A.M.","CARD A.M.","CASH P.M.","CARD P.M.","ROOMS","NOON K","HAPPY","NORMAL","MIDNIGHT","PARTY ROOMS","TIME","PAX","AMOUNT","PARTY ROOMS","TIME","PAX","AMOUNT","PARTY ROOMS","TIME","PAX","AMOUNT","PARTY ROOMS","TIME","PAX","AMOUNT","PARTY ROOMS","TIME","PAX","AMOUNT","NOON K","NOON K","HAPPY","HAPPY","HAPPY","HAPPY","NORMAL","NORMAL","MIDNIGHT","MIDNIGHT","MIDNIGHT","TYPE","NOON K","HAPPY","NORMAL","MIDNIGHT","TYPE","NOON K","HAPPY","NORMAL","MIDNIGHT","TYPE","NOON K","HAPPY","NORMAL","MIDNIGHT","TYPE","NOON K","HAPPY","NORMAL","MIDNIGHT","TYPE","NOON K","HAPPY","NORMAL","MIDNIGHT","TYPE","NOON K","HAPPY","NORMAL","MIDNIGHT","TYPE","NOON K","HAPPY","NORMAL","MIDNIGHT","TYPE","NOON K","HAPPY","NORMAL","MIDNIGHT","TYPE","NOON K","HAPPY","NORMAL","MIDNIGHT","TYPE","NOON K","HAPPY","NORMAL","MIDNIGHT","NOON K","HAPPY","NORMAL","MIDNIGHT","NOON K","HAPPY","NORMAL","MIDNIGHT","NOON K","HAPPY","NORMAL","MIDNIGHT","NOON K","HAPPY","NORMAL","MIDNIGHT","NOON K","HAPPY","NORMAL","MIDNIGHT","NOON K","HAPPY","NORMAL","MIDNIGHT","NOON K","HAPPY","NORMAL","MIDNIGHT","NOON K","HAPPY","NORMAL","MIDNIGHT","NOON K","HAPPY","NORMAL","MIDNIGHT","NOON K","HAPPY","NORMAL","MIDNIGHT","EXCELLENT","GOOD","NORMAL","POOR","EXCELLENT","GOOD","NORMAL","POOR","EXCELLENT","GOOD","NORMAL","POOR","EXCELLENT","GOOD","NORMAL","POOR","YES","NO","YES","NO","J","L","LL","LLL"]
[null,null,null,"EVE",null,null,null,null,null,null,null,null,null,null,null,null,null,null,null,null,null,null,null,null,null,null,null,null,null,null,null,null,null,null,"NORMAL","CHILDREN","NORMAL","CHILDREN","SENIOR","STUDENT","NORMAL","CHILDREN","NORMAL","CHILDREN","LADIES"]
[null,"CELL","C8","K6","K8","C102","D102","C103","D103","D106","C109","C110","C111","C112","E109","F109","G109","H109","E110","F110","G110","H110","E111","F111","G111","H111","E112","F112","G112","H112","E113","F113","G113","H113","C116","D116","C117","D117","F117","G117","C118","D118","C119","D119","E119","B192","D192","E192","F192","G192","B193","D193","E193","F193","G193","B194","D194","E194","F194","G194","B195","D195","E195","F195","G195","B196","D196","E196","F196","G196","B197","D197","E197","F197","G197","B198","D198","E198","F198","G198","B199","D199","E199","F199","G199","B200","D200","E200","F200","G200","B201","D201","E201","F201","G201","D208","E208","F208","G208","D212","E212","F212","G212","D226","E226","F226","G226","D227","E227","F227","G227","D228","E228","F228","G228","D229","E229","F229","G229","D230","E230","F230","G230","D234","E234","F234","G234","D235","E235","F235","G235","D239","E239","F239","G239","C418","D418","E418","F418","C419","D419","E419","F419","C420","D420","E420","F420","C421","D421","E421","F421","F427","G427","F428","G428","D446","E446","F446","G446"]
[null,{"$f":"IFERROR(DATE(MID(CELL(\"FILENAME\",$A$1),FIND(\"[\",CELL(\"FILENAME\",$A$1))+4,4),MID(CELL(\"FILENAME\",$A$1),FIND(\"[\",CELL(\"FILENAME\",$A$1))+8,2),MID($C33,1,2)),\"\")","v":"2014-07-01"},"01 July 2014 Tuesday",false,false,1374.6,245.7,4244.3999999999996,2666.4,38,8,19,43,11,0,0,0,0,0,0,0,0,0,0,0,0,0,0,0,0,0,0,0,0,24,0,57,0,0,39,182,0,42,0,23,"K-Lunch",22,0,0,0,"K-Dinner",0,0,38,0,"4BP",0,0,5,1,"Member 30%",0,4,47,2,"Tiger 2+1",0,0,0,0,"Heineken 3+1",0,0,0,0,"WC Ladies 30%",0,0,23,0,"2 Bkt Tiger Rm 88",0,0,7,0,"5pm-8pm RM 8",0,0,32,0,0,0,0,0,0,0,0,138,0,0,0,5,0,0,0,60,12,0,0,0,0,0,0,0,0,0,0,68,0,0,0,36,0,0,0,0,0,0,0,0,0,0,0,0,0,0,0,0,0,0,0,0,0,0,0,0,0,0,0,0,0,0,0,0,0,0,0,0,0]
[null,{"$f":"IFERROR(DATE(MID(CELL(\"FILENAME\",$A$1),FIND(\"[\",CELL(\"FILENAME\",$A$1))+4,4),MID(CELL(\"FILENAME\",$A$1),FIND(\"[\",CELL(\"FILENAME\",$A$1))+8,2),MID($C34,1,2)),\"\")","v":"2014-07-02"},"02 July 2014 Wednesday",false,false,1456.3,0,4454.3999999999996,1220.7,38,16,17,43,16,0,0,0,0,0,0,0,0,0,0,0,0,0,0,0,0,0,0,0,0,52,1,45,1,0,33,134,0,65,0,28,"K-Lunch",51,0,0,0,"K-Dinner",0,0,32,0,"4BP",0,0,0,0,"Member 30%",0,0,0,0,"Tiger 2+1",0,0,0,0,"Heineken 3+1",0,0,0,1,"WC Ladies 30%",0,0,37,0,"2 Bkt Tiger Rm 88",0,0,5,0,"5pm-8pm RM 8",0,0,11,0,0,0,0,0,0,0,0,136,0,0,0,0,0,0,0,0,0,0,0,0,0,0,0,4,0,0,0,68,0,0,0,12,0,0,0,0,0,0,0,0,0,0,0,0,0,0,0,0,0,0,0,0,0,0,0,0,0,0,0,0,0,0,0,0,0,0,0,0,0]
[null,{"$f":"IFERROR(DATE(MID(CELL(\"FILENAME\",$A$1),FIND(\"[\",CELL(\"FILENAME\",$A$1))+4,4),MID(CELL(\"FILENAME\",$A$1),FIND(\"[\",CELL(\"FILENAME\",$A$1))+8,2),MID($C35,1,2)),\"\")","v":"2014-07-03"},"03 July 2014 Thursday",false,false,1864.9,280.60000000000002,6742.2,1089.8,38,12,16,57,14,0,0,0,0,0,0,0,0,0,0,0,0,0,0,0,0,0,0,0,0,39,0,46,0,0,30,220,3,84,0,44,"K-Lunch",32,0,0,0,"K-Dinner",0,0,79,0,"4BP",0,0,2,1,"Member 30%",0,0,0,0,"Tiger 2+1",0,0,0,0,"Heineken 3+1",0,0,0,0,"WC Ladies 30%",0,0,45,0,"2 Bkt Tiger Rm 88",0,0,7,0,"5pm-8pm RM 8",0,0,18,0,0,0,0,0,0,0,0,185,0,0,0,2,0,0,0,24,12,0,0,0,0,0,0,3,0,0,0,76,0,0,0,12,0,0,0,0,0,0,0,0,0,0,0,0,0,0,0,0,0,0,0,0,0,0,0,0,0,0,0,0,0,0,0,0,0,0,0,0,0]
[null,"2014-07-04","04 July 2014 Friday",false,false,1613.3,432,7537.4,6393.5,38,10,20,66,10,0,0,0,0,0,0,0,0,0,0,0,0,0,0,0,0,0,0,0,0,37,0,61,0,0,46,333,0,39,0,0,"K-Lunch",37,0,0,0,"K-Dinner",0,0,129,0,"4BP",0,0,11,0,0,0,0,0,0,0,0,0,0,0,0,0,0,0,0,0,0,0,0,0,0,0,0,0,0,0,0,0,0,0,0,0,0,0,0,0,0,214,0,0,0,4,0,0,0,132,0,0,0,0,0,0,0,6,0,0,0,44,0,0,0,36,0,0,0,0,0,0,0,0,0,0,0,0,0,0,0,0,0,0,0,0,0,0,0,0,0,0,0,0,0,0,0,0,0,0,0,0,0]
[null,"2014-07-05","05 July 2014 Saturday",false,false,2614.6,728.3,9276.5,4489.8,38,22,19,51,25,0,0,0,0,0,0,0,0,0,0,0,0,0,0,0,0,0,0,0,0,66,0,70,0,0,0,244,4,106,0,0,"K-Lunch",62,0,0,0,"K-Dinner",0,0,34,0,"4BP",0,0,8,1,0,0,0,0,0,0,0,0,0,0,0,0,0,0,0,0,0,0,0,0,0,0,0,0,0,0,0,0,0,0,0,0,0,0,0,0,0,173,0,0,0,4,0,0,0,96,12,0,0,0,0,0,0,0,0,0,0,68,0,0,0,48,0,0,0,0,0,0,0,0,0,0,0,0,0,0,0,0,0,0,0,0,0,0,0,0,0,0,0,0,0,0,0,0,0,0,0,0,0]
[null,"2014-07-06","06 July 2014 Sunday",false,false,3851.8,715.2,4296.2,1429.6,38,31,1,38,12,0,0,0,0,0,0,0,0,0,0,0,0,0,0,0,0,0,0,0,0,108,5,72,0,0,0,143,3,49,0,22,"K-Lunch",103,0,0,0,"K-Dinner",0,0,36,0,"4BP",0,0,3,0,0,0,0,0,0,0,0,0,0,0,0,0,0,0,0,0,0,0,0,0,0,0,0,0,0,0,0,0,0,0,0,0,0,0,0,0,0,184,0,0,0,1,0,0,0,36,0,0,0,0,0,0,0,5,0,0,0,24,0,0,0,48,0,0,0,0,0,0,0,0,0,0,0,0,0,0,0,0,0,0,0,0,0,0,0,0,0,0,0,0,0,0,0,0,0,0,0,0,0]
[null,"2014-07-07","07 July 2014 Monday",false,false,1870.1,292,3306.5,1348.1,38,12,23,47,9,0,0,0,0,0,0,0,0,0,0,0,0,0,0,0,0,0,0,0,0,36,0,68,0,0,57,185,0,31,0,15,"K-Lunch",32,0,0,0,"K-Dinner",0,0,13,0,"4BP",0,0,3,0,"Member 30%",0,0,0,0,"Tiger 2+1",0,0,2,0,"WC Ladies 30%",0,0,42,0,"5PM-8PM Rm 4",0,0,59,0,"2 Bkt Tiger Rm 88",0,0,4,0,0,0,0,0,0,0,0,0,0,0,0,0,88,0,0,0,2,0,0,0,36,0,0,0,0,0,0,0,2,0,0,0,68,0,0,0,12,0,0,0,0,0,0,0,0,0,0,0,0,0,0,0,0,0,0,0,0,0,0,0,0,0,0,0,0,0,0,0,0,0,0,0,0,0]
[null,"2014-07-08","08 July 2014 Tuesday",false,false,1515,69.3,3089.7,457.2,38,14,16,44,3,0,0,0,0,0,0,0,0,0,0,0,0,0,0,0,0,0,0,0,0,46,1,29,1,1,16,165,0,16,0,6,"K-Lunch",45,0,0,0,"K-Dinner",0,0,14,0,"4BP",0,0,1,0,"Member 30%",0,0,38,0,"Tiger 2+1",0,0,0,0,"Heineken 3+1",0,0,0,0,"RM4 PROMO",0,0,63,0,"2 Bkt Tiger Rm 88",0,0,2,0,"WC COMBO",0,0,3,0,"WC 30%",0,0,30,0,0,0,120,0,0,0,2,0,0,0,12,0,0,0,0,0,0,0,1,0,0,0,40,0,0,0,12,0,0,0,0,0,0,0,0,0,0,0,0,0,0,0,0,0,0,0,0,0,0,0,0,0,0,0,0,0,0,0,0,0,0,0,0,0]
[null,"2014-07-09","09 July 2014 Wednesday",false,false,1466.5,140,3651.2,1025.5999999999999,38,13,16,50,8,0,0,0,0,0,0,0,0,0,0,0,0,0,0,0,0,0,0,0,0,41,0,33,0,0,25,166,0,43,0,27,"K-Lunch",38,0,0,0,"K-Dinner",0,0,29,0,"4BP",0,0,2,1,"Member 30%",0,0,0,0,"Tiger 2+1",0,0,0,0,"Heineken 3+1",0,0,2,0,"RM4 PROMO",0,0,42,0,"2 Bkt Tiger Rm 88",0,0,1,0,"WC COMBO",0,0,0,0,"WC 30%",0,0,37,0,0,0,107,0,0,0,1,0,0,0,24,12,0,0,0,0,0,0,2,0,0,0,44,0,0,0,12,0,0,0,0,0,0,0,0,0,0,0,0,0,0,0,0,0,0,0,0,0,0,0,0,0,0,0,0,0,0,0,0,0,0,0,0,0]
[null,"2014-07-10","10 July 2014 Thursday",false,false,1432.8,135,2992.5,467.5,38,11,14,44,17,0,0,0,0,0,0,0,0,0,0,0,0,0,0,0,0,0,0,0,0,39,0,36,0,0,24,131,0,59,0,32,"K-Lunch",35,0,0,0,"K-Dinner",0,0,20,0,"4BP",0,0,0,1,"Member 30%",0,0,0,0,"Tiger 2+1",0,0,0,0,"Heineken 3+1",0,0,0,0,"RM4 PROMO",0,0,47,0,"2 Bkt Tiger Rm 88",0,0,2,0,"WC COMBO",0,0,0,0,"WC 30%",0,0,30,0,0,0,93,0,0,1,1,0,0,0,0,12,0,0,0,0,0,0,4,0,0,0,20,0,0,0,0,0,0,0,0,0,0,0,0,0,0,0,0,0,0,0,0,0,0,0,0,0,0,0,0,0,0,0,0,0,0,0,0,0,0,0,0,0]
[null,"2014-07-11","11 July 2014 Friday",false,false,1722.7,1318.3,6455.1,4118.1000000000004,38,17,21,61,16,0,0,0,0,0,0,0,0,0,0,0,0,0,0,0,0,0,0,0,0,54,1,53,0,0,46,265,1,55,0,0,"K-Lunch",50,0,0,0,"K-Dinner",0,0,94,0,"4BP",0,0,7,4,"Member 30%",0,0,0,0,"Tiger 2+1",0,0,0,0,"Heineken 3+1",0,0,0,0,"RM4 PROMO",0,0,0,0,"2 Bkt Tiger Rm 88",0,0,0,0,"WC COMBO",0,0,0,0,"WC 30%",0,0,0,0,0,0,174,0,0,1,4,0,0,0,84,48,0,0,0,0,0,0,8,0,0,0,24,0,0,0,24,0,0,0,0,0,0,0,0,0,0,0,0,0,0,0,0,0,0,0,0,0,0,0,0,0,0,0,0,0,0,0,0,0,0,0,0,0]
[null,"2014-07-12","12 July 2014 Saturday",false,false,3206.4,590.4,7144.7,2659.1,38,18,22,64,11,0,0,0,0,0,0,0,0,0,0,0,0,0,0,0,0,0,0,0,0,58,0,71,1,0,0,260,0,48,0,0,"K-Lunch",57,0,0,0,"K-Dinner",0,0,72,0,"4BP",0,0,5,0,"Member 30%",0,0,0,0,"Tiger 2+1",0,0,0,0,"Heineken 3+1",0,0,0,0,"RM4 PROMO",0,0,0,0,"2 Bkt Tiger Rm 88",0,0,0,0,"WC COMBO",0,0,0,0,"WC 30%",0,0,0,0,0,0,146,0,0,2,1,0,0,0,60,0,0,0,0,0,0,0,1,0,0,0,28,0,0,0,0,0,0,0,0,0,0,0,0,0,0,0,0,0,0,0,0,0,0,0,0,0,0,0,0,0,0,0,0,0,0,0,0,0,0,0,0,0]
[null,"2014-07-13","13 July 2014 Sunday",false,false,2676.4,731.2,3396.1,592,38,14,26,32,12,0,0,0,0,0,0,0,0,0,0,0,0,0,0,0,0,0,0,0,0,45,1,83,1,0,0,98,0,42,0,21,"K-Lunch",41,0,0,0,"K-Dinner",0,0,32,0,"4BP",0,0,2,0,"Member 30%",0,0,0,0,"Tiger 2+1",0,0,0,0,"Heineken 3+1",0,0,0,0,"RM4 PROMO",0,0,0,0,"2 Bkt Tiger Rm 88",0,0,0,0,"WC COMBO",0,0,0,0,"WC 30%",0,0,0,0,0,0,103,0,3,0,1,0,0,0,24,0,0,0,0,0,0,0,2,0,0,0,16,0,0,0,12,0,0,0,0,0,0,0,0,0,0,0,0,0,0,0,0,0,0,0,0,0,0,0,0,0,0,0,0,0,0,0,0,0,0,0,0,0]
[null,"2014-07-14","14 July 2014 Monday",false,false,2992.2,128,8170,2913.1,38,14,26,63,16,0,0,0,0,0,0,0,0,0,0,0,0,0,0,0,0,0,0,0,0,60,1,81,0,0,55,271,0,46,0,0,"K-Lunch",57,0,0,0,"K-Dinner",0,0,69,0,"4BP",0,0,10,1,"Member 30%",0,0,0,0,"Tiger 2+1",0,0,0,0,"Heineken 3+1",0,0,0,0,"RM4 PROMO",0,0,0,0,"2 Bkt Tiger Rm 88",0,0,0,0,"WC COMBO",0,0,0,0,"WC 30%",0,0,0,0,0,0,185,0,0,2,0,0,0,0,120,12,0,0,0,0,0,0,7,0,0,0,20,0,0,0,24,0,0,0,0,0,0,0,0,0,0,0,0,0,0,0,0,0,0,0,0,0,0,0,0,0,0,0,0,0,0,0,0,0,0,0,0,0]
[null,"2014-07-15","15 July 2014 Tuesday",false,false,4748.8,608.4,3262.4,942.4,38,34,31,30,9,0,0,0,0,0,0,0,0,0,0,0,0,0,0,0,0,0,0,0,0,149,3,103,0,0,0,103,0,48,0,37,"K-Lunch",145,0,0,0,"K-Dinner",0,0,36,0,"4BP",0,0,0,0,"Member 30%",0,0,0,0,"Tiger 2+1",0,0,0,0,"Heineken 3+1",0,0,0,0,"RM4 PROMO",0,0,0,0,"2 Bkt Tiger Rm 88",0,0,0,0,"WC COMBO",0,0,0,0,"WC 30%",0,0,0,0,0,0,206,0,0,0,0,0,0,0,0,0,0,0,0,0,0,0,10,0,0,0,8,0,0,0,0,0,0,0,0,0,0,0,0,0,0,0,0,0,0,0,0,0,0,0,0,0,0,0,0,0,0,0,0,0,0,0,0,0,0,0,0,0]
[null,"2014-07-16","16 July 2014 Wednesday",false,false,1482.1,222,4792.5,249.6,38,11,29,27,17,0,0,0,0,0,0,0,0,0,0,0,0,0,0,0,0,0,0,0,0,45,0,64,0,0,50,100,1,68,0,36,"K-Lunch",43,0,0,0,"K-Dinner",0,0,26,0,"4BP",0,0,2,0,"Member 30%",0,0,0,0,"Tiger 2+1",0,0,0,0,"Heineken 3+1",0,0,1,0,0,0,0,0,0,0,0,0,0,0,0,0,0,0,0,0,0,0,0,0,0,0,126,0,0,0,0,0,0,0,24,0,0,0,0,0,0,0,0,0,0,0,36,0,0,0,24,0,0,0,0,0,0,0,0,0,0,0,0,0,0,0,0,0,0,0,0,0,0,0,0,0,0,0,0,0,0,0,0,0,0,0,0,0]
[null,"2014-07-17","17 July 2014 Thursday",false,false,1261.4000000000001,168,2714.2,1908.1,38,8,18,32,14,0,0,0,0,0,0,0,0,0,0,0,0,0,0,0,0,0,0,0,0,31,0,40,0,0,35,110,1,39,0,23,"K-Lunch",26,0,0,0,"K-Dinner",0,0,45,0,"4BP",0,0,4,0,"Member 30%",0,0,0,0,"Tiger 2+1",0,0,0,0,"Heineken 3+1",0,0,0,0,0,0,0,0,0,0,0,0,0,0,0,0,0,0,0,0,0,0,0,0,0,0,100,0,0,0,2,0,0,0,48,0,0,0,0,0,0,0,1,0,0,0,44,0,0,0,36,0,0,0,0,0,0,0,0,0,0,0,0,0,0,0,0,0,0,0,0,0,0,0,0,0,0,0,0,0,0,0,0,0,0,0,0,0]
[null,"2014-07-18","18 July 2014 Friday",false,false,1965.6,539,5703.6,3338.6,38,14,31,55,14,0,0,0,0,0,0,0,0,0,0,0,0,0,0,0,0,0,0,0,0,59,0,103,0,0,88,213,2,49,0,0,"K-Lunch",51,0,0,0,"K-Dinner",0,0,78,0,"4BP",0,0,0,0,"Member 30%",0,0,0,0,"Tiger 2+1",0,0,0,0,"Heineken 3+1",0,0,0,0,0,0,0,0,0,0,0,0,0,0,0,0,0,0,0,0,0,0,0,0,0,0,152,0,0,0,2,0,0,0,0,0,0,0,0,0,0,0,4,0,0,0,48,0,0,0,12,0,0,0,0,0,0,0,0,0,0,0,0,0,0,0,0,0,0,0,0,0,0,0,0,0,0,0,0,0,0,0,0,0,0,0,0,0]
[null,"2014-07-19","19 July 2014 Saturday",false,false,2871.2,894.4,7280.6,4572,38,14,29,60,24,0,0,0,0,0,0,0,0,0,0,0,0,0,0,0,0,0,0,0,0,39,0,98,0,0,0,259,1,89,2,0,"K-Lunch",39,0,0,0,"K-Dinner",0,0,40,0,"4BP",0,0,5,2,"Member 30%",0,0,0,0,"Tiger 2+1",0,0,0,0,"Heineken 3+1",0,0,0,0,"Opening Promo 60%",0,0,0,0,"2 Bkt Tiger Rm 88",0,0,0,0,0,0,0,0,0,0,0,0,0,0,0,0,152,0,0,0,6,0,0,0,60,24,0,0,0,0,0,0,4,0,0,0,20,0,0,0,0,0,0,0,0,0,0,0,0,0,0,0,0,0,0,0,0,0,0,0,0,0,0,0,0,0,0,0,0,0,0,0,0,0,0,0,0,0]
[null,"2014-07-20","20 July 2014 Sunday",false,false,2946.8,1219.5999999999999,3027.1,771.2,38,28,23,34,17,0,0,0,0,0,0,0,0,0,0,0,0,0,0,0,0,0,0,0,0,90,2,76,2,0,0,89,0,54,0,36,"K-Lunch",84,0,0,0,"K-Dinner",0,0,38,0,"4BP",1,0,2,0,"Member 30%",0,0,0,0,"Tiger 2+1",0,0,0,0,"Heineken 3+1",0,0,0,0,"Opening Promo 60%",0,0,0,0,"2 Bkt Tiger Rm 88",0,0,0,0,0,0,0,0,0,0,0,0,0,0,0,0,168,0,0,0,4,0,0,12,24,12,0,0,0,0,0,0,9,0,0,0,40,0,0,0,12,0,0,0,0,0,0,0,0,0,0,0,0,0,0,0,0,0,0,0,0,0,0,0,0,0,0,0,0,0,0,0,0,0,0,0,0,0]
[null,"2014-07-21","21 July 2014 Monday",false,false,1127.3,56,2779.2,148,38,16,12,23,12,0,0,0,0,0,0,0,0,0,0,0,0,0,0,0,0,0,0,0,0,50,0,30,0,3,15,65,1,42,0,25,"K-Lunch",46,0,0,0,"K-Dinner",0,0,20,0,"4BP",0,0,0,0,"Member 30%",0,0,0,0,"Tiger 2+1",0,0,4,0,"Heineken 3+1",0,0,0,0,0,0,0,0,0,0,0,0,0,0,0,0,0,0,0,0,0,0,0,0,0,0,86,0,0,0,0,0,0,0,0,0,0,0,0,0,0,0,2,0,0,0,4,0,0,0,48,0,0,0,0,0,0,0,0,0,0,0,0,0,0,0,0,0,0,0,0,0,0,0,0,0,0,0,0,0,0,0,0,0,0,0,0,0]
[null,"2014-07-22","22 July 2014 Tuesday",false,false,1208,630.20000000000005,4116.2,1185.7,38,15,15,39,13,0,0,0,0,0,0,0,0,0,0,0,0,0,0,0,0,0,0,0,0,61,0,57,0,0,43,144,0,51,0,27,"K-Lunch",51,0,0,0,"K-Dinner",0,0,26,0,"4BP",0,0,0,0,"Member 30%",0,0,59,0,"Tiger 2+1",0,0,0,0,"Heineken 3+1",0,0,0,0,0,0,0,0,0,0,0,0,0,0,0,0,0,0,0,0,0,0,0,0,0,0,94,0,0,0,0,0,0,0,24,0,0,0,0,0,0,0,4,0,0,0,24,0,0,0,24,0,0,0,0,0,0,0,0,0,0,0,0,0,0,0,0,0,0,0,0,0,0,0,0,0,0,0,0,0,0,0,0,0,0,0,0,0]
[null,"2014-07-23","23 July 2014 Wednesday",false,false,1747.7,246.2,2510.4,641.79999999999995,38,16,22,28,4,0,0,0,0,0,0,0,0,0,0,0,0,0,0,0,0,0,0,0,0,49,0,61,0,0,52,100,0,12,0,4,"K-Lunch",43,0,0,0,"K-Dinner",0,0,27,0,"4BP",0,0,0,0,"Member 30%",0,0,0,0,"Tiger 2+1",0,0,0,0,"Heineken 3+1",0,0,0,0,0,0,0,0,0,0,0,0,0,0,0,0,0,0,0,0,0,0,0,0,0,0,95,0,0,0,0,0,0,0,12,0,0,0,0,0,0,0,3,0,0,0,24,0,0,0,0,0,0,0,0,0,0,0,0,0,0,0,0,0,0,0,0,0,0,0,0,0,0,0,0,0,0,0,0,0,0,0,0,0,0,0,0,0]
[null,"2014-07-24","24 July 2014 Thursday",false,false,1821.6,336,4861.3999999999996,2052.6,38,17,24,45,19,0,0,0,0,0,0,0,0,0,0,0,0,0,0,0,0,0,0,0,0,63,0,64,0,0,51,183,2,63,0,33,"K-Lunch",62,0,0,0,"K-Dinner",0,0,73,0,"4BP",0,0,0,0,"Member 30%",0,0,0,0,"Tiger 2+1",0,0,0,0,"Heineken 3+1",0,0,0,0,0,0,0,0,0,0,0,0,0,0,0,0,0,0,0,0,0,0,0,0,0,0,155,0,0,0,3,0,0,0,24,12,0,0,0,0,0,0,2,0,0,0,40,0,0,0,24,0,0,0,0,0,0,0,0,0,0,0,0,0,0,0,0,0,0,0,0,0,0,0,0,0,0,0,0,0,0,0,0,0,0,0,0,0]
[null,"2014-07-25","25 July 2014 Friday",false,false,3794.1,1377.8,6772.1,6109.5,38,25,29,65,11,0,0,0,0,0,0,0,0,0,0,0,0,0,0,0,0,0,0,0,0,94,0,111,0,0,78,334,0,35,0,0,"K-Lunch",92,0,0,0,"K-Dinner",0,0,110,0,"4BP",0,1,9,2,"Member 30%",0,0,0,0,"Tiger 2+1",0,0,0,0,"Heineken 3+1",0,0,0,0,0,0,0,0,0,0,0,0,0,0,0,0,0,0,0,0,0,0,0,0,0,0,258,0,0,0,0,0,0,12,108,36,0,0,0,0,0,0,2,0,0,0,16,0,0,0,156,0,0,0,0,0,0,0,0,0,0,0,0,0,0,0,0,0,0,0,0,0,0,0,0,0,0,0,0,0,0,0,0,0,0,0,0,0]
[null,"2014-07-26","26 July 2014 Saturday",false,false,2684.6,1107.0999999999999,6979,5210.3999999999996,38,29,18,62,18,0,0,0,0,0,0,0,0,0,0,0,0,0,0,0,0,0,0,0,0,89,0,55,0,0,0,263,2,69,0,0,"K-Lunch",81,0,0,0,"K-Dinner",0,0,52,0,"4BP",0,0,11,1,"Member 30%",0,0,0,0,"Tiger 2+1",0,0,0,0,"Heineken 3+1",0,0,0,0,0,0,0,0,0,0,0,0,0,0,0,0,0,0,0,0,0,0,0,0,0,0,179,0,0,0,1,0,0,0,132,12,0,0,0,0,0,0,2,0,0,0,32,0,0,0,48,0,0,0,0,0,0,0,0,0,0,0,0,0,0,0,0,0,0,0,0,0,0,0,0,0,0,0,0,0,0,0,0,0,0,0,0,0]
[null,"2014-07-27","27 July 2014 Sunday",false,false,3316.4,1709.7,5589.3,5885.4,38,28,29,63,15,0,0,0,0,0,0,0,0,0,0,0,0,0,0,0,0,0,0,0,0,106,2,94,0,0,0,265,6,74,0,0,"K-Lunch",0,0,0,0,"K-Dinner",0,0,0,0,"4BP",0,0,0,0,"Member 30%",0,0,0,0,"Tiger 2+1",0,0,0,0,"Heineken 3+1",0,0,0,0,"Opening Promo 60%",0,0,0,0,"2 Bkt Tiger Rm 88",0,0,0,0,0,0,0,0,0,0,0,0,0,0,0,0,242,0,0,0,4,0,0,0,60,24,0,0,0,0,0,0,8,0,0,0,44,0,0,0,12,0,0,0,0,0,0,0,0,0,0,0,0,0,0,0,0,0,0,0,0,0,0,0,0,0,0,0,0,0,0,0,0,0,0,0,0,0]
[null,"2014-07-28","28 July 2014 Monday",false,false,5215.1000000000004,1438.4,7763.8,4327.6000000000004,38,30,41,64,22,0,0,0,0,0,0,0,0,0,0,0,0,0,0,0,0,0,0,0,0,122,3,127,1,0,0,300,6,72,1,0,"K-Lunch",117,0,0,0,"K-Dinner",0,0,77,0,"4BP",0,0,8,1,"Member 30%",0,0,0,0,"Tiger 2+1",0,0,0,0,"Heineken 3+1",0,0,0,0,0,0,0,0,0,0,0,0,0,0,0,0,0,0,0,0,0,0,0,0,0,0,268,0,0,0,2,0,0,0,96,12,0,0,0,0,0,0,0,0,0,0,20,0,0,0,36,0,0,0,0,0,0,0,0,0,0,0,0,0,0,0,0,0,0,0,0,0,0,0,0,0,0,0,0,0,0,0,0,0,0,0,0,0]
[null,"2014-07-29","29 July 2014 Tuesday",false,false,4823.7,1563.5,5708.3,1143.2,38,33,38,45,13,0,0,0,0,0,0,0,0,0,0,0,0,0,0,0,0,0,0,0,0,131,1,119,0,0,0,181,2,53,2,24,"K-Lunch",130,0,0,0,"K-Dinner",0,0,64,0,"4BP",0,0,2,1,"Member 30%",0,0,0,0,"Tiger 2+1",0,0,0,0,"Heineken 3+1",0,0,0,0,0,0,0,0,0,0,0,0,0,0,0,0,0,0,0,0,0,0,0,0,0,0,259,0,0,0,1,0,0,0,24,12,0,0,0,0,0,0,0,0,0,0,20,0,0,0,48,0,0,0,0,0,0,0,0,0,0,0,0,0,0,0,0,0,0,0,0,0,0,0,0,0,0,0,0,0,0,0,0,0,0,0,0,0]
[null,"2014-07-30","30 July 2014 Wednesday",false,false,2695.4,365.2,4810.8999999999996,2732,38,30,37,45,18,0,0,0,0,0,0,0,0,0,0,0,0,0,0,0,0,0,0,0,0,94,0,85,0,0,59,190,8,77,0,43,"K-Lunch",83,0,0,0,"K-Dinner",0,0,64,0,"4BP",0,0,1,0,"Member 30%",0,0,0,0,"Tiger 2+1",0,0,0,0,"Heineken 3+1",0,0,8,0,0,0,0,0,0,0,0,0,0,0,0,0,0,0,0,0,0,0,0,0,0,0,184,0,0,0,1,0,0,0,12,0,0,0,0,0,0,0,1,0,0,0,156,0,0,0,0,0,0,0,0,0,0,0,0,0,0,0,0,0,0,0,0,0,0,0,0,0,0,0,0,0,0,0,0,0,0,0,0,0,0,0,0,0]
[null,"2014-07-31","31 July 2014 Thursday",false,false,3488.8,233.1,4808.3,3202.2,38,25,33,50,14,0,0,0,0,0,0,0,0,0,0,0,0,0,0,0,0,0,0,0,0,94,0,102,2,0,50,217,4,64,0,28,"K-Lunch",91,0,0,0,"K-Dinner",0,0,81,0,"4BP",0,0,3,1,"Member 30%",0,0,0,0,"Tiger 2+1",0,0,0,0,"Heineken 3+1",0,0,0,0,"Opening Promo 60%",0,0,0,0,"2 Bkt Tiger Rm 88",0,0,0,0,0,0,0,0,0,0,0,0,0,0,0,0,240,0,1,0,1,0,0,0,36,12,0,0,0,0,0,0,2,0,0,0,28,0,0,0,48,0,0,0,0,0,0,0,0,0,0,0,0,0,0,0,0,0,0,0,0,0,0,0,0,0,0,0,0,0,0,0,0,0,0,0,0,0]
[null,""]
[null,""]
[null,""]
[null,""]
[null,""]
[null,""]
[null,""]
[null,""]
[null,""]
[null,""]
[null,""]
[null,""]
[null,""]
[null,""]
[null,""]
[null,""]
[null,""]
[null,""]
[null,""]

{"sheet":"Report A","index":2,"n_rows":62,"n_cols":17,"rows_kept":62,"cut":false,"hidden":false,"merged":[]}
[]
[]
[null,null,"MONTHLY SALES REPORTING BY OUTLET"]
[]
[]
[null,"SUBJECT","REPORT A : SALES PERFORMANCE FOR THE MONTH"]
[]
[null,"OUTLET",{"$f":"Data!$C$8","v":"SBA"}]
[]
[null,"MONTH / YEAR",{"$f":"Data!$C$10","v":"July 2014"}]
[]
[null,"MENU"]
[]
[null,"DATE","DAY","ROW",{"$f":"\"SALES FOR \"&IF(MATCH(MID($C$10,1,FIND(\" \",$C$10,1)-1),Data!$D$14:$D$25,0)=1,\"December \"&MID($C$10,FIND(\" \",$C$10,1)+1,4)-1,INDEX(Data!$D$14:$D$25,MATCH(MID($C$10,1,FIND(\" \",$C$10,1)-1),Data!$D$14:$D$25,0)-1,1)&\" \"&MID($C$10,FIND(\" \",$C$10,1)+1,4))","v":"SALES FOR June 2014"},null,null,{"$f":"\"SALES FOR \"&C10","v":"SALES FOR July 2014"},null,null,{"$f":"\"SALES FOR \"&MID(C10,1,FIND(\" \",C10,1)-1)&\" \"&MID($C$10,FIND(\" \",$C$10,1)+1,4)-1","v":"SALES FOR July 2013"},null,null,"COMPARISON OF SALES",null,null,"CHART : COMPARISON OF SALES PERFORMANCE"]
[null,null,null,null,{"$f":"IF(MID(CELL(\"FILENAME\",$A$1),FIND(\"[\",CELL(\"FILENAME\",$A$1))+8,2)=\"01\",MID(CELL(\"FILENAME\",$A$1),1,FIND(\"Y\",CELL(\"FILENAME\",$A$1))-1)&\"YR\"&MID(CELL(\"FILENAME\",$A$1),FIND(\"[\",CELL(\"FILENAME\",$A$1))+4,4)-1&\"\\December\\\"&$C$8&\"\\\",MID(CELL(\"FILENAME\",$A$1),1,FIND(\"Y\",CELL(\"FILENAME\",$A$1))-1)&\"YR\"&MID(CELL(\"FILENAME\",$A$1),FIND(\"[\",CELL(\"FILENAME\",$A$1))+4,4)&\"\\\"&INDEX(Data!$D$14:$D$25,MATCH(MID($C$10,1,FIND(\" \",$C$10,1)-1),Data!$D$14:$D$25,0)-1,1)&\"\\\"&$C$8&\"\\\")","v":"C:\\Users\\Lion\\Desktop\\Sales Report\\ROOM OCCUPANCYR2014\\June\\SBA\\"},null,null,null,null,null,{"$f":"MID(CELL(\"FILENAME\",$A$1),1,FIND(\"R\",CELL(\"FILENAME\",$A$1),1))&MID($C$10,FIND(\" \",$C$10,1)+1,4)-1&\"\\\"&MID($C$10,1,FIND(\" \",$C$10)-1)&\"\\\"&C8&\"\\\"","v":"C:\\Users\\Lion\\Desktop\\Sales R2013\\July\\SBA\\"}]
[null,null,null,null,{"$f":"IF(MID(CELL(\"FILENAME\",$A$1),FIND(\"[\",CELL(\"FILENAME\",$A$1))+8,2)=\"01\",$C$8&MID(CELL(\"FILENAME\",$A$1),FIND(\"[\",CELL(\"FILENAME\",$A$1))+4,4)-1&12&\"Sales.xlsm\",$C$8&MID(CELL(\"FILENAME\",$A$1),FIND(\"[\",CELL(\"FILENAME\",$A$1))+4,4)&TEXT(MATCH(MID($C$10,1,FIND(\" \",$C$10,1)-1),Data!$D$14:$D$25,0)-1,\"00\")&\"Sales.xlsm\")","v":"SBA201406Sales.xlsm"},null,null,null,null,null,{"$f":"$C$8&MID($C$10,FIND(\" \",$C$10,1)+1,4)-1&TEXT(MATCH(MID($C$10,1,FIND(\" \",$C$10,1)-1),Data!$D$14:$D$25,0),\"00\")&\"Sales.xlsm\"","v":"SBA201307Sales.xlsm"}]
[null,null,null,null,"A.M.","P.M.","TOTAL","A.M.","P.M.","TOTAL","A.M.","P.M.","TOTAL","LAST MONTH","THIS MONTH","LAST YEAR","SELECT TO VIEW"]
[null,null,null,null,null,null,null,null,null,null,null,null,null,{"$f":"IF($N$20=TRUE,\"A.M.\",IF($O$20=TRUE,\"P.M.\",\"TOTAL\"))","v":"TOTAL"},{"$f":"$N$18","v":"TOTAL"},{"$f":"$N$18","v":"TOTAL"}]
[null,null,null,null,"( RM )","( RM )","( RM )","( RM )","( RM )","( RM )","( RM )","( RM )","( RM )","( RM )","( RM )","( RM )"]
[null,"SUMMARY FOR MONTH",null,null,null,null,null,null,null,null,null,null,null,false,false,true,"LEGEND"]
[null,"TOTAL SALES",null,null,{"$f":"SUM(E$32:E$62)","v":0},{"$f":"SUM(F$32:F$62)","v":0},{"$f":"SUM(G$32:G$62)","v":0},{"$f":"SUM(H$32:H$62)","v":95376.799999999988},{"$f":"SUM(I$32:I$62)","v":233527.00000000003},328903.8000000001,0,0,0]
[null,"AVERAGE SALES",null,null,{"$f":"IFERROR(SUM(E$32:E$62)/COUNTIF($D$32:$D$62,\">0\"),\"\")","v":0},{"$f":"IFERROR(SUM(F$32:F$62)/COUNTIF($D$32:$D$62,\">0\"),\"\")","v":0},{"$f":"IFERROR(SUM(G$32:G$62)/COUNTIF($D$32:$D$62,\">0\"),\"\")","v":0},{"$f":"IFERROR(SUM(H$32:H$62)/COUNTIF($D$32:$D$62,\">0\"),\"\")","v":3076.6709677419353},7533.1290322580653,10609.800000000003,0,0,0]
[null,"HIGHEST SALES",null,null,{"$f":"IFERROR(IF(LARGE(E$32:E$62,1)>0,LARGE(E$32:E$62,1),\"NIL\"),\"NIL\")","v":"NIL"},"NIL","NIL",6653.5,13930.9,18744.900000000001,"NIL","NIL","NIL"]
[null,"LOWEST SALES",null,null,{"$f":"IFERROR(IF(LARGE(E$32:E$62,COUNTIF(E$32:E$62,\">0\"))<>E$23,LARGE(E$32:E$62,COUNTIF(E$32:E$62,\">0\")),\"NIL\"),\"NIL\")","v":"NIL"},"NIL","NIL",1183.3,2927.2,4110.5,"NIL","NIL","NIL"]
[null,"AVERAGE FOR ","MONDAY",null,null,null,null,{"$f":"IFERROR(SUMIF($C$32:$C$62,\"Monday*\",H$32:H$62)/COUNTIF($C$32:$C$62,\"Monday*\"),\"\")","v":3279.7749999999996},7689.0750000000007,10968.85]
[null,null,"TUESDAY",null,null,null,null,{"$f":"IFERROR(SUMIF($C$32:$C$62,\"Tuesday*\",H$32:H$62)/COUNTIF($C$32:$C$62,\"Tuesday*\"),\"\")","v":3357.44},5363.18,8720.619999999999]
[null,null,"WEDNESDAY",null,null,null,null,{"$f":"IFERROR(SUMIF($C$32:$C$62,\"Wednesday*\",H$32:H$62)/COUNTIF($C$32:$C$62,\"Wednesday*\"),\"\")","v":1964.28},5217.82,7182.1]
[null,null,"THURSDAY",null,null,null,null,{"$f":"IFERROR(SUMIF($C$32:$C$62,\"Thursday*\",H$32:H$62)/COUNTIF($C$32:$C$62,\"Thursday*\"),\"\")","v":2204.44},6167.76,8372.2000000000007]
[null,null,"FRIDAY",null,null,null,null,{"$f":"IFERROR(SUMIF($C$32:$C$62,\"Friday*\",H$32:H$62)/COUNTIF($C$32:$C$62,\"Friday*\"),\"\")","v":3190.7},11606.975,14797.675000000001]
[null,null,"SATURDAY",null,null,null,null,{"$f":"IFERROR(SUMIF($C$32:$C$62,\"Saturday*\",H$32:H$62)/COUNTIF($C$32:$C$62,\"Saturday*\"),\"\")","v":3674.25},11903.025,15577.275]
[null,null,"SUNDAY",{"$f":"COUNTIF(D32:D62,\">0\")","v":31},null,null,null,{"$f":"IFERROR(SUMIF($C$32:$C$62,\"Sunday*\",H$32:H$62)/COUNTIF($C$32:$C$62,\"Sunday*\"),\"\")","v":4291.7749999999996},6246.7250000000004,10538.5]
[null,{"$f":"IFERROR(DATE(MID(CELL(\"FILENAME\",$A$1),FIND(\"[\",CELL(\"FILENAME\",$A$1))+4,4),MID(CELL(\"FILENAME\",$A$1),FIND(\"[\",CELL(\"FILENAME\",$A$1))+8,2),1),\"\")","v":"2014-07-01"},{"$f":"IFERROR(IF($B32=\"\",\"\",IF(AND($B32<>\"\",INDEX(Data!$D$33:$D$82,MATCH($B32,Data!$B$33:$B$82,0),1)=TRUE),TEXT($B32,\"DDDD\")&\" +\",IF(AND($B32<>\"\",INDEX(Data!$E$33:$E$82,MATCH($B32,Data!$B$33:$B$82,0),1)=TRUE),TEXT($B32,\"DDDD\")&\" ++\",TEXT($B32,\"DDDD\")))),TEXT($B32,\"DDDD\"))","v":"Tuesday"},{"$f":"IFERROR(MATCH($B32,Data!$B$33:$B$82,0),\"\")","v":1},null,null,{"$f":"IFERROR($E32+$F32,\"\")","v":0},{"$f":"IFERROR(INDEX(Data!$F$33:$F$82,$D32,1)+INDEX(Data!$G$33:$G$82,$D32,1),\"\")","v":1620.3},{"$f":"IFERROR(INDEX(Data!$H$33:$H$82,$D32,1)+INDEX(Data!$I$33:$I$82,$D32,1),\"\")","v":6910.7999999999993},{"$f":"IFERROR($H32+$I32,\"\")","v":8531.0999999999985},null,null,{"$f":"IFERROR($K32+$L32,\"\")","v":0},{"$f":"IFERROR(IF(N$18=\"A.M.\",$E32,IF(N$18=\"P.M.\",$F32,$G32)),\"\")","v":0},{"$f":"IFERROR(IF(O$18=\"A.M.\",$H32,IF(O$18=\"P.M.\",$I32,$J32)),\"\")","v":8531.0999999999985},{"$f":"IFERROR(IF(P$18=\"A.M.\",$K32,IF(P$18=\"P.M.\",$L32,$M32)),\"\")","v":0}]
[null,{"$f":"IFERROR(IF(AND(MONTH($B32+1)=MONTH($B$32),YEAR($B32+1)=YEAR($B$32)),$B32+1,\"\"),\"\")","v":"2014-07-02"},{"$f":"IFERROR(IF($B33=\"\",\"\",IF(AND($B33<>\"\",INDEX(Data!$D$33:$D$82,MATCH($B33,Data!$B$33:$B$82,0),1)=TRUE),TEXT($B33,\"DDDD\")&\" +\",IF(AND($B33<>\"\",INDEX(Data!$E$33:$E$82,MATCH($B33,Data!$B$33:$B$82,0),1)=TRUE),TEXT($B33,\"DDDD\")&\" ++\",TEXT($B33,\"DDDD\")))),TEXT($B33,\"DDDD\"))","v":"Wednesday"},{"$f":"IFERROR(MATCH($B33,Data!$B$33:$B$82,0),\"\")","v":2},null,null,0,{"$f":"IFERROR(INDEX(Data!$F$33:$F$82,$D33,1)+INDEX(Data!$G$33:$G$82,$D33,1),\"\")","v":1456.3},{"$f":"IFERROR(INDEX(Data!$H$33:$H$82,$D33,1)+INDEX(Data!$I$33:$I$82,$D33,1),\"\")","v":5675.0999999999995},{"$f":"IFERROR($H33+$I33,\"\")","v":7131.4},null,null,{"$f":"IFERROR($K33+$L33,\"\")","v":0},{"$f":"IFERROR(IF(N$18=\"A.M.\",$E33,IF(N$18=\"P.M.\",$F33,$G33)),\"\")","v":0},{"$f":"IFERROR(IF(O$18=\"A.M.\",$H33,IF(O$18=\"P.M.\",$I33,$J33)),\"\")","v":7131.4},{"$f":"IFERROR(IF(P$18=\"A.M.\",$K33,IF(P$18=\"P.M.\",$L33,$M33)),\"\")","v":0}]
[null,"2014-07-03",{"$f":"IFERROR(IF($B34=\"\",\"\",IF(AND($B34<>\"\",INDEX(Data!$D$33:$D$82,MATCH($B34,Data!$B$33:$B$82,0),1)=TRUE),TEXT($B34,\"DDDD\")&\" +\",IF(AND($B34<>\"\",INDEX(Data!$E$33:$E$82,MATCH($B34,Data!$B$33:$B$82,0),1)=TRUE),TEXT($B34,\"DDDD\")&\" ++\",TEXT($B34,\"DDDD\")))),TEXT($B34,\"DDDD\"))","v":"Thursday"},{"$f":"IFERROR(MATCH($B34,Data!$B$33:$B$82,0),\"\")","v":3},null,null,0,{"$f":"IFERROR(INDEX(Data!$F$33:$F$82,$D34,1)+INDEX(Data!$G$33:$G$82,$D34,1),\"\")","v":2145.5},{"$f":"IFERROR(INDEX(Data!$H$33:$H$82,$D34,1)+INDEX(Data!$I$33:$I$82,$D34,1),\"\")","v":7832},9977.5,null,null,0,0,9977.5,{"$f":"IFERROR(IF(P$18=\"A.M.\",$K34,IF(P$18=\"P.M.\",$L34,$M34)),\"\")","v":0}]
[null,"2014-07-04",{"$f":"IFERROR(IF($B35=\"\",\"\",IF(AND($B35<>\"\",INDEX(Data!$D$33:$D$82,MATCH($B35,Data!$B$33:$B$82,0),1)=TRUE),TEXT($B35,\"DDDD\")&\" +\",IF(AND($B35<>\"\",INDEX(Data!$E$33:$E$82,MATCH($B35,Data!$B$33:$B$82,0),1)=TRUE),TEXT($B35,\"DDDD\")&\" ++\",TEXT($B35,\"DDDD\")))),TEXT($B35,\"DDDD\"))","v":"Friday"},{"$f":"IFERROR(MATCH($B35,Data!$B$33:$B$82,0),\"\")","v":4},null,null,0,{"$f":"IFERROR(INDEX(Data!$F$33:$F$82,$D35,1)+INDEX(Data!$G$33:$G$82,$D35,1),\"\")","v":2045.3},{"$f":"IFERROR(INDEX(Data!$H$33:$H$82,$D35,1)+INDEX(Data!$I$33:$I$82,$D35,1),\"\")","v":13930.9},15976.199999999999,null,null,0,0,15976.199999999999,0]
[null,"2014-07-05",{"$f":"IFERROR(IF($B36=\"\",\"\",IF(AND($B36<>\"\",INDEX(Data!$D$33:$D$82,MATCH($B36,Data!$B$33:$B$82,0),1)=TRUE),TEXT($B36,\"DDDD\")&\" +\",IF(AND($B36<>\"\",INDEX(Data!$E$33:$E$82,MATCH($B36,Data!$B$33:$B$82,0),1)=TRUE),TEXT($B36,\"DDDD\")&\" ++\",TEXT($B36,\"DDDD\")))),TEXT($B36,\"DDDD\"))","v":"Saturday"},{"$f":"IFERROR(MATCH($B36,Data!$B$33:$B$82,0),\"\")","v":5},null,null,0,{"$f":"IFERROR(INDEX(Data!$F$33:$F$82,$D36,1)+INDEX(Data!$G$33:$G$82,$D36,1),\"\")","v":3342.8999999999996},{"$f":"IFERROR(INDEX(Data!$H$33:$H$82,$D36,1)+INDEX(Data!$I$33:$I$82,$D36,1),\"\")","v":13766.3},17109.199999999997,null,null,0,0,17109.199999999997,0]
[null,"2014-07-06",{"$f":"IFERROR(IF($B37=\"\",\"\",IF(AND($B37<>\"\",INDEX(Data!$D$33:$D$82,MATCH($B37,Data!$B$33:$B$82,0),1)=TRUE),TEXT($B37,\"DDDD\")&\" +\",IF(AND($B37<>\"\",INDEX(Data!$E$33:$E$82,MATCH($B37,Data!$B$33:$B$82,0),1)=TRUE),TEXT($B37,\"DDDD\")&\" ++\",TEXT($B37,\"DDDD\")))),TEXT($B37,\"DDDD\"))","v":"Sunday"},{"$f":"IFERROR(MATCH($B37,Data!$B$33:$B$82,0),\"\")","v":6},null,null,0,{"$f":"IFERROR(INDEX(Data!$F$33:$F$82,$D37,1)+INDEX(Data!$G$33:$G$82,$D37,1),\"\")","v":4567},{"$f":"IFERROR(INDEX(Data!$H$33:$H$82,$D37,1)+INDEX(Data!$I$33:$I$82,$D37,1),\"\")","v":5725.7999999999993},10292.799999999999,null,null,0,0,10292.799999999999,0]
[null,"2014-07-07",{"$f":"IFERROR(IF($B38=\"\",\"\",IF(AND($B38<>\"\",INDEX(Data!$D$33:$D$82,MATCH($B38,Data!$B$33:$B$82,0),1)=TRUE),TEXT($B38,\"DDDD\")&\" +\",IF(AND($B38<>\"\",INDEX(Data!$E$33:$E$82,MATCH($B38,Data!$B$33:$B$82,0),1)=TRUE),TEXT($B38,\"DDDD\")&\" ++\",TEXT($B38,\"DDDD\")))),TEXT($B38,\"DDDD\"))","v":"Monday"},{"$f":"IFERROR(MATCH($B38,Data!$B$33:$B$82,0),\"\")","v":7},null,null,0,{"$f":"IFERROR(INDEX(Data!$F$33:$F$82,$D38,1)+INDEX(Data!$G$33:$G$82,$D38,1),\"\")","v":2162.1},{"$f":"IFERROR(INDEX(Data!$H$33:$H$82,$D38,1)+INDEX(Data!$I$33:$I$82,$D38,1),\"\")","v":4654.6000000000004},6816.7000000000007,null,null,0,0,6816.7000000000007,0]
[null,"2014-07-08",{"$f":"IFERROR(IF($B39=\"\",\"\",IF(AND($B39<>\"\",INDEX(Data!$D$33:$D$82,MATCH($B39,Data!$B$33:$B$82,0),1)=TRUE),TEXT($B39,\"DDDD\")&\" +\",IF(AND($B39<>\"\",INDEX(Data!$E$33:$E$82,MATCH($B39,Data!$B$33:$B$82,0),1)=TRUE),TEXT($B39,\"DDDD\")&\" ++\",TEXT($B39,\"DDDD\")))),TEXT($B39,\"DDDD\"))","v":"Tuesday"},{"$f":"IFERROR(MATCH($B39,Data!$B$33:$B$82,0),\"\")","v":8},null,null,0,{"$f":"IFERROR(INDEX(Data!$F$33:$F$82,$D39,1)+INDEX(Data!$G$33:$G$82,$D39,1),\"\")","v":1584.3},{"$f":"IFERROR(INDEX(Data!$H$33:$H$82,$D39,1)+INDEX(Data!$I$33:$I$82,$D39,1),\"\")","v":3546.8999999999996},5131.2,null,null,0,0,5131.2,0]
[null,"2014-07-09",{"$f":"IFERROR(IF($B40=\"\",\"\",IF(AND($B40<>\"\",INDEX(Data!$D$33:$D$82,MATCH($B40,Data!$B$33:$B$82,0),1)=TRUE),TEXT($B40,\"DDDD\")&\" +\",IF(AND($B40<>\"\",INDEX(Data!$E$33:$E$82,MATCH($B40,Data!$B$33:$B$82,0),1)=TRUE),TEXT($B40,\"DDDD\")&\" ++\",TEXT($B40,\"DDDD\")))),TEXT($B40,\"DDDD\"))","v":"Wednesday"},{"$f":"IFERROR(MATCH($B40,Data!$B$33:$B$82,0),\"\")","v":9},null,null,0,{"$f":"IFERROR(INDEX(Data!$F$33:$F$82,$D40,1)+INDEX(Data!$G$33:$G$82,$D40,1),\"\")","v":1606.5},{"$f":"IFERROR(INDEX(Data!$H$33:$H$82,$D40,1)+INDEX(Data!$I$33:$I$82,$D40,1),\"\")","v":4676.7999999999993},6283.2999999999993,null,null,0,0,6283.2999999999993,0]
[null,"2014-07-10",{"$f":"IFERROR(IF($B41=\"\",\"\",IF(AND($B41<>\"\",INDEX(Data!$D$33:$D$82,MATCH($B41,Data!$B$33:$B$82,0),1)=TRUE),TEXT($B41,\"DDDD\")&\" +\",IF(AND($B41<>\"\",INDEX(Data!$E$33:$E$82,MATCH($B41,Data!$B$33:$B$82,0),1)=TRUE),TEXT($B41,\"DDDD\")&\" ++\",TEXT($B41,\"DDDD\")))),TEXT($B41,\"DDDD\"))","v":"Thursday"},{"$f":"IFERROR(MATCH($B41,Data!$B$33:$B$82,0),\"\")","v":10},null,null,0,{"$f":"IFERROR(INDEX(Data!$F$33:$F$82,$D41,1)+INDEX(Data!$G$33:$G$82,$D41,1),\"\")","v":1567.8},{"$f":"IFERROR(INDEX(Data!$H$33:$H$82,$D41,1)+INDEX(Data!$I$33:$I$82,$D41,1),\"\")","v":3460},5027.8,null,null,0,0,5027.8,0]
[null,"2014-07-11",{"$f":"IFERROR(IF($B42=\"\",\"\",IF(AND($B42<>\"\",INDEX(Data!$D$33:$D$82,MATCH($B42,Data!$B$33:$B$82,0),1)=TRUE),TEXT($B42,\"DDDD\")&\" +\",IF(AND($B42<>\"\",INDEX(Data!$E$33:$E$82,MATCH($B42,Data!$B$33:$B$82,0),1)=TRUE),TEXT($B42,\"DDDD\")&\" ++\",TEXT($B42,\"DDDD\")))),TEXT($B42,\"DDDD\"))","v":"Friday"},{"$f":"IFERROR(MATCH($B42,Data!$B$33:$B$82,0),\"\")","v":11},null,null,0,{"$f":"IFERROR(INDEX(Data!$F$33:$F$82,$D42,1)+INDEX(Data!$G$33:$G$82,$D42,1),\"\")","v":3041},{"$f":"IFERROR(INDEX(Data!$H$33:$H$82,$D42,1)+INDEX(Data!$I$33:$I$82,$D42,1),\"\")","v":10573.2},13614.2,null,null,0,0,13614.2,0]
[null,"2014-07-12",{"$f":"IFERROR(IF($B43=\"\",\"\",IF(AND($B43<>\"\",INDEX(Data!$D$33:$D$82,MATCH($B43,Data!$B$33:$B$82,0),1)=TRUE),TEXT($B43,\"DDDD\")&\" +\",IF(AND($B43<>\"\",INDEX(Data!$E$33:$E$82,MATCH($B43,Data!$B$33:$B$82,0),1)=TRUE),TEXT($B43,\"DDDD\")&\" ++\",TEXT($B43,\"DDDD\")))),TEXT($B43,\"DDDD\"))","v":"Saturday"},{"$f":"IFERROR(MATCH($B43,Data!$B$33:$B$82,0),\"\")","v":12},null,null,0,{"$f":"IFERROR(INDEX(Data!$F$33:$F$82,$D43,1)+INDEX(Data!$G$33:$G$82,$D43,1),\"\")","v":3796.8},{"$f":"IFERROR(INDEX(Data!$H$33:$H$82,$D43,1)+INDEX(Data!$I$33:$I$82,$D43,1),\"\")","v":9803.7999999999993},13600.599999999999,null,null,0,0,13600.599999999999,0]
[null,"2014-07-13",{"$f":"IFERROR(IF($B44=\"\",\"\",IF(AND($B44<>\"\",INDEX(Data!$D$33:$D$82,MATCH($B44,Data!$B$33:$B$82,0),1)=TRUE),TEXT($B44,\"DDDD\")&\" +\",IF(AND($B44<>\"\",INDEX(Data!$E$33:$E$82,MATCH($B44,Data!$B$33:$B$82,0),1)=TRUE),TEXT($B44,\"DDDD\")&\" ++\",TEXT($B44,\"DDDD\")))),TEXT($B44,\"DDDD\"))","v":"Sunday"},{"$f":"IFERROR(MATCH($B44,Data!$B$33:$B$82,0),\"\")","v":13},null,null,0,{"$f":"IFERROR(INDEX(Data!$F$33:$F$82,$D44,1)+INDEX(Data!$G$33:$G$82,$D44,1),\"\")","v":3407.6000000000004},{"$f":"IFERROR(INDEX(Data!$H$33:$H$82,$D44,1)+INDEX(Data!$I$33:$I$82,$D44,1),\"\")","v":3988.1},7395.7000000000007,null,null,0,0,7395.7000000000007,0]
[null,"2014-07-14",{"$f":"IFERROR(IF($B45=\"\",\"\",IF(AND($B45<>\"\",INDEX(Data!$D$33:$D$82,MATCH($B45,Data!$B$33:$B$82,0),1)=TRUE),TEXT($B45,\"DDDD\")&\" +\",IF(AND($B45<>\"\",INDEX(Data!$E$33:$E$82,MATCH($B45,Data!$B$33:$B$82,0),1)=TRUE),TEXT($B45,\"DDDD\")&\" ++\",TEXT($B45,\"DDDD\")))),TEXT($B45,\"DDDD\"))","v":"Monday"},{"$f":"IFERROR(MATCH($B45,Data!$B$33:$B$82,0),\"\")","v":14},null,null,0,{"$f":"IFERROR(INDEX(Data!$F$33:$F$82,$D45,1)+INDEX(Data!$G$33:$G$82,$D45,1),\"\")","v":3120.2},{"$f":"IFERROR(INDEX(Data!$H$33:$H$82,$D45,1)+INDEX(Data!$I$33:$I$82,$D45,1),\"\")","v":11083.1},14203.3,null,null,0,0,14203.3,0]
[null,"2014-07-15",{"$f":"IFERROR(IF($B46=\"\",\"\",IF(AND($B46<>\"\",INDEX(Data!$D$33:$D$82,MATCH($B46,Data!$B$33:$B$82,0),1)=TRUE),TEXT($B46,\"DDDD\")&\" +\",IF(AND($B46<>\"\",INDEX(Data!$E$33:$E$82,MATCH($B46,Data!$B$33:$B$82,0),1)=TRUE),TEXT($B46,\"DDDD\")&\" ++\",TEXT($B46,\"DDDD\")))),TEXT($B46,\"DDDD\"))","v":"Tuesday"},{"$f":"IFERROR(MATCH($B46,Data!$B$33:$B$82,0),\"\")","v":15},null,null,0,{"$f":"IFERROR(INDEX(Data!$F$33:$F$82,$D46,1)+INDEX(Data!$G$33:$G$82,$D46,1),\"\")","v":5357.2},{"$f":"IFERROR(INDEX(Data!$H$33:$H$82,$D46,1)+INDEX(Data!$I$33:$I$82,$D46,1),\"\")","v":4204.8},9562,null,null,0,0,9562,0]
[null,"2014-07-16",{"$f":"IFERROR(IF($B47=\"\",\"\",IF(AND($B47<>\"\",INDEX(Data!$D$33:$D$82,MATCH($B47,Data!$B$33:$B$82,0),1)=TRUE),TEXT($B47,\"DDDD\")&\" +\",IF(AND($B47<>\"\",INDEX(Data!$E$33:$E$82,MATCH($B47,Data!$B$33:$B$82,0),1)=TRUE),TEXT($B47,\"DDDD\")&\" ++\",TEXT($B47,\"DDDD\")))),TEXT($B47,\"DDDD\"))","v":"Wednesday"},{"$f":"IFERROR(MATCH($B47,Data!$B$33:$B$82,0),\"\")","v":16},null,null,0,{"$f":"IFERROR(INDEX(Data!$F$33:$F$82,$D47,1)+INDEX(Data!$G$33:$G$82,$D47,1),\"\")","v":1704.1},{"$f":"IFERROR(INDEX(Data!$H$33:$H$82,$D47,1)+INDEX(Data!$I$33:$I$82,$D47,1),\"\")","v":5042.1000000000004},6746.2000000000007,null,null,0,0,6746.2000000000007,0]
[null,"2014-07-17",{"$f":"IFERROR(IF($B48=\"\",\"\",IF(AND($B48<>\"\",INDEX(Data!$D$33:$D$82,MATCH($B48,Data!$B$33:$B$82,0),1)=TRUE),TEXT($B48,\"DDDD\")&\" +\",IF(AND($B48<>\"\",INDEX(Data!$E$33:$E$82,MATCH($B48,Data!$B$33:$B$82,0),1)=TRUE),TEXT($B48,\"DDDD\")&\" ++\",TEXT($B48,\"DDDD\")))),TEXT($B48,\"DDDD\"))","v":"Thursday"},{"$f":"IFERROR(MATCH($B48,Data!$B$33:$B$82,0),\"\")","v":17},null,null,0,{"$f":"IFERROR(INDEX(Data!$F$33:$F$82,$D48,1)+INDEX(Data!$G$33:$G$82,$D48,1),\"\")","v":1429.4},{"$f":"IFERROR(INDEX(Data!$H$33:$H$82,$D48,1)+INDEX(Data!$I$33:$I$82,$D48,1),\"\")","v":4622.2999999999993},6051.6999999999989,null,null,0,0,6051.6999999999989,0]
[null,"2014-07-18",{"$f":"IFERROR(IF($B49=\"\",\"\",IF(AND($B49<>\"\",INDEX(Data!$D$33:$D$82,MATCH($B49,Data!$B$33:$B$82,0),1)=TRUE),TEXT($B49,\"DDDD\")&\" +\",IF(AND($B49<>\"\",INDEX(Data!$E$33:$E$82,MATCH($B49,Data!$B$33:$B$82,0),1)=TRUE),TEXT($B49,\"DDDD\")&\" ++\",TEXT($B49,\"DDDD\")))),TEXT($B49,\"DDDD\"))","v":"Friday"},{"$f":"IFERROR(MATCH($B49,Data!$B$33:$B$82,0),\"\")","v":18},null,null,0,{"$f":"IFERROR(INDEX(Data!$F$33:$F$82,$D49,1)+INDEX(Data!$G$33:$G$82,$D49,1),\"\")","v":2504.6},{"$f":"IFERROR(INDEX(Data!$H$33:$H$82,$D49,1)+INDEX(Data!$I$33:$I$82,$D49,1),\"\")","v":9042.2000000000007},11546.800000000001,null,null,0,0,11546.800000000001,0]
[null,"2014-07-19",{"$f":"IFERROR(IF($B50=\"\",\"\",IF(AND($B50<>\"\",INDEX(Data!$D$33:$D$82,MATCH($B50,Data!$B$33:$B$82,0),1)=TRUE),TEXT($B50,\"DDDD\")&\" +\",IF(AND($B50<>\"\",INDEX(Data!$E$33:$E$82,MATCH($B50,Data!$B$33:$B$82,0),1)=TRUE),TEXT($B50,\"DDDD\")&\" ++\",TEXT($B50,\"DDDD\")))),TEXT($B50,\"DDDD\"))","v":"Saturday"},{"$f":"IFERROR(MATCH($B50,Data!$B$33:$B$82,0),\"\")","v":19},null,null,0,{"$f":"IFERROR(INDEX(Data!$F$33:$F$82,$D50,1)+INDEX(Data!$G$33:$G$82,$D50,1),\"\")","v":3765.6},{"$f":"IFERROR(INDEX(Data!$H$33:$H$82,$D50,1)+INDEX(Data!$I$33:$I$82,$D50,1),\"\")","v":11852.6},15618.2,null,null,0,0,15618.2,0]
[null,"2014-07-20",{"$f":"IFERROR(IF($B51=\"\",\"\",IF(AND($B51<>\"\",INDEX(Data!$D$33:$D$82,MATCH($B51,Data!$B$33:$B$82,0),1)=TRUE),TEXT($B51,\"DDDD\")&\" +\",IF(AND($B51<>\"\",INDEX(Data!$E$33:$E$82,MATCH($B51,Data!$B$33:$B$82,0),1)=TRUE),TEXT($B51,\"DDDD\")&\" ++\",TEXT($B51,\"DDDD\")))),TEXT($B51,\"DDDD\"))","v":"Sunday"},{"$f":"IFERROR(MATCH($B51,Data!$B$33:$B$82,0),\"\")","v":20},null,null,0,{"$f":"IFERROR(INDEX(Data!$F$33:$F$82,$D51,1)+INDEX(Data!$G$33:$G$82,$D51,1),\"\")","v":4166.3999999999996},{"$f":"IFERROR(INDEX(Data!$H$33:$H$82,$D51,1)+INDEX(Data!$I$33:$I$82,$D51,1),\"\")","v":3798.3},7964.7,null,null,0,0,7964.7,0]
[null,"2014-07-21",{"$f":"IFERROR(IF($B52=\"\",\"\",IF(AND($B52<>\"\",INDEX(Data!$D$33:$D$82,MATCH($B52,Data!$B$33:$B$82,0),1)=TRUE),TEXT($B52,\"DDDD\")&\" +\",IF(AND($B52<>\"\",INDEX(Data!$E$33:$E$82,MATCH($B52,Data!$B$33:$B$82,0),1)=TRUE),TEXT($B52,\"DDDD\")&\" ++\",TEXT($B52,\"DDDD\")))),TEXT($B52,\"DDDD\"))","v":"Monday"},{"$f":"IFERROR(MATCH($B52,Data!$B$33:$B$82,0),\"\")","v":21},null,null,0,{"$f":"IFERROR(INDEX(Data!$F$33:$F$82,$D52,1)+INDEX(Data!$G$33:$G$82,$D52,1),\"\")","v":1183.3},{"$f":"IFERROR(INDEX(Data!$H$33:$H$82,$D52,1)+INDEX(Data!$I$33:$I$82,$D52,1),\"\")","v":2927.2},4110.5,null,null,0,0,4110.5,0]
[null,"2014-07-22",{"$f":"IFERROR(IF($B53=\"\",\"\",IF(AND($B53<>\"\",INDEX(Data!$D$33:$D$82,MATCH($B53,Data!$B$33:$B$82,0),1)=TRUE),TEXT($B53,\"DDDD\")&\" +\",IF(AND($B53<>\"\",INDEX(Data!$E$33:$E$82,MATCH($B53,Data!$B$33:$B$82,0),1)=TRUE),TEXT($B53,\"DDDD\")&\" ++\",TEXT($B53,\"DDDD\")))),TEXT($B53,\"DDDD\"))","v":"Tuesday"},{"$f":"IFERROR(MATCH($B53,Data!$B$33:$B$82,0),\"\")","v":22},null,null,0,{"$f":"IFERROR(INDEX(Data!$F$33:$F$82,$D53,1)+INDEX(Data!$G$33:$G$82,$D53,1),\"\")","v":1838.2},{"$f":"IFERROR(INDEX(Data!$H$33:$H$82,$D53,1)+INDEX(Data!$I$33:$I$82,$D53,1),\"\")","v":5301.9},7140.0999999999995,null,null,0,0,7140.0999999999995,0]
[null,"2014-07-23",{"$f":"IFERROR(IF($B54=\"\",\"\",IF(AND($B54<>\"\",INDEX(Data!$D$33:$D$82,MATCH($B54,Data!$B$33:$B$82,0),1)=TRUE),TEXT($B54,\"DDDD\")&\" +\",IF(AND($B54<>\"\",INDEX(Data!$E$33:$E$82,MATCH($B54,Data!$B$33:$B$82,0),1)=TRUE),TEXT($B54,\"DDDD\")&\" ++\",TEXT($B54,\"DDDD\")))),TEXT($B54,\"DDDD\"))","v":"Wednesday"},{"$f":"IFERROR(MATCH($B54,Data!$B$33:$B$82,0),\"\")","v":23},null,null,0,{"$f":"IFERROR(INDEX(Data!$F$33:$F$82,$D54,1)+INDEX(Data!$G$33:$G$82,$D54,1),\"\")","v":1993.9},{"$f":"IFERROR(INDEX(Data!$H$33:$H$82,$D54,1)+INDEX(Data!$I$33:$I$82,$D54,1),\"\")","v":3152.2},5146.1000000000004,null,null,0,0,5146.1000000000004,0]
[null,"2014-07-24",{"$f":"IFERROR(IF($B55=\"\",\"\",IF(AND($B55<>\"\",INDEX(Data!$D$33:$D$82,MATCH($B55,Data!$B$33:$B$82,0),1)=TRUE),TEXT($B55,\"DDDD\")&\" +\",IF(AND($B55<>\"\",INDEX(Data!$E$33:$E$82,MATCH($B55,Data!$B$33:$B$82,0),1)=TRUE),TEXT($B55,\"DDDD\")&\" ++\",TEXT($B55,\"DDDD\")))),TEXT($B55,\"DDDD\"))","v":"Thursday"},{"$f":"IFERROR(MATCH($B55,Data!$B$33:$B$82,0),\"\")","v":24},null,null,0,{"$f":"IFERROR(INDEX(Data!$F$33:$F$82,$D55,1)+INDEX(Data!$G$33:$G$82,$D55,1),\"\")","v":2157.6},{"$f":"IFERROR(INDEX(Data!$H$33:$H$82,$D55,1)+INDEX(Data!$I$33:$I$82,$D55,1),\"\")","v":6914},9071.6,null,null,0,0,9071.6,0]
[null,"2014-07-25",{"$f":"IFERROR(IF($B56=\"\",\"\",IF(AND($B56<>\"\",INDEX(Data!$D$33:$D$82,MATCH($B56,Data!$B$33:$B$82,0),1)=TRUE),TEXT($B56,\"DDDD\")&\" +\",IF(AND($B56<>\"\",INDEX(Data!$E$33:$E$82,MATCH($B56,Data!$B$33:$B$82,0),1)=TRUE),TEXT($B56,\"DDDD\")&\" ++\",TEXT($B56,\"DDDD\")))),TEXT($B56,\"DDDD\"))","v":"Friday"},{"$f":"IFERROR(MATCH($B56,Data!$B$33:$B$82,0),\"\")","v":25},null,null,0,{"$f":"IFERROR(INDEX(Data!$F$33:$F$82,$D56,1)+INDEX(Data!$G$33:$G$82,$D56,1),\"\")","v":5171.8999999999996},{"$f":"IFERROR(INDEX(Data!$H$33:$H$82,$D56,1)+INDEX(Data!$I$33:$I$82,$D56,1),\"\")","v":12881.6},18053.5,null,null,0,0,18053.5,0]
[null,"2014-07-26",{"$f":"IFERROR(IF($B57=\"\",\"\",IF(AND($B57<>\"\",INDEX(Data!$D$33:$D$82,MATCH($B57,Data!$B$33:$B$82,0),1)=TRUE),TEXT($B57,\"DDDD\")&\" +\",IF(AND($B57<>\"\",INDEX(Data!$E$33:$E$82,MATCH($B57,Data!$B$33:$B$82,0),1)=TRUE),TEXT($B57,\"DDDD\")&\" ++\",TEXT($B57,\"DDDD\")))),TEXT($B57,\"DDDD\"))","v":"Saturday"},{"$f":"IFERROR(MATCH($B57,Data!$B$33:$B$82,0),\"\")","v":26},null,null,0,{"$f":"IFERROR(INDEX(Data!$F$33:$F$82,$D57,1)+INDEX(Data!$G$33:$G$82,$D57,1),\"\")","v":3791.7},{"$f":"IFERROR(INDEX(Data!$H$33:$H$82,$D57,1)+INDEX(Data!$I$33:$I$82,$D57,1),\"\")","v":12189.4},15981.099999999999,null,null,0,0,15981.099999999999,0]
[null,"2014-07-27",{"$f":"IFERROR(IF($B58=\"\",\"\",IF(AND($B58<>\"\",INDEX(Data!$D$33:$D$82,MATCH($B58,Data!$B$33:$B$82,0),1)=TRUE),TEXT($B58,\"DDDD\")&\" +\",IF(AND($B58<>\"\",INDEX(Data!$E$33:$E$82,MATCH($B58,Data!$B$33:$B$82,0),1)=TRUE),TEXT($B58,\"DDDD\")&\" ++\",TEXT($B58,\"DDDD\")))),TEXT($B58,\"DDDD\"))","v":"Sunday"},{"$f":"IFERROR(MATCH($B58,Data!$B$33:$B$82,0),\"\")","v":27},null,null,0,{"$f":"IFERROR(INDEX(Data!$F$33:$F$82,$D58,1)+INDEX(Data!$G$33:$G$82,$D58,1),\"\")","v":5026.1000000000004},{"$f":"IFERROR(INDEX(Data!$H$33:$H$82,$D58,1)+INDEX(Data!$I$33:$I$82,$D58,1),\"\")","v":11474.7},16500.800000000003,null,null,0,0,16500.800000000003,0]
[null,"2014-07-28",{"$f":"IFERROR(IF($B59=\"\",\"\",IF(AND($B59<>\"\",INDEX(Data!$D$33:$D$82,MATCH($B59,Data!$B$33:$B$82,0),1)=TRUE),TEXT($B59,\"DDDD\")&\" +\",IF(AND($B59<>\"\",INDEX(Data!$E$33:$E$82,MATCH($B59,Data!$B$33:$B$82,0),1)=TRUE),TEXT($B59,\"DDDD\")&\" ++\",TEXT($B59,\"DDDD\")))),TEXT($B59,\"DDDD\"))","v":"Monday"},{"$f":"IFERROR(MATCH($B59,Data!$B$33:$B$82,0),\"\")","v":28},null,null,0,{"$f":"IFERROR(INDEX(Data!$F$33:$F$82,$D59,1)+INDEX(Data!$G$33:$G$82,$D59,1),\"\")","v":6653.5},{"$f":"IFERROR(INDEX(Data!$H$33:$H$82,$D59,1)+INDEX(Data!$I$33:$I$82,$D59,1),\"\")","v":12091.400000000001},18744.900000000001,null,null,0,0,18744.900000000001,0]
[null,"2014-07-29",{"$f":"IFERROR(IF($B60=\"\",\"\",IF(AND($B60<>\"\",INDEX(Data!$D$33:$D$82,MATCH($B60,Data!$B$33:$B$82,0),1)=TRUE),TEXT($B60,\"DDDD\")&\" +\",IF(AND($B60<>\"\",INDEX(Data!$E$33:$E$82,MATCH($B60,Data!$B$33:$B$82,0),1)=TRUE),TEXT($B60,\"DDDD\")&\" ++\",TEXT($B60,\"DDDD\")))),TEXT($B60,\"DDDD\"))","v":"Tuesday"},{"$f":"IFERROR(MATCH($B60,Data!$B$33:$B$82,0),\"\")","v":29},null,null,0,{"$f":"IFERROR(INDEX(Data!$F$33:$F$82,$D60,1)+INDEX(Data!$G$33:$G$82,$D60,1),\"\")","v":6387.2},{"$f":"IFERROR(INDEX(Data!$H$33:$H$82,$D60,1)+INDEX(Data!$I$33:$I$82,$D60,1),\"\")","v":6851.5},13238.7,null,null,0,0,13238.7,0]
[null,"2014-07-30",{"$f":"IFERROR(IF($B61=\"\",\"\",IF(AND($B61<>\"\",INDEX(Data!$D$33:$D$82,MATCH($B61,Data!$B$33:$B$82,0),1)=TRUE),TEXT($B61,\"DDDD\")&\" +\",IF(AND($B61<>\"\",INDEX(Data!$E$33:$E$82,MATCH($B61,Data!$B$33:$B$82,0),1)=TRUE),TEXT($B61,\"DDDD\")&\" ++\",TEXT($B61,\"DDDD\")))),TEXT($B61,\"DDDD\"))","v":"Wednesday"},{"$f":"IFERROR(MATCH($B61,Data!$B$33:$B$82,0),\"\")","v":30},null,null,0,{"$f":"IFERROR(INDEX(Data!$F$33:$F$82,$D61,1)+INDEX(Data!$G$33:$G$82,$D61,1),\"\")","v":3060.6},{"$f":"IFERROR(INDEX(Data!$H$33:$H$82,$D61,1)+INDEX(Data!$I$33:$I$82,$D61,1),\"\")","v":7542.9},10603.5,null,null,0,0,10603.5,0]
[null,"2014-07-31",{"$f":"IFERROR(IF($B62=\"\",\"\",IF(AND($B62<>\"\",INDEX(Data!$D$33:$D$82,MATCH($B62,Data!$B$33:$B$82,0),1)=TRUE),TEXT($B62,\"DDDD\")&\" +\",IF(AND($B62<>\"\",INDEX(Data!$E$33:$E$82,MATCH($B62,Data!$B$33:$B$82,0),1)=TRUE),TEXT($B62,\"DDDD\")&\" ++\",TEXT($B62,\"DDDD\")))),TEXT($B62,\"DDDD\"))","v":"Thursday"},{"$f":"IFERROR(MATCH($B62,Data!$B$33:$B$82,0),\"\")","v":31},null,null,0,{"$f":"IFERROR(INDEX(Data!$F$33:$F$82,$D62,1)+INDEX(Data!$G$33:$G$82,$D62,1),\"\")","v":3721.9},{"$f":"IFERROR(INDEX(Data!$H$33:$H$82,$D62,1)+INDEX(Data!$I$33:$I$82,$D62,1),\"\")","v":8010.5},11732.4,null,null,0,0,11732.4,0]

{"sheet":"Report B","index":3,"n_rows":61,"n_cols":24,"rows_kept":61,"cut":false,"hidden":false,"merged":[]}
[]
[]
[null,null,"MONTHLY SALES REPORTING BY OUTLET"]
[]
[]
[null,"SUBJECT","REPORT B : ROOM OCCUPANCY AND USAGE OF PARTY ROOMS"]
[]
[null,"OUTLET",{"$f":"Data!$C$8","v":"SBA"}]
[]
[null,"MONTH / YEAR",{"$f":"Data!$C$10","v":"July 2014"}]
[]
[null,"MENU"]
[]
[null,"DATE","DAY","ROW","TOTAL","OCCUPANCY OF ROOMS",null,null,null,null,"% OCCUPANCY OF ROOMS",null,null,null,"USAGE OF PARTY ROOMS",null,null,null,null,null,null,null,null,"CHART : % ROOM OCCUPANCY BY SESSION"]
[null,null,null,null,"ROOMS"]
[null,null,null,null,null,"SESSION",true,null,null,null,"SESSION",null,null,null,"ROOM","AVERAGE","AVERAGE","ROOM","AVERAGE","AVERAGE","ROOM","AVERAGE","AVERAGE"]
[null,null,null,null,null,"NOON K","HAPPY","NORMAL","MIDNIGHT","ALL","NOON K","HAPPY","NORMAL","MIDNIGHT","V1","PAX","SPENDING","V2","PAX","SPENDING","V3","PAX","SPENDING"]
[null,null,null,null,"( ROOMS )","( rooms )","( rooms )","( rooms )","( rooms )","( rooms )","( % )","( % )","( % )","( % )",null,"( pax )","( RM )",null,"( pax )","( RM )",null,"( pax )","( RM )"]
[null,"SUMMARY FOR MONTH",null,null,null,null,null,null,null,null,null,null,null,null,null,null,null,null,null,null,null,null,null,"LEGEND"]
[null,"TOTAL ROOM OCCUPANCY",null,null,null,{"$f":"IF($G$16=TRUE,SUM(F$31:F$61),\"\")","v":585},{"$f":"IF($G$16=TRUE,SUM(G$31:G$61),\"\")","v":715},1470,434,3204,null,null,null,null,{"$f":"SUM(O$31:O$61)","v":0},0,0,0,0,0,0,0,0]
[null,"AVERAGE ROOM OCCUPANCY",null,null,null,{"$f":"IFERROR(SUM(F$31:F$61)/COUNTIF($D$31:$D$61,\">0\"),\"\")","v":18.870967741935484},23.06451612903226,47.41935483870968,14,103.35483870967742,9.9320882852292028E-2,0.12139219015280135,0.24957555178268248,7.3684210526315783E-2,0,0,0,0,0,0,0,0,0]
[null,"HIGHEST ROOM OCCUPANCY",null,null,null,{"$f":"IFERROR(IF(LARGE(F$31:F$61,1)>0,LARGE(F$31:F$61,1),\"NIL\"),\"NIL\")","v":34},41,66,25,157,0.17894736842105263,0.21578947368421053,0.3473684210526316,0.13157894736842105,"NIL","NIL","NIL","NIL","NIL","NIL","NIL","NIL","NIL"]
[null,"LOWEST ROOM OCCUPANCY",null,null,null,{"$f":"IFERROR(IF(LARGE(F$31:F$61,COUNTIF(F$31:F$61,\">0\"))<>F$22,LARGE(F$31:F$61,COUNTIF(F$31:F$61,\">0\")),\"NIL\"),\"NIL\")","v":8},1,23,3,63,4.2105263157894736E-2,5.263157894736842E-3,0.12105263157894737,1.5789473684210527E-2,"NIL","NIL","NIL","NIL","NIL","NIL","NIL","NIL","NIL"]
[null,"AVERAGE FOR ","MONDAY",null,null,{"$f":"IFERROR(SUMIF($C$31:$C$61,\"Monday*\",F$31:F$61)/COUNTIF($C$31:$C$61,\"Monday*\"),\"\")","v":18},25.5,49.25,14.75,107.5,9.4736842105263147E-2,0.13421052631578947,0.2592105263157895,7.7631578947368413E-2,0,0,0,0,0,0,0,0,0]
[null,null,"TUESDAY",null,null,{"$f":"IFERROR(SUMIF($C$31:$C$61,\"Tuesday*\",F$31:F$61)/COUNTIF($C$31:$C$61,\"Tuesday*\"),\"\")","v":20.8},23.8,40.200000000000003,9.8000000000000007,94.6,0.10947368421052632,0.12526315789473683,0.21157894736842103,5.1578947368421058E-2,0,0,0,0,0,0,0,0,0]
[null,null,"WEDNESDAY",null,null,{"$f":"IFERROR(SUMIF($C$31:$C$61,\"Wednesday*\",F$31:F$61)/COUNTIF($C$31:$C$61,\"Wednesday*\"),\"\")","v":17.2},24.2,38.6,12.6,92.6,9.0526315789473677E-2,0.12736842105263158,0.20315789473684212,6.6315789473684217E-2,0,0,0,0,0,0,0,0,0]
[null,null,"THURSDAY",null,null,{"$f":"IFERROR(SUMIF($C$31:$C$61,\"Thursday*\",F$31:F$61)/COUNTIF($C$31:$C$61,\"Thursday*\"),\"\")","v":14.6},21,45.6,15.6,96.8,7.6842105263157892E-2,0.11052631578947369,0.24,8.2105263157894751E-2,0,0,0,0,0,0,0,0,0]
[null,null,"FRIDAY",null,null,{"$f":"IFERROR(SUMIF($C$31:$C$61,\"Friday*\",F$31:F$61)/COUNTIF($C$31:$C$61,\"Friday*\"),\"\")","v":16.5},25.25,61.75,12.75,116.25,8.6842105263157887E-2,0.13289473684210526,0.32500000000000001,6.7105263157894737E-2,0,0,0,0,0,0,0,0,0]
[null,null,"SATURDAY",null,null,{"$f":"IFERROR(SUMIF($C$31:$C$61,\"Saturday*\",F$31:F$61)/COUNTIF($C$31:$C$61,\"Saturday*\"),\"\")","v":20.75},22,59.25,19.5,121.5,0.10921052631578948,0.11578947368421054,0.31184210526315792,0.10263157894736842,0,0,0,0,0,0,0,0,0]
[null,null,"SUNDAY",null,null,{"$f":"IFERROR(SUMIF($C$31:$C$61,\"Sunday*\",F$31:F$61)/COUNTIF($C$31:$C$61,\"Sunday*\"),\"\")","v":25.25},19.75,41.75,14,100.75,0.13289473684210526,0.10394736842105262,0.21973684210526317,7.3684210526315796E-2,0,0,0,0,0,0,0,0,0]
[null,{"$f":"'Report A'!$B32","v":"2014-07-01"},{"$f":"'Report A'!$C32","v":"Tuesday"},{"$f":"'Report A'!$D32","v":1},{"$f":"IFERROR(INDEX(Data!$J$33:$J$82,$D31,1),\"\")","v":38},{"$f":"IFERROR(IF($G$16=TRUE,INDEX(Data!$K$33:$K$82,$D31,1),INDEX(Data!$K$33:$K$82,$D31,1)/$E31),\"\")","v":8},{"$f":"IFERROR(IF($G$16=TRUE,INDEX(Data!$L$33:$L$82,$D31,1),INDEX(Data!$L$33:$L$82,$D31,1)/(2*$E31)),\"\")","v":19},{"$f":"IFERROR(IF($G$16=TRUE,INDEX(Data!$M$33:$M$82,$D31,1),INDEX(Data!$M$33:$M$82,$D31,1)/$E31),\"\")","v":43},{"$f":"IFERROR(IF($G$16=TRUE,INDEX(Data!$N$33:$N$82,$D31,1),INDEX(Data!$N$33:$N$82,$D31,1)/$E31),\"\")","v":11},{"$f":"IFERROR(IF($G$16=TRUE,INDEX(Data!$K$33:$K$82,$D31,1)+INDEX(Data!$L$33:$L$82,$D31,1)+INDEX(Data!$M$33:$M$82,$D31,1)+INDEX(Data!$N$33:$N$82,$D31,1),(INDEX(Data!$K$33:$K$82,$D31,1)+INDEX(Data!$L$33:$L$82,$D31,1)+INDEX(Data!$M$33:$M$82,$D31,1)+INDEX(Data!$N$33:$N$82,$D31,1))/(5*$E31)),\"\")","v":81},{"$f":"IFERROR(INDEX(Data!$K$33:$K$82,$D31,1)/(5*$E31),\"\")","v":4.2105263157894736E-2},{"$f":"IFERROR(INDEX(Data!$L$33:$L$82,$D31,1)/(5*$E31),\"\")","v":0.1},{"$f":"IFERROR(INDEX(Data!$M$33:$M$82,$D31,1)/(5*$E31),\"\")","v":0.22631578947368422},{"$f":"IFERROR(INDEX(Data!$N$33:$N$82,$D31,1)/(5*$E31),\"\")","v":5.7894736842105263E-2},{"$f":"IFERROR(IF($O$17<>\"\",COUNTIF(INDIRECT(\"Data!$O$\"&$D31+32&\":$AH$\"&$D31+32),$O$17),\"\"),\"\")","v":0},{"$f":"IFERROR((SUMIF(INDIRECT(\"Data!$O$\"&$D31+32&\":$O$\"&$D31+32),$O$17,INDIRECT(\"Data!$Q$\"&$D31+32&\":$Q$\"&$D31+32))+SUMIF(INDIRECT(\"Data!$S$\"&$D31+32&\":$S$\"&$D31+32),$O$17,INDIRECT(\"Data!$U$\"&$D31+32&\":$U$\"&$D31+32))+SUMIF(INDIRECT(\"Data!$W$\"&$D31+32&\":$W$\"&$D31+32),$O$17,INDIRECT(\"Data!$Y$\"&$D31+32&\":$Y$\"&$D31+32))+SUMIF(INDIRECT(\"Data!$AA$\"&$D31+32&\":$AA$\"&$D31+32),$O$17,INDIRECT(\"Data!$AC$\"&$D31+32&\":$AC$\"&$D31+32))+SUMIF(INDIRECT(\"Data!$AE$\"&$D31+32&\":$AE$\"&$D31+32),$O$17,INDIRECT(\"Data!$AG$\"&$D31+32&\":$AG$\"&$D31+32)))/$O31,\"\")","v":""},{"$f":"IFERROR((SUMIF(INDIRECT(\"Data!$O$\"&$D31+32&\":$O$\"&$D31+32),$O$17,INDIRECT(\"Data!$R$\"&$D31+32&\":$R$\"&$D31+32))+SUMIF(INDIRECT(\"Data!$S$\"&$D31+32&\":$S$\"&$D31+32),$O$17,INDIRECT(\"Data!$V$\"&$D31+32&\":$V$\"&$D31+32))+SUMIF(INDIRECT(\"Data!$W$\"&$D31+32&\":$W$\"&$D31+32),$O$17,INDIRECT(\"Data!$Z$\"&$D31+32&\":$Z$\"&$D31+32))+SUMIF(INDIRECT(\"Data!$AA$\"&$D31+32&\":$AA$\"&$D31+32),$O$17,INDIRECT(\"Data!$AD$\"&$D31+32&\":$AD$\"&$D31+32))+SUMIF(INDIRECT(\"Data!$AE$\"&$D31+32&\":$AE$\"&$D31+32),$O$17,INDIRECT(\"Data!$AH$\"&$D31+32&\":$AH$\"&$D31+32)))/$O31,\"\")","v":""},{"$f":"IFERROR(IF($R$17<>\"\",COUNTIF(INDIRECT(\"Data!$O$\"&$D31+32&\":$AH$\"&$D31+32),$R$17),\"\"),\"\")","v":0},{"$f":"IFERROR((SUMIF(INDIRECT(\"Data!$O$\"&$D31+32&\":$O$\"&$D31+32),$R$17,INDIRECT(\"Data!$Q$\"&$D31+32&\":$Q$\"&$D31+32))+SUMIF(INDIRECT(\"Data!$S$\"&$D31+32&\":$S$\"&$D31+32),$R$17,INDIRECT(\"Data!$U$\"&$D31+32&\":$U$\"&$D31+32))+SUMIF(INDIRECT(\"Data!$W$\"&$D31+32&\":$W$\"&$D31+32),$R$17,INDIRECT(\"Data!$Y$\"&$D31+32&\":$Y$\"&$D31+32))+SUMIF(INDIRECT(\"Data!$AA$\"&$D31+32&\":$AA$\"&$D31+32),$R$17,INDIRECT(\"Data!$AC$\"&$D31+32&\":$AC$\"&$D31+32))+SUMIF(INDIRECT(\"Data!$AE$\"&$D31+32&\":$AE$\"&$D31+32),$R$17,INDIRECT(\"Data!$AG$\"&$D31+32&\":$AG$\"&$D31+32)))/$R31,\"\")","v":""},{"$f":"IFERROR((SUMIF(INDIRECT(\"Data!$O$\"&$D31+32&\":$O$\"&$D31+32),$R$17,INDIRECT(\"Data!$R$\"&$D31+32&\":$R$\"&$D31+32))+SUMIF(INDIRECT(\"Data!$S$\"&$D31+32&\":$S$\"&$D31+32),$R$17,INDIRECT(\"Data!$V$\"&$D31+32&\":$V$\"&$D31+32))+SUMIF(INDIRECT(\"Data!$W$\"&$D31+32&\":$W$\"&$D31+32),$R$17,INDIRECT(\"Data!$Z$\"&$D31+32&\":$Z$\"&$D31+32))+SUMIF(INDIRECT(\"Data!$AA$\"&$D31+32&\":$AA$\"&$D31+32),$R$17,INDIRECT(\"Data!$AD$\"&$D31+32&\":$AD$\"&$D31+32))+SUMIF(INDIRECT(\"Data!$AE$\"&$D31+32&\":$AE$\"&$D31+32),$R$17,INDIRECT(\"Data!$AH$\"&$D31+32&\":$AH$\"&$D31+32)))/$R31,\"\")","v":""},{"$f":"IFERROR(IF($U$17<>\"\",COUNTIF(INDIRECT(\"Data!$O$\"&$D31+32&\":$AH$\"&$D31+32),$U$17),\"\"),\"\")","v":0},{"$f":"IFERROR((SUMIF(INDIRECT(\"Data!$O$\"&$D31+32&\":$O$\"&$D31+32),$U$17,INDIRECT(\"Data!$Q$\"&$D31+32&\":$Q$\"&$D31+32))+SUMIF(INDIRECT(\"Data!$S$\"&$D31+32&\":$S$\"&$D31+32),$U$17,INDIRECT(\"Data!$U$\"&$D31+32&\":$U$\"&$D31+32))+SUMIF(INDIRECT(\"Data!$W$\"&$D31+32&\":$W$\"&$D31+32),$U$17,INDIRECT(\"Data!$Y$\"&$D31+32&\":$Y$\"&$D31+32))+SUMIF(INDIRECT(\"Data!$AA$\"&$D31+32&\":$AA$\"&$D31+32),$U$17,INDIRECT(\"Data!$AC$\"&$D31+32&\":$AC$\"&$D31+32))+SUMIF(INDIRECT(\"Data!$AE$\"&$D31+32&\":$AE$\"&$D31+32),$U$17,INDIRECT(\"Data!$AG$\"&$D31+32&\":$AG$\"&$D31+32)))/$U31,\"\")","v":""},{"$f":"IFERROR((SUMIF(INDIRECT(\"Data!$O$\"&$D31+32&\":$O$\"&$D31+32),$U$17,INDIRECT(\"Data!$R$\"&$D31+32&\":$R$\"&$D31+32))+SUMIF(INDIRECT(\"Data!$S$\"&$D31+32&\":$S$\"&$D31+32),$U$17,INDIRECT(\"Data!$V$\"&$D31+32&\":$V$\"&$D31+32))+SUMIF(INDIRECT(\"Data!$W$\"&$D31+32&\":$W$\"&$D31+32),$U$17,INDIRECT(\"Data!$Z$\"&$D31+32&\":$Z$\"&$D31+32))+SUMIF(INDIRECT(\"Data!$AA$\"&$D31+32&\":$AA$\"&$D31+32),$U$17,INDIRECT(\"Data!$AD$\"&$D31+32&\":$AD$\"&$D31+32))+SUMIF(INDIRECT(\"Data!$AE$\"&$D31+32&\":$AE$\"&$D31+32),$U$17,INDIRECT(\"Data!$AH$\"&$D31+32&\":$AH$\"&$D31+32)))/$U31,\"\")","v":""}]
[null,{"$f":"'Report A'!$B33","v":"2014-07-02"},{"$f":"'Report A'!$C33","v":"Wednesday"},{"$f":"'Report A'!$D33","v":2},{"$f":"IFERROR(INDEX(Data!$J$33:$J$82,$D32,1),\"\")","v":38},{"$f":"IFERROR(IF($G$16=TRUE,INDEX(Data!$K$33:$K$82,$D32,1),INDEX(Data!$K$33:$K$82,$D32,1)/$E32),\"\")","v":16},{"$f":"IFERROR(IF($G$16=TRUE,INDEX(Data!$L$33:$L$82,$D32,1),INDEX(Data!$L$33:$L$82,$D32,1)/(2*$E32)),\"\")","v":17},{"$f":"IFERROR(IF($G$16=TRUE,INDEX(Data!$M$33:$M$82,$D32,1),INDEX(Data!$M$33:$M$82,$D32,1)/$E32),\"\")","v":43},{"$f":"IFERROR(IF($G$16=TRUE,INDEX(Data!$N$33:$N$82,$D32,1),INDEX(Data!$N$33:$N$82,$D32,1)/$E32),\"\")","v":16},{"$f":"IFERROR(IF($G$16=TRUE,INDEX(Data!$K$33:$K$82,$D32,1)+INDEX(Data!$L$33:$L$82,$D32,1)+INDEX(Data!$M$33:$M$82,$D32,1)+INDEX(Data!$N$33:$N$82,$D32,1),(INDEX(Data!$K$33:$K$82,$D32,1)+INDEX(Data!$L$33:$L$82,$D32,1)+INDEX(Data!$M$33:$M$82,$D32,1)+INDEX(Data!$N$33:$N$82,$D32,1))/(5*$E32)),\"\")","v":92},{"$f":"IFERROR(INDEX(Data!$K$33:$K$82,$D32,1)/(5*$E32),\"\")","v":8.4210526315789472E-2},{"$f":"IFERROR(INDEX(Data!$L$33:$L$82,$D32,1)/(5*$E32),\"\")","v":8.9473684210526316E-2},{"$f":"IFERROR(INDEX(Data!$M$33:$M$82,$D32,1)/(5*$E32),\"\")","v":0.22631578947368422},{"$f":"IFERROR(INDEX(Data!$N$33:$N$82,$D32,1)/(5*$E32),\"\")","v":8.4210526315789472E-2},0,"","",0,"","",0,"",""]
[null,{"$f":"'Report A'!$B34","v":"2014-07-03"},{"$f":"'Report A'!$C34","v":"Thursday"},{"$f":"'Report A'!$D34","v":3},{"$f":"IFERROR(INDEX(Data!$J$33:$J$82,$D33,1),\"\")","v":38},{"$f":"IFERROR(IF($G$16=TRUE,INDEX(Data!$K$33:$K$82,$D33,1),INDEX(Data!$K$33:$K$82,$D33,1)/$E33),\"\")","v":12},{"$f":"IFERROR(IF($G$16=TRUE,INDEX(Data!$L$33:$L$82,$D33,1),INDEX(Data!$L$33:$L$82,$D33,1)/(2*$E33)),\"\")","v":16},{"$f":"IFERROR(IF($G$16=TRUE,INDEX(Data!$M$33:$M$82,$D33,1),INDEX(Data!$M$33:$M$82,$D33,1)/$E33),\"\")","v":57},{"$f":"IFERROR(IF($G$16=TRUE,INDEX(Data!$N$33:$N$82,$D33,1),INDEX(Data!$N$33:$N$82,$D33,1)/$E33),\"\")","v":14},{"$f":"IFERROR(IF($G$16=TRUE,INDEX(Data!$K$33:$K$82,$D33,1)+INDEX(Data!$L$33:$L$82,$D33,1)+INDEX(Data!$M$33:$M$82,$D33,1)+INDEX(Data!$N$33:$N$82,$D33,1),(INDEX(Data!$K$33:$K$82,$D33,1)+INDEX(Data!$L$33:$L$82,$D33,1)+INDEX(Data!$M$33:$M$82,$D33,1)+INDEX(Data!$N$33:$N$82,$D33,1))/(5*$E33)),\"\")","v":99},{"$f":"IFERROR(INDEX(Data!$K$33:$K$82,$D33,1)/(5*$E33),\"\")","v":6.3157894736842107E-2},{"$f":"IFERROR(INDEX(Data!$L$33:$L$82,$D33,1)/(5*$E33),\"\")","v":8.4210526315789472E-2},{"$f":"IFERROR(INDEX(Data!$M$33:$M$82,$D33,1)/(5*$E33),\"\")","v":0.3},{"$f":"IFERROR(INDEX(Data!$N$33:$N$82,$D33,1)/(5*$E33),\"\")","v":7.3684210526315783E-2},0,"","",0,"","",0,"",""]
[null,{"$f":"'Report A'!$B35","v":"2014-07-04"},{"$f":"'Report A'!$C35","v":"Friday"},{"$f":"'Report A'!$D35","v":4},{"$f":"IFERROR(INDEX(Data!$J$33:$J$82,$D34,1),\"\")","v":38},{"$f":"IFERROR(IF($G$16=TRUE,INDEX(Data!$K$33:$K$82,$D34,1),INDEX(Data!$K$33:$K$82,$D34,1)/$E34),\"\")","v":10},{"$f":"IFERROR(IF($G$16=TRUE,INDEX(Data!$L$33:$L$82,$D34,1),INDEX(Data!$L$33:$L$82,$D34,1)/(2*$E34)),\"\")","v":20},{"$f":"IFERROR(IF($G$16=TRUE,INDEX(Data!$M$33:$M$82,$D34,1),INDEX(Data!$M$33:$M$82,$D34,1)/$E34),\"\")","v":66},{"$f":"IFERROR(IF($G$16=TRUE,INDEX(Data!$N$33:$N$82,$D34,1),INDEX(Data!$N$33:$N$82,$D34,1)/$E34),\"\")","v":10},{"$f":"IFERROR(IF($G$16=TRUE,INDEX(Data!$K$33:$K$82,$D34,1)+INDEX(Data!$L$33:$L$82,$D34,1)+INDEX(Data!$M$33:$M$82,$D34,1)+INDEX(Data!$N$33:$N$82,$D34,1),(INDEX(Data!$K$33:$K$82,$D34,1)+INDEX(Data!$L$33:$L$82,$D34,1)+INDEX(Data!$M$33:$M$82,$D34,1)+INDEX(Data!$N$33:$N$82,$D34,1))/(5*$E34)),\"\")","v":106},{"$f":"IFERROR(INDEX(Data!$K$33:$K$82,$D34,1)/(5*$E34),\"\")","v":5.2631578947368418E-2},{"$f":"IFERROR(INDEX(Data!$L$33:$L$82,$D34,1)/(5*$E34),\"\")","v":0.10526315789473684},{"$f":"IFERROR(INDEX(Data!$M$33:$M$82,$D34,1)/(5*$E34),\"\")","v":0.3473684210526316},{"$f":"IFERROR(INDEX(Data!$N$33:$N$82,$D34,1)/(5*$E34),\"\")","v":5.2631578947368418E-2},0,"","",0,"","",0,"",""]
[null,{"$f":"'Report A'!$B36","v":"2014-07-05"},{"$f":"'Report A'!$C36","v":"Saturday"},{"$f":"'Report A'!$D36","v":5},{"$f":"IFERROR(INDEX(Data!$J$33:$J$82,$D35,1),\"\")","v":38},{"$f":"IFERROR(IF($G$16=TRUE,INDEX(Data!$K$33:$K$82,$D35,1),INDEX(Data!$K$33:$K$82,$D35,1)/$E35),\"\")","v":22},{"$f":"IFERROR(IF($G$16=TRUE,INDEX(Data!$L$33:$L$82,$D35,1),INDEX(Data!$L$33:$L$82,$D35,1)/(2*$E35)),\"\")","v":19},{"$f":"IFERROR(IF($G$16=TRUE,INDEX(Data!$M$33:$M$82,$D35,1),INDEX(Data!$M$33:$M$82,$D35,1)/$E35),\"\")","v":51},{"$f":"IFERROR(IF($G$16=TRUE,INDEX(Data!$N$33:$N$82,$D35,1),INDEX(Data!$N$33:$N$82,$D35,1)/$E35),\"\")","v":25},{"$f":"IFERROR(IF($G$16=TRUE,INDEX(Data!$K$33:$K$82,$D35,1)+INDEX(Data!$L$33:$L$82,$D35,1)+INDEX(Data!$M$33:$M$82,$D35,1)+INDEX(Data!$N$33:$N$82,$D35,1),(INDEX(Data!$K$33:$K$82,$D35,1)+INDEX(Data!$L$33:$L$82,$D35,1)+INDEX(Data!$M$33:$M$82,$D35,1)+INDEX(Data!$N$33:$N$82,$D35,1))/(5*$E35)),\"\")","v":117},{"$f":"IFERROR(INDEX(Data!$K$33:$K$82,$D35,1)/(5*$E35),\"\")","v":0.11578947368421053},{"$f":"IFERROR(INDEX(Data!$L$33:$L$82,$D35,1)/(5*$E35),\"\")","v":0.1},{"$f":"IFERROR(INDEX(Data!$M$33:$M$82,$D35,1)/(5*$E35),\"\")","v":0.26842105263157895},{"$f":"IFERROR(INDEX(Data!$N$33:$N$82,$D35,1)/(5*$E35),\"\")","v":0.13157894736842105},0,"","",0,"","",0,"",""]
[null,{"$f":"'Report A'!$B37","v":"2014-07-06"},{"$f":"'Report A'!$C37","v":"Sunday"},{"$f":"'Report A'!$D37","v":6},{"$f":"IFERROR(INDEX(Data!$J$33:$J$82,$D36,1),\"\")","v":38},{"$f":"IFERROR(IF($G$16=TRUE,INDEX(Data!$K$33:$K$82,$D36,1),INDEX(Data!$K$33:$K$82,$D36,1)/$E36),\"\")","v":31},{"$f":"IFERROR(IF($G$16=TRUE,INDEX(Data!$L$33:$L$82,$D36,1),INDEX(Data!$L$33:$L$82,$D36,1)/(2*$E36)),\"\")","v":1},{"$f":"IFERROR(IF($G$16=TRUE,INDEX(Data!$M$33:$M$82,$D36,1),INDEX(Data!$M$33:$M$82,$D36,1)/$E36),\"\")","v":38},{"$f":"IFERROR(IF($G$16=TRUE,INDEX(Data!$N$33:$N$82,$D36,1),INDEX(Data!$N$33:$N$82,$D36,1)/$E36),\"\")","v":12},{"$f":"IFERROR(IF($G$16=TRUE,INDEX(Data!$K$33:$K$82,$D36,1)+INDEX(Data!$L$33:$L$82,$D36,1)+INDEX(Data!$M$33:$M$82,$D36,1)+INDEX(Data!$N$33:$N$82,$D36,1),(INDEX(Data!$K$33:$K$82,$D36,1)+INDEX(Data!$L$33:$L$82,$D36,1)+INDEX(Data!$M$33:$M$82,$D36,1)+INDEX(Data!$N$33:$N$82,$D36,1))/(5*$E36)),\"\")","v":82},{"$f":"IFERROR(INDEX(Data!$K$33:$K$82,$D36,1)/(5*$E36),\"\")","v":0.16315789473684211},{"$f":"IFERROR(INDEX(Data!$L$33:$L$82,$D36,1)/(5*$E36),\"\")","v":5.263157894736842E-3},{"$f":"IFERROR(INDEX(Data!$M$33:$M$82,$D36,1)/(5*$E36),\"\")","v":0.2},{"$f":"IFERROR(INDEX(Data!$N$33:$N$82,$D36,1)/(5*$E36),\"\")","v":6.3157894736842107E-2},0,"","",0,"","",0,"",""]
[null,{"$f":"'Report A'!$B38","v":"2014-07-07"},{"$f":"'Report A'!$C38","v":"Monday"},{"$f":"'Report A'!$D38","v":7},{"$f":"IFERROR(INDEX(Data!$J$33:$J$82,$D37,1),\"\")","v":38},{"$f":"IFERROR(IF($G$16=TRUE,INDEX(Data!$K$33:$K$82,$D37,1),INDEX(Data!$K$33:$K$82,$D37,1)/$E37),\"\")","v":12},{"$f":"IFERROR(IF($G$16=TRUE,INDEX(Data!$L$33:$L$82,$D37,1),INDEX(Data!$L$33:$L$82,$D37,1)/(2*$E37)),\"\")","v":23},{"$f":"IFERROR(IF($G$16=TRUE,INDEX(Data!$M$33:$M$82,$D37,1),INDEX(Data!$M$33:$M$82,$D37,1)/$E37),\"\")","v":47},{"$f":"IFERROR(IF($G$16=TRUE,INDEX(Data!$N$33:$N$82,$D37,1),INDEX(Data!$N$33:$N$82,$D37,1)/$E37),\"\")","v":9},{"$f":"IFERROR(IF($G$16=TRUE,INDEX(Data!$K$33:$K$82,$D37,1)+INDEX(Data!$L$33:$L$82,$D37,1)+INDEX(Data!$M$33:$M$82,$D37,1)+INDEX(Data!$N$33:$N$82,$D37,1),(INDEX(Data!$K$33:$K$82,$D37,1)+INDEX(Data!$L$33:$L$82,$D37,1)+INDEX(Data!$M$33:$M$82,$D37,1)+INDEX(Data!$N$33:$N$82,$D37,1))/(5*$E37)),\"\")","v":91},{"$f":"IFERROR(INDEX(Data!$K$33:$K$82,$D37,1)/(5*$E37),\"\")","v":6.3157894736842107E-2},{"$f":"IFERROR(INDEX(Data!$L$33:$L$82,$D37,1)/(5*$E37),\"\")","v":0.12105263157894737},{"$f":"IFERROR(INDEX(Data!$M$33:$M$82,$D37,1)/(5*$E37),\"\")","v":0.24736842105263157},{"$f":"IFERROR(INDEX(Data!$N$33:$N$82,$D37,1)/(5*$E37),\"\")","v":4.736842105263158E-2},0,"","",0,"","",0,"",""]
[null,{"$f":"'Report A'!$B39","v":"2014-07-08"},{"$f":"'Report A'!$C39","v":"Tuesday"},{"$f":"'Report A'!$D39","v":8},{"$f":"IFERROR(INDEX(Data!$J$33:$J$82,$D38,1),\"\")","v":38},{"$f":"IFERROR(IF($G$16=TRUE,INDEX(Data!$K$33:$K$82,$D38,1),INDEX(Data!$K$33:$K$82,$D38,1)/$E38),\"\")","v":14},{"$f":"IFERROR(IF($G$16=TRUE,INDEX(Data!$L$33:$L$82,$D38,1),INDEX(Data!$L$33:$L$82,$D38,1)/(2*$E38)),\"\")","v":16},{"$f":"IFERROR(IF($G$16=TRUE,INDEX(Data!$M$33:$M$82,$D38,1),INDEX(Data!$M$33:$M$82,$D38,1)/$E38),\"\")","v":44},{"$f":"IFERROR(IF($G$16=TRUE,INDEX(Data!$N$33:$N$82,$D38,1),INDEX(Data!$N$33:$N$82,$D38,1)/$E38),\"\")","v":3},{"$f":"IFERROR(IF($G$16=TRUE,INDEX(Data!$K$33:$K$82,$D38,1)+INDEX(Data!$L$33:$L$82,$D38,1)+INDEX(Data!$M$33:$M$82,$D38,1)+INDEX(Data!$N$33:$N$82,$D38,1),(INDEX(Data!$K$33:$K$82,$D38,1)+INDEX(Data!$L$33:$L$82,$D38,1)+INDEX(Data!$M$33:$M$82,$D38,1)+INDEX(Data!$N$33:$N$82,$D38,1))/(5*$E38)),\"\")","v":77},{"$f":"IFERROR(INDEX(Data!$K$33:$K$82,$D38,1)/(5*$E38),\"\")","v":7.3684210526315783E-2},{"$f":"IFERROR(INDEX(Data!$L$33:$L$82,$D38,1)/(5*$E38),\"\")","v":8.4210526315789472E-2},{"$f":"IFERROR(INDEX(Data!$M$33:$M$82,$D38,1)/(5*$E38),\"\")","v":0.23157894736842105},{"$f":"IFERROR(INDEX(Data!$N$33:$N$82,$D38,1)/(5*$E38),\"\")","v":1.5789473684210527E-2},0,"","",0,"","",0,"",""]
[null,{"$f":"'Report A'!$B40","v":"2014-07-09"},{"$f":"'Report A'!$C40","v":"Wednesday"},{"$f":"'Report A'!$D40","v":9},{"$f":"IFERROR(INDEX(Data!$J$33:$J$82,$D39,1),\"\")","v":38},{"$f":"IFERROR(IF($G$16=TRUE,INDEX(Data!$K$33:$K$82,$D39,1),INDEX(Data!$K$33:$K$82,$D39,1)/$E39),\"\")","v":13},{"$f":"IFERROR(IF($G$16=TRUE,INDEX(Data!$L$33:$L$82,$D39,1),INDEX(Data!$L$33:$L$82,$D39,1)/(2*$E39)),\"\")","v":16},{"$f":"IFERROR(IF($G$16=TRUE,INDEX(Data!$M$33:$M$82,$D39,1),INDEX(Data!$M$33:$M$82,$D39,1)/$E39),\"\")","v":50},{"$f":"IFERROR(IF($G$16=TRUE,INDEX(Data!$N$33:$N$82,$D39,1),INDEX(Data!$N$33:$N$82,$D39,1)/$E39),\"\")","v":8},{"$f":"IFERROR(IF($G$16=TRUE,INDEX(Data!$K$33:$K$82,$D39,1)+INDEX(Data!$L$33:$L$82,$D39,1)+INDEX(Data!$M$33:$M$82,$D39,1)+INDEX(Data!$N$33:$N$82,$D39,1),(INDEX(Data!$K$33:$K$82,$D39,1)+INDEX(Data!$L$33:$L$82,$D39,1)+INDEX(Data!$M$33:$M$82,$D39,1)+INDEX(Data!$N$33:$N$82,$D39,1))/(5*$E39)),\"\")","v":87},{"$f":"IFERROR(INDEX(Data!$K$33:$K$82,$D39,1)/(5*$E39),\"\")","v":6.8421052631578952E-2},{"$f":"IFERROR(INDEX(Data!$L$33:$L$82,$D39,1)/(5*$E39),\"\")","v":8.4210526315789472E-2},{"$f":"IFERROR(INDEX(Data!$M$33:$M$82,$D39,1)/(5*$E39),\"\")","v":0.26315789473684209},{"$f":"IFERROR(INDEX(Data!$N$33:$N$82,$D39,1)/(5*$E39),\"\")","v":4.2105263157894736E-2},0,"","",0,"","",0,"",""]
[null,{"$f":"'Report A'!$B41","v":"2014-07-10"},{"$f":"'Report A'!$C41","v":"Thursday"},{"$f":"'Report A'!$D41","v":10},{"$f":"IFERROR(INDEX(Data!$J$33:$J$82,$D40,1),\"\")","v":38},{"$f":"IFERROR(IF($G$16=TRUE,INDEX(Data!$K$33:$K$82,$D40,1),INDEX(Data!$K$33:$K$82,$D40,1)/$E40),\"\")","v":11},{"$f":"IFERROR(IF($G$16=TRUE,INDEX(Data!$L$33:$L$82,$D40,1),INDEX(Data!$L$33:$L$82,$D40,1)/(2*$E40)),\"\")","v":14},{"$f":"IFERROR(IF($G$16=TRUE,INDEX(Data!$M$33:$M$82,$D40,1),INDEX(Data!$M$33:$M$82,$D40,1)/$E40),\"\")","v":44},{"$f":"IFERROR(IF($G$16=TRUE,INDEX(Data!$N$33:$N$82,$D40,1),INDEX(Data!$N$33:$N$82,$D40,1)/$E40),\"\")","v":17},{"$f":"IFERROR(IF($G$16=TRUE,INDEX(Data!$K$33:$K$82,$D40,1)+INDEX(Data!$L$33:$L$82,$D40,1)+INDEX(Data!$M$33:$M$82,$D40,1)+INDEX(Data!$N$33:$N$82,$D40,1),(INDEX(Data!$K$33:$K$82,$D40,1)+INDEX(Data!$L$33:$L$82,$D40,1)+INDEX(Data!$M$33:$M$82,$D40,1)+INDEX(Data!$N$33:$N$82,$D40,1))/(5*$E40)),\"\")","v":86},{"$f":"IFERROR(INDEX(Data!$K$33:$K$82,$D40,1)/(5*$E40),\"\")","v":5.7894736842105263E-2},{"$f":"IFERROR(INDEX(Data!$L$33:$L$82,$D40,1)/(5*$E40),\"\")","v":7.3684210526315783E-2},{"$f":"IFERROR(INDEX(Data!$M$33:$M$82,$D40,1)/(5*$E40),\"\")","v":0.23157894736842105},{"$f":"IFERROR(INDEX(Data!$N$33:$N$82,$D40,1)/(5*$E40),\"\")","v":8.9473684210526316E-2},0,"","",0,"","",0,"",""]
[null,{"$f":"'Report A'!$B42","v":"2014-07-11"},{"$f":"'Report A'!$C42","v":"Friday"},{"$f":"'Report A'!$D42","v":11},{"$f":"IFERROR(INDEX(Data!$J$33:$J$82,$D41,1),\"\")","v":38},{"$f":"IFERROR(IF($G$16=TRUE,INDEX(Data!$K$33:$K$82,$D41,1),INDEX(Data!$K$33:$K$82,$D41,1)/$E41),\"\")","v":17},{"$f":"IFERROR(IF($G$16=TRUE,INDEX(Data!$L$33:$L$82,$D41,1),INDEX(Data!$L$33:$L$82,$D41,1)/(2*$E41)),\"\")","v":21},{"$f":"IFERROR(IF($G$16=TRUE,INDEX(Data!$M$33:$M$82,$D41,1),INDEX(Data!$M$33:$M$82,$D41,1)/$E41),\"\")","v":61},{"$f":"IFERROR(IF($G$16=TRUE,INDEX(Data!$N$33:$N$82,$D41,1),INDEX(Data!$N$33:$N$82,$D41,1)/$E41),\"\")","v":16},{"$f":"IFERROR(IF($G$16=TRUE,INDEX(Data!$K$33:$K$82,$D41,1)+INDEX(Data!$L$33:$L$82,$D41,1)+INDEX(Data!$M$33:$M$82,$D41,1)+INDEX(Data!$N$33:$N$82,$D41,1),(INDEX(Data!$K$33:$K$82,$D41,1)+INDEX(Data!$L$33:$L$82,$D41,1)+INDEX(Data!$M$33:$M$82,$D41,1)+INDEX(Data!$N$33:$N$82,$D41,1))/(5*$E41)),\"\")","v":115},{"$f":"IFERROR(INDEX(Data!$K$33:$K$82,$D41,1)/(5*$E41),\"\")","v":8.9473684210526316E-2},{"$f":"IFERROR(INDEX(Data!$L$33:$L$82,$D41,1)/(5*$E41),\"\")","v":0.11052631578947368},{"$f":"IFERROR(INDEX(Data!$M$33:$M$82,$D41,1)/(5*$E41),\"\")","v":0.32105263157894737},{"$f":"IFERROR(INDEX(Data!$N$33:$N$82,$D41,1)/(5*$E41),\"\")","v":8.4210526315789472E-2},0,"","",0,"","",0,"",""]
[null,{"$f":"'Report A'!$B43","v":"2014-07-12"},{"$f":"'Report A'!$C43","v":"Saturday"},{"$f":"'Report A'!$D43","v":12},{"$f":"IFERROR(INDEX(Data!$J$33:$J$82,$D42,1),\"\")","v":38},{"$f":"IFERROR(IF($G$16=TRUE,INDEX(Data!$K$33:$K$82,$D42,1),INDEX(Data!$K$33:$K$82,$D42,1)/$E42),\"\")","v":18},{"$f":"IFERROR(IF($G$16=TRUE,INDEX(Data!$L$33:$L$82,$D42,1),INDEX(Data!$L$33:$L$82,$D42,1)/(2*$E42)),\"\")","v":22},{"$f":"IFERROR(IF($G$16=TRUE,INDEX(Data!$M$33:$M$82,$D42,1),INDEX(Data!$M$33:$M$82,$D42,1)/$E42),\"\")","v":64},{"$f":"IFERROR(IF($G$16=TRUE,INDEX(Data!$N$33:$N$82,$D42,1),INDEX(Data!$N$33:$N$82,$D42,1)/$E42),\"\")","v":11},{"$f":"IFERROR(IF($G$16=TRUE,INDEX(Data!$K$33:$K$82,$D42,1)+INDEX(Data!$L$33:$L$82,$D42,1)+INDEX(Data!$M$33:$M$82,$D42,1)+INDEX(Data!$N$33:$N$82,$D42,1),(INDEX(Data!$K$33:$K$82,$D42,1)+INDEX(Data!$L$33:$L$82,$D42,1)+INDEX(Data!$M$33:$M$82,$D42,1)+INDEX(Data!$N$33:$N$82,$D42,1))/(5*$E42)),\"\")","v":115},{"$f":"IFERROR(INDEX(Data!$K$33:$K$82,$D42,1)/(5*$E42),\"\")","v":9.4736842105263161E-2},{"$f":"IFERROR(INDEX(Data!$L$33:$L$82,$D42,1)/(5*$E42),\"\")","v":0.11578947368421053},{"$f":"IFERROR(INDEX(Data!$M$33:$M$82,$D42,1)/(5*$E42),\"\")","v":0.33684210526315789},{"$f":"IFERROR(INDEX(Data!$N$33:$N$82,$D42,1)/(5*$E42),\"\")","v":5.7894736842105263E-2},0,"","",0,"","",0,"",""]
[null,{"$f":"'Report A'!$B44","v":"2014-07-13"},{"$f":"'Report A'!$C44","v":"Sunday"},{"$f":"'Report A'!$D44","v":13},{"$f":"IFERROR(INDEX(Data!$J$33:$J$82,$D43,1),\"\")","v":38},{"$f":"IFERROR(IF($G$16=TRUE,INDEX(Data!$K$33:$K$82,$D43,1),INDEX(Data!$K$33:$K$82,$D43,1)/$E43),\"\")","v":14},{"$f":"IFERROR(IF($G$16=TRUE,INDEX(Data!$L$33:$L$82,$D43,1),INDEX(Data!$L$33:$L$82,$D43,1)/(2*$E43)),\"\")","v":26},{"$f":"IFERROR(IF($G$16=TRUE,INDEX(Data!$M$33:$M$82,$D43,1),INDEX(Data!$M$33:$M$82,$D43,1)/$E43),\"\")","v":32},{"$f":"IFERROR(IF($G$16=TRUE,INDEX(Data!$N$33:$N$82,$D43,1),INDEX(Data!$N$33:$N$82,$D43,1)/$E43),\"\")","v":12},{"$f":"IFERROR(IF($G$16=TRUE,INDEX(Data!$K$33:$K$82,$D43,1)+INDEX(Data!$L$33:$L$82,$D43,1)+INDEX(Data!$M$33:$M$82,$D43,1)+INDEX(Data!$N$33:$N$82,$D43,1),(INDEX(Data!$K$33:$K$82,$D43,1)+INDEX(Data!$L$33:$L$82,$D43,1)+INDEX(Data!$M$33:$M$82,$D43,1)+INDEX(Data!$N$33:$N$82,$D43,1))/(5*$E43)),\"\")","v":84},{"$f":"IFERROR(INDEX(Data!$K$33:$K$82,$D43,1)/(5*$E43),\"\")","v":7.3684210526315783E-2},{"$f":"IFERROR(INDEX(Data!$L$33:$L$82,$D43,1)/(5*$E43),\"\")","v":0.1368421052631579},{"$f":"IFERROR(INDEX(Data!$M$33:$M$82,$D43,1)/(5*$E43),\"\")","v":0.16842105263157894},{"$f":"IFERROR(INDEX(Data!$N$33:$N$82,$D43,1)/(5*$E43),\"\")","v":6.3157894736842107E-2},0,"","",0,"","",0,"",""]
[null,{"$f":"'Report A'!$B45","v":"2014-07-14"},{"$f":"'Report A'!$C45","v":"Monday"},{"$f":"'Report A'!$D45","v":14},{"$f":"IFERROR(INDEX(Data!$J$33:$J$82,$D44,1),\"\")","v":38},{"$f":"IFERROR(IF($G$16=TRUE,INDEX(Data!$K$33:$K$82,$D44,1),INDEX(Data!$K$33:$K$82,$D44,1)/$E44),\"\")","v":14},{"$f":"IFERROR(IF($G$16=TRUE,INDEX(Data!$L$33:$L$82,$D44,1),INDEX(Data!$L$33:$L$82,$D44,1)/(2*$E44)),\"\")","v":26},{"$f":"IFERROR(IF($G$16=TRUE,INDEX(Data!$M$33:$M$82,$D44,1),INDEX(Data!$M$33:$M$82,$D44,1)/$E44),\"\")","v":63},{"$f":"IFERROR(IF($G$16=TRUE,INDEX(Data!$N$33:$N$82,$D44,1),INDEX(Data!$N$33:$N$82,$D44,1)/$E44),\"\")","v":16},{"$f":"IFERROR(IF($G$16=TRUE,INDEX(Data!$K$33:$K$82,$D44,1)+INDEX(Data!$L$33:$L$82,$D44,1)+INDEX(Data!$M$33:$M$82,$D44,1)+INDEX(Data!$N$33:$N$82,$D44,1),(INDEX(Data!$K$33:$K$82,$D44,1)+INDEX(Data!$L$33:$L$82,$D44,1)+INDEX(Data!$M$33:$M$82,$D44,1)+INDEX(Data!$N$33:$N$82,$D44,1))/(5*$E44)),\"\")","v":119},{"$f":"IFERROR(INDEX(Data!$K$33:$K$82,$D44,1)/(5*$E44),\"\")","v":7.3684210526315783E-2},{"$f":"IFERROR(INDEX(Data!$L$33:$L$82,$D44,1)/(5*$E44),\"\")","v":0.1368421052631579},{"$f":"IFERROR(INDEX(Data!$M$33:$M$82,$D44,1)/(5*$E44),\"\")","v":0.33157894736842103},{"$f":"IFERROR(INDEX(Data!$N$33:$N$82,$D44,1)/(5*$E44),\"\")","v":8.4210526315789472E-2},0,"","",0,"","",0,"",""]
[null,{"$f":"'Report A'!$B46","v":"2014-07-15"},{"$f":"'Report A'!$C46","v":"Tuesday"},{"$f":"'Report A'!$D46","v":15},{"$f":"IFERROR(INDEX(Data!$J$33:$J$82,$D45,1),\"\")","v":38},{"$f":"IFERROR(IF($G$16=TRUE,INDEX(Data!$K$33:$K$82,$D45,1),INDEX(Data!$K$33:$K$82,$D45,1)/$E45),\"\")","v":34},{"$f":"IFERROR(IF($G$16=TRUE,INDEX(Data!$L$33:$L$82,$D45,1),INDEX(Data!$L$33:$L$82,$D45,1)/(2*$E45)),\"\")","v":31},{"$f":"IFERROR(IF($G$16=TRUE,INDEX(Data!$M$33:$M$82,$D45,1),INDEX(Data!$M$33:$M$82,$D45,1)/$E45),\"\")","v":30},{"$f":"IFERROR(IF($G$16=TRUE,INDEX(Data!$N$33:$N$82,$D45,1),INDEX(Data!$N$33:$N$82,$D45,1)/$E45),\"\")","v":9},{"$f":"IFERROR(IF($G$16=TRUE,INDEX(Data!$K$33:$K$82,$D45,1)+INDEX(Data!$L$33:$L$82,$D45,1)+INDEX(Data!$M$33:$M$82,$D45,1)+INDEX(Data!$N$33:$N$82,$D45,1),(INDEX(Data!$K$33:$K$82,$D45,1)+INDEX(Data!$L$33:$L$82,$D45,1)+INDEX(Data!$M$33:$M$82,$D45,1)+INDEX(Data!$N$33:$N$82,$D45,1))/(5*$E45)),\"\")","v":104},{"$f":"IFERROR(INDEX(Data!$K$33:$K$82,$D45,1)/(5*$E45),\"\")","v":0.17894736842105263},{"$f":"IFERROR(INDEX(Data!$L$33:$L$82,$D45,1)/(5*$E45),\"\")","v":0.16315789473684211},{"$f":"IFERROR(INDEX(Data!$M$33:$M$82,$D45,1)/(5*$E45),\"\")","v":0.15789473684210525},{"$f":"IFERROR(INDEX(Data!$N$33:$N$82,$D45,1)/(5*$E45),\"\")","v":4.736842105263158E-2},0,"","",0,"","",0,"",""]
[null,{"$f":"'Report A'!$B47","v":"2014-07-16"},{"$f":"'Report A'!$C47","v":"Wednesday"},{"$f":"'Report A'!$D47","v":16},{"$f":"IFERROR(INDEX(Data!$J$33:$J$82,$D46,1),\"\")","v":38},{"$f":"IFERROR(IF($G$16=TRUE,INDEX(Data!$K$33:$K$82,$D46,1),INDEX(Data!$K$33:$K$82,$D46,1)/$E46),\"\")","v":11},{"$f":"IFERROR(IF($G$16=TRUE,INDEX(Data!$L$33:$L$82,$D46,1),INDEX(Data!$L$33:$L$82,$D46,1)/(2*$E46)),\"\")","v":29},{"$f":"IFERROR(IF($G$16=TRUE,INDEX(Data!$M$33:$M$82,$D46,1),INDEX(Data!$M$33:$M$82,$D46,1)/$E46),\"\")","v":27},{"$f":"IFERROR(IF($G$16=TRUE,INDEX(Data!$N$33:$N$82,$D46,1),INDEX(Data!$N$33:$N$82,$D46,1)/$E46),\"\")","v":17},{"$f":"IFERROR(IF($G$16=TRUE,INDEX(Data!$K$33:$K$82,$D46,1)+INDEX(Data!$L$33:$L$82,$D46,1)+INDEX(Data!$M$33:$M$82,$D46,1)+INDEX(Data!$N$33:$N$82,$D46,1),(INDEX(Data!$K$33:$K$82,$D46,1)+INDEX(Data!$L$33:$L$82,$D46,1)+INDEX(Data!$M$33:$M$82,$D46,1)+INDEX(Data!$N$33:$N$82,$D46,1))/(5*$E46)),\"\")","v":84},{"$f":"IFERROR(INDEX(Data!$K$33:$K$82,$D46,1)/(5*$E46),\"\")","v":5.7894736842105263E-2},{"$f":"IFERROR(INDEX(Data!$L$33:$L$82,$D46,1)/(5*$E46),\"\")","v":0.15263157894736842},{"$f":"IFERROR(INDEX(Data!$M$33:$M$82,$D46,1)/(5*$E46),\"\")","v":0.14210526315789473},{"$f":"IFERROR(INDEX(Data!$N$33:$N$82,$D46,1)/(5*$E46),\"\")","v":8.9473684210526316E-2},0,"","",0,"","",0,"",""]
[null,{"$f":"'Report A'!$B48","v":"2014-07-17"},{"$f":"'Report A'!$C48","v":"Thursday"},{"$f":"'Report A'!$D48","v":17},{"$f":"IFERROR(INDEX(Data!$J$33:$J$82,$D47,1),\"\")","v":38},{"$f":"IFERROR(IF($G$16=TRUE,INDEX(Data!$K$33:$K$82,$D47,1),INDEX(Data!$K$33:$K$82,$D47,1)/$E47),\"\")","v":8},{"$f":"IFERROR(IF($G$16=TRUE,INDEX(Data!$L$33:$L$82,$D47,1),INDEX(Data!$L$33:$L$82,$D47,1)/(2*$E47)),\"\")","v":18},{"$f":"IFERROR(IF($G$16=TRUE,INDEX(Data!$M$33:$M$82,$D47,1),INDEX(Data!$M$33:$M$82,$D47,1)/$E47),\"\")","v":32},{"$f":"IFERROR(IF($G$16=TRUE,INDEX(Data!$N$33:$N$82,$D47,1),INDEX(Data!$N$33:$N$82,$D47,1)/$E47),\"\")","v":14},{"$f":"IFERROR(IF($G$16=TRUE,INDEX(Data!$K$33:$K$82,$D47,1)+INDEX(Data!$L$33:$L$82,$D47,1)+INDEX(Data!$M$33:$M$82,$D47,1)+INDEX(Data!$N$33:$N$82,$D47,1),(INDEX(Data!$K$33:$K$82,$D47,1)+INDEX(Data!$L$33:$L$82,$D47,1)+INDEX(Data!$M$33:$M$82,$D47,1)+INDEX(Data!$N$33:$N$82,$D47,1))/(5*$E47)),\"\")","v":72},{"$f":"IFERROR(INDEX(Data!$K$33:$K$82,$D47,1)/(5*$E47),\"\")","v":4.2105263157894736E-2},{"$f":"IFERROR(INDEX(Data!$L$33:$L$82,$D47,1)/(5*$E47),\"\")","v":9.4736842105263161E-2},{"$f":"IFERROR(INDEX(Data!$M$33:$M$82,$D47,1)/(5*$E47),\"\")","v":0.16842105263157894},{"$f":"IFERROR(INDEX(Data!$N$33:$N$82,$D47,1)/(5*$E47),\"\")","v":7.3684210526315783E-2},0,"","",0,"","",0,"",""]
[null,{"$f":"'Report A'!$B49","v":"2014-07-18"},{"$f":"'Report A'!$C49","v":"Friday"},{"$f":"'Report A'!$D49","v":18},{"$f":"IFERROR(INDEX(Data!$J$33:$J$82,$D48,1),\"\")","v":38},{"$f":"IFERROR(IF($G$16=TRUE,INDEX(Data!$K$33:$K$82,$D48,1),INDEX(Data!$K$33:$K$82,$D48,1)/$E48),\"\")","v":14},{"$f":"IFERROR(IF($G$16=TRUE,INDEX(Data!$L$33:$L$82,$D48,1),INDEX(Data!$L$33:$L$82,$D48,1)/(2*$E48)),\"\")","v":31},{"$f":"IFERROR(IF($G$16=TRUE,INDEX(Data!$M$33:$M$82,$D48,1),INDEX(Data!$M$33:$M$82,$D48,1)/$E48),\"\")","v":55},{"$f":"IFERROR(IF($G$16=TRUE,INDEX(Data!$N$33:$N$82,$D48,1),INDEX(Data!$N$33:$N$82,$D48,1)/$E48),\"\")","v":14},{"$f":"IFERROR(IF($G$16=TRUE,INDEX(Data!$K$33:$K$82,$D48,1)+INDEX(Data!$L$33:$L$82,$D48,1)+INDEX(Data!$M$33:$M$82,$D48,1)+INDEX(Data!$N$33:$N$82,$D48,1),(INDEX(Data!$K$33:$K$82,$D48,1)+INDEX(Data!$L$33:$L$82,$D48,1)+INDEX(Data!$M$33:$M$82,$D48,1)+INDEX(Data!$N$33:$N$82,$D48,1))/(5*$E48)),\"\")","v":114},{"$f":"IFERROR(INDEX(Data!$K$33:$K$82,$D48,1)/(5*$E48),\"\")","v":7.3684210526315783E-2},{"$f":"IFERROR(INDEX(Data!$L$33:$L$82,$D48,1)/(5*$E48),\"\")","v":0.16315789473684211},{"$f":"IFERROR(INDEX(Data!$M$33:$M$82,$D48,1)/(5*$E48),\"\")","v":0.28947368421052633},{"$f":"IFERROR(INDEX(Data!$N$33:$N$82,$D48,1)/(5*$E48),\"\")","v":7.3684210526315783E-2},0,"","",0,"","",0,"",""]
[null,{"$f":"'Report A'!$B50","v":"2014-07-19"},{"$f":"'Report A'!$C50","v":"Saturday"},{"$f":"'Report A'!$D50","v":19},{"$f":"IFERROR(INDEX(Data!$J$33:$J$82,$D49,1),\"\")","v":38},{"$f":"IFERROR(IF($G$16=TRUE,INDEX(Data!$K$33:$K$82,$D49,1),INDEX(Data!$K$33:$K$82,$D49,1)/$E49),\"\")","v":14},{"$f":"IFERROR(IF($G$16=TRUE,INDEX(Data!$L$33:$L$82,$D49,1),INDEX(Data!$L$33:$L$82,$D49,1)/(2*$E49)),\"\")","v":29},{"$f":"IFERROR(IF($G$16=TRUE,INDEX(Data!$M$33:$M$82,$D49,1),INDEX(Data!$M$33:$M$82,$D49,1)/$E49),\"\")","v":60},{"$f":"IFERROR(IF($G$16=TRUE,INDEX(Data!$N$33:$N$82,$D49,1),INDEX(Data!$N$33:$N$82,$D49,1)/$E49),\"\")","v":24},{"$f":"IFERROR(IF($G$16=TRUE,INDEX(Data!$K$33:$K$82,$D49,1)+INDEX(Data!$L$33:$L$82,$D49,1)+INDEX(Data!$M$33:$M$82,$D49,1)+INDEX(Data!$N$33:$N$82,$D49,1),(INDEX(Data!$K$33:$K$82,$D49,1)+INDEX(Data!$L$33:$L$82,$D49,1)+INDEX(Data!$M$33:$M$82,$D49,1)+INDEX(Data!$N$33:$N$82,$D49,1))/(5*$E49)),\"\")","v":127},{"$f":"IFERROR(INDEX(Data!$K$33:$K$82,$D49,1)/(5*$E49),\"\")","v":7.3684210526315783E-2},{"$f":"IFERROR(INDEX(Data!$L$33:$L$82,$D49,1)/(5*$E49),\"\")","v":0.15263157894736842},{"$f":"IFERROR(INDEX(Data!$M$33:$M$82,$D49,1)/(5*$E49),\"\")","v":0.31578947368421051},{"$f":"IFERROR(INDEX(Data!$N$33:$N$82,$D49,1)/(5*$E49),\"\")","v":0.12631578947368421},0,"","",0,"","",0,"",""]
[null,{"$f":"'Report A'!$B51","v":"2014-07-20"},{"$f":"'Report A'!$C51","v":"Sunday"},{"$f":"'Report A'!$D51","v":20},{"$f":"IFERROR(INDEX(Data!$J$33:$J$82,$D50,1),\"\")","v":38},{"$f":"IFERROR(IF($G$16=TRUE,INDEX(Data!$K$33:$K$82,$D50,1),INDEX(Data!$K$33:$K$82,$D50,1)/$E50),\"\")","v":28},{"$f":"IFERROR(IF($G$16=TRUE,INDEX(Data!$L$33:$L$82,$D50,1),INDEX(Data!$L$33:$L$82,$D50,1)/(2*$E50)),\"\")","v":23},{"$f":"IFERROR(IF($G$16=TRUE,INDEX(Data!$M$33:$M$82,$D50,1),INDEX(Data!$M$33:$M$82,$D50,1)/$E50),\"\")","v":34},{"$f":"IFERROR(IF($G$16=TRUE,INDEX(Data!$N$33:$N$82,$D50,1),INDEX(Data!$N$33:$N$82,$D50,1)/$E50),\"\")","v":17},{"$f":"IFERROR(IF($G$16=TRUE,INDEX(Data!$K$33:$K$82,$D50,1)+INDEX(Data!$L$33:$L$82,$D50,1)+INDEX(Data!$M$33:$M$82,$D50,1)+INDEX(Data!$N$33:$N$82,$D50,1),(INDEX(Data!$K$33:$K$82,$D50,1)+INDEX(Data!$L$33:$L$82,$D50,1)+INDEX(Data!$M$33:$M$82,$D50,1)+INDEX(Data!$N$33:$N$82,$D50,1))/(5*$E50)),\"\")","v":102},{"$f":"IFERROR(INDEX(Data!$K$33:$K$82,$D50,1)/(5*$E50),\"\")","v":0.14736842105263157},{"$f":"IFERROR(INDEX(Data!$L$33:$L$82,$D50,1)/(5*$E50),\"\")","v":0.12105263157894737},{"$f":"IFERROR(INDEX(Data!$M$33:$M$82,$D50,1)/(5*$E50),\"\")","v":0.17894736842105263},{"$f":"IFERROR(INDEX(Data!$N$33:$N$82,$D50,1)/(5*$E50),\"\")","v":8.9473684210526316E-2},0,"","",0,"","",0,"",""]
[null,{"$f":"'Report A'!$B52","v":"2014-07-21"},{"$f":"'Report A'!$C52","v":"Monday"},{"$f":"'Report A'!$D52","v":21},{"$f":"IFERROR(INDEX(Data!$J$33:$J$82,$D51,1),\"\")","v":38},{"$f":"IFERROR(IF($G$16=TRUE,INDEX(Data!$K$33:$K$82,$D51,1),INDEX(Data!$K$33:$K$82,$D51,1)/$E51),\"\")","v":16},{"$f":"IFERROR(IF($G$16=TRUE,INDEX(Data!$L$33:$L$82,$D51,1),INDEX(Data!$L$33:$L$82,$D51,1)/(2*$E51)),\"\")","v":12},{"$f":"IFERROR(IF($G$16=TRUE,INDEX(Data!$M$33:$M$82,$D51,1),INDEX(Data!$M$33:$M$82,$D51,1)/$E51),\"\")","v":23},{"$f":"IFERROR(IF($G$16=TRUE,INDEX(Data!$N$33:$N$82,$D51,1),INDEX(Data!$N$33:$N$82,$D51,1)/$E51),\"\")","v":12},{"$f":"IFERROR(IF($G$16=TRUE,INDEX(Data!$K$33:$K$82,$D51,1)+INDEX(Data!$L$33:$L$82,$D51,1)+INDEX(Data!$M$33:$M$82,$D51,1)+INDEX(Data!$N$33:$N$82,$D51,1),(INDEX(Data!$K$33:$K$82,$D51,1)+INDEX(Data!$L$33:$L$82,$D51,1)+INDEX(Data!$M$33:$M$82,$D51,1)+INDEX(Data!$N$33:$N$82,$D51,1))/(5*$E51)),\"\")","v":63},{"$f":"IFERROR(INDEX(Data!$K$33:$K$82,$D51,1)/(5*$E51),\"\")","v":8.4210526315789472E-2},{"$f":"IFERROR(INDEX(Data!$L$33:$L$82,$D51,1)/(5*$E51),\"\")","v":6.3157894736842107E-2},{"$f":"IFERROR(INDEX(Data!$M$33:$M$82,$D51,1)/(5*$E51),\"\")","v":0.12105263157894737},{"$f":"IFERROR(INDEX(Data!$N$33:$N$82,$D51,1)/(5*$E51),\"\")","v":6.3157894736842107E-2},0,"","",0,"","",0,"",""]
[null,{"$f":"'Report A'!$B53","v":"2014-07-22"},{"$f":"'Report A'!$C53","v":"Tuesday"},{"$f":"'Report A'!$D53","v":22},{"$f":"IFERROR(INDEX(Data!$J$33:$J$82,$D52,1),\"\")","v":38},{"$f":"IFERROR(IF($G$16=TRUE,INDEX(Data!$K$33:$K$82,$D52,1),INDEX(Data!$K$33:$K$82,$D52,1)/$E52),\"\")","v":15},{"$f":"IFERROR(IF($G$16=TRUE,INDEX(Data!$L$33:$L$82,$D52,1),INDEX(Data!$L$33:$L$82,$D52,1)/(2*$E52)),\"\")","v":15},{"$f":"IFERROR(IF($G$16=TRUE,INDEX(Data!$M$33:$M$82,$D52,1),INDEX(Data!$M$33:$M$82,$D52,1)/$E52),\"\")","v":39},{"$f":"IFERROR(IF($G$16=TRUE,INDEX(Data!$N$33:$N$82,$D52,1),INDEX(Data!$N$33:$N$82,$D52,1)/$E52),\"\")","v":13},{"$f":"IFERROR(IF($G$16=TRUE,INDEX(Data!$K$33:$K$82,$D52,1)+INDEX(Data!$L$33:$L$82,$D52,1)+INDEX(Data!$M$33:$M$82,$D52,1)+INDEX(Data!$N$33:$N$82,$D52,1),(INDEX(Data!$K$33:$K$82,$D52,1)+INDEX(Data!$L$33:$L$82,$D52,1)+INDEX(Data!$M$33:$M$82,$D52,1)+INDEX(Data!$N$33:$N$82,$D52,1))/(5*$E52)),\"\")","v":82},{"$f":"IFERROR(INDEX(Data!$K$33:$K$82,$D52,1)/(5*$E52),\"\")","v":7.8947368421052627E-2},{"$f":"IFERROR(INDEX(Data!$L$33:$L$82,$D52,1)/(5*$E52),\"\")","v":7.8947368421052627E-2},{"$f":"IFERROR(INDEX(Data!$M$33:$M$82,$D52,1)/(5*$E52),\"\")","v":0.20526315789473684},{"$f":"IFERROR(INDEX(Data!$N$33:$N$82,$D52,1)/(5*$E52),\"\")","v":6.8421052631578952E-2},0,"","",0,"","",0,"",""]
[null,{"$f":"'Report A'!$B54","v":"2014-07-23"},{"$f":"'Report A'!$C54","v":"Wednesday"},{"$f":"'Report A'!$D54","v":23},{"$f":"IFERROR(INDEX(Data!$J$33:$J$82,$D53,1),\"\")","v":38},{"$f":"IFERROR(IF($G$16=TRUE,INDEX(Data!$K$33:$K$82,$D53,1),INDEX(Data!$K$33:$K$82,$D53,1)/$E53),\"\")","v":16},{"$f":"IFERROR(IF($G$16=TRUE,INDEX(Data!$L$33:$L$82,$D53,1),INDEX(Data!$L$33:$L$82,$D53,1)/(2*$E53)),\"\")","v":22},{"$f":"IFERROR(IF($G$16=TRUE,INDEX(Data!$M$33:$M$82,$D53,1),INDEX(Data!$M$33:$M$82,$D53,1)/$E53),\"\")","v":28},{"$f":"IFERROR(IF($G$16=TRUE,INDEX(Data!$N$33:$N$82,$D53,1),INDEX(Data!$N$33:$N$82,$D53,1)/$E53),\"\")","v":4},{"$f":"IFERROR(IF($G$16=TRUE,INDEX(Data!$K$33:$K$82,$D53,1)+INDEX(Data!$L$33:$L$82,$D53,1)+INDEX(Data!$M$33:$M$82,$D53,1)+INDEX(Data!$N$33:$N$82,$D53,1),(INDEX(Data!$K$33:$K$82,$D53,1)+INDEX(Data!$L$33:$L$82,$D53,1)+INDEX(Data!$M$33:$M$82,$D53,1)+INDEX(Data!$N$33:$N$82,$D53,1))/(5*$E53)),\"\")","v":70},{"$f":"IFERROR(INDEX(Data!$K$33:$K$82,$D53,1)/(5*$E53),\"\")","v":8.4210526315789472E-2},{"$f":"IFERROR(INDEX(Data!$L$33:$L$82,$D53,1)/(5*$E53),\"\")","v":0.11578947368421053},{"$f":"IFERROR(INDEX(Data!$M$33:$M$82,$D53,1)/(5*$E53),\"\")","v":0.14736842105263157},{"$f":"IFERROR(INDEX(Data!$N$33:$N$82,$D53,1)/(5*$E53),\"\")","v":2.1052631578947368E-2},0,"","",0,"","",0,"",""]
[null,{"$f":"'Report A'!$B55","v":"2014-07-24"},{"$f":"'Report A'!$C55","v":"Thursday"},{"$f":"'Report A'!$D55","v":24},{"$f":"IFERROR(INDEX(Data!$J$33:$J$82,$D54,1),\"\")","v":38},{"$f":"IFERROR(IF($G$16=TRUE,INDEX(Data!$K$33:$K$82,$D54,1),INDEX(Data!$K$33:$K$82,$D54,1)/$E54),\"\")","v":17},{"$f":"IFERROR(IF($G$16=TRUE,INDEX(Data!$L$33:$L$82,$D54,1),INDEX(Data!$L$33:$L$82,$D54,1)/(2*$E54)),\"\")","v":24},{"$f":"IFERROR(IF($G$16=TRUE,INDEX(Data!$M$33:$M$82,$D54,1),INDEX(Data!$M$33:$M$82,$D54,1)/$E54),\"\")","v":45},{"$f":"IFERROR(IF($G$16=TRUE,INDEX(Data!$N$33:$N$82,$D54,1),INDEX(Data!$N$33:$N$82,$D54,1)/$E54),\"\")","v":19},{"$f":"IFERROR(IF($G$16=TRUE,INDEX(Data!$K$33:$K$82,$D54,1)+INDEX(Data!$L$33:$L$82,$D54,1)+INDEX(Data!$M$33:$M$82,$D54,1)+INDEX(Data!$N$33:$N$82,$D54,1),(INDEX(Data!$K$33:$K$82,$D54,1)+INDEX(Data!$L$33:$L$82,$D54,1)+INDEX(Data!$M$33:$M$82,$D54,1)+INDEX(Data!$N$33:$N$82,$D54,1))/(5*$E54)),\"\")","v":105},{"$f":"IFERROR(INDEX(Data!$K$33:$K$82,$D54,1)/(5*$E54),\"\")","v":8.9473684210526316E-2},{"$f":"IFERROR(INDEX(Data!$L$33:$L$82,$D54,1)/(5*$E54),\"\")","v":0.12631578947368421},{"$f":"IFERROR(INDEX(Data!$M$33:$M$82,$D54,1)/(5*$E54),\"\")","v":0.23684210526315788},{"$f":"IFERROR(INDEX(Data!$N$33:$N$82,$D54,1)/(5*$E54),\"\")","v":0.1},0,"","",0,"","",0,"",""]
[null,{"$f":"'Report A'!$B56","v":"2014-07-25"},{"$f":"'Report A'!$C56","v":"Friday"},{"$f":"'Report A'!$D56","v":25},{"$f":"IFERROR(INDEX(Data!$J$33:$J$82,$D55,1),\"\")","v":38},{"$f":"IFERROR(IF($G$16=TRUE,INDEX(Data!$K$33:$K$82,$D55,1),INDEX(Data!$K$33:$K$82,$D55,1)/$E55),\"\")","v":25},{"$f":"IFERROR(IF($G$16=TRUE,INDEX(Data!$L$33:$L$82,$D55,1),INDEX(Data!$L$33:$L$82,$D55,1)/(2*$E55)),\"\")","v":29},{"$f":"IFERROR(IF($G$16=TRUE,INDEX(Data!$M$33:$M$82,$D55,1),INDEX(Data!$M$33:$M$82,$D55,1)/$E55),\"\")","v":65},{"$f":"IFERROR(IF($G$16=TRUE,INDEX(Data!$N$33:$N$82,$D55,1),INDEX(Data!$N$33:$N$82,$D55,1)/$E55),\"\")","v":11},{"$f":"IFERROR(IF($G$16=TRUE,INDEX(Data!$K$33:$K$82,$D55,1)+INDEX(Data!$L$33:$L$82,$D55,1)+INDEX(Data!$M$33:$M$82,$D55,1)+INDEX(Data!$N$33:$N$82,$D55,1),(INDEX(Data!$K$33:$K$82,$D55,1)+INDEX(Data!$L$33:$L$82,$D55,1)+INDEX(Data!$M$33:$M$82,$D55,1)+INDEX(Data!$N$33:$N$82,$D55,1))/(5*$E55)),\"\")","v":130},{"$f":"IFERROR(INDEX(Data!$K$33:$K$82,$D55,1)/(5*$E55),\"\")","v":0.13157894736842105},{"$f":"IFERROR(INDEX(Data!$L$33:$L$82,$D55,1)/(5*$E55),\"\")","v":0.15263157894736842},{"$f":"IFERROR(INDEX(Data!$M$33:$M$82,$D55,1)/(5*$E55),\"\")","v":0.34210526315789475},{"$f":"IFERROR(INDEX(Data!$N$33:$N$82,$D55,1)/(5*$E55),\"\")","v":5.7894736842105263E-2},0,"","",0,"","",0,"",""]
[null,{"$f":"'Report A'!$B57","v":"2014-07-26"},{"$f":"'Report A'!$C57","v":"Saturday"},{"$f":"'Report A'!$D57","v":26},{"$f":"IFERROR(INDEX(Data!$J$33:$J$82,$D56,1),\"\")","v":38},{"$f":"IFERROR(IF($G$16=TRUE,INDEX(Data!$K$33:$K$82,$D56,1),INDEX(Data!$K$33:$K$82,$D56,1)/$E56),\"\")","v":29},{"$f":"IFERROR(IF($G$16=TRUE,INDEX(Data!$L$33:$L$82,$D56,1),INDEX(Data!$L$33:$L$82,$D56,1)/(2*$E56)),\"\")","v":18},{"$f":"IFERROR(IF($G$16=TRUE,INDEX(Data!$M$33:$M$82,$D56,1),INDEX(Data!$M$33:$M$82,$D56,1)/$E56),\"\")","v":62},{"$f":"IFERROR(IF($G$16=TRUE,INDEX(Data!$N$33:$N$82,$D56,1),INDEX(Data!$N$33:$N$82,$D56,1)/$E56),\"\")","v":18},{"$f":"IFERROR(IF($G$16=TRUE,INDEX(Data!$K$33:$K$82,$D56,1)+INDEX(Data!$L$33:$L$82,$D56,1)+INDEX(Data!$M$33:$M$82,$D56,1)+INDEX(Data!$N$33:$N$82,$D56,1),(INDEX(Data!$K$33:$K$82,$D56,1)+INDEX(Data!$L$33:$L$82,$D56,1)+INDEX(Data!$M$33:$M$82,$D56,1)+INDEX(Data!$N$33:$N$82,$D56,1))/(5*$E56)),\"\")","v":127},{"$f":"IFERROR(INDEX(Data!$K$33:$K$82,$D56,1)/(5*$E56),\"\")","v":0.15263157894736842},{"$f":"IFERROR(INDEX(Data!$L$33:$L$82,$D56,1)/(5*$E56),\"\")","v":9.4736842105263161E-2},{"$f":"IFERROR(INDEX(Data!$M$33:$M$82,$D56,1)/(5*$E56),\"\")","v":0.32631578947368423},{"$f":"IFERROR(INDEX(Data!$N$33:$N$82,$D56,1)/(5*$E56),\"\")","v":9.4736842105263161E-2},0,"","",0,"","",0,"",""]
[null,{"$f":"'Report A'!$B58","v":"2014-07-27"},{"$f":"'Report A'!$C58","v":"Sunday"},{"$f":"'Report A'!$D58","v":27},{"$f":"IFERROR(INDEX(Data!$J$33:$J$82,$D57,1),\"\")","v":38},{"$f":"IFERROR(IF($G$16=TRUE,INDEX(Data!$K$33:$K$82,$D57,1),INDEX(Data!$K$33:$K$82,$D57,1)/$E57),\"\")","v":28},{"$f":"IFERROR(IF($G$16=TRUE,INDEX(Data!$L$33:$L$82,$D57,1),INDEX(Data!$L$33:$L$82,$D57,1)/(2*$E57)),\"\")","v":29},{"$f":"IFERROR(IF($G$16=TRUE,INDEX(Data!$M$33:$M$82,$D57,1),INDEX(Data!$M$33:$M$82,$D57,1)/$E57),\"\")","v":63},{"$f":"IFERROR(IF($G$16=TRUE,INDEX(Data!$N$33:$N$82,$D57,1),INDEX(Data!$N$33:$N$82,$D57,1)/$E57),\"\")","v":15},{"$f":"IFERROR(IF($G$16=TRUE,INDEX(Data!$K$33:$K$82,$D57,1)+INDEX(Data!$L$33:$L$82,$D57,1)+INDEX(Data!$M$33:$M$82,$D57,1)+INDEX(Data!$N$33:$N$82,$D57,1),(INDEX(Data!$K$33:$K$82,$D57,1)+INDEX(Data!$L$33:$L$82,$D57,1)+INDEX(Data!$M$33:$M$82,$D57,1)+INDEX(Data!$N$33:$N$82,$D57,1))/(5*$E57)),\"\")","v":135},{"$f":"IFERROR(INDEX(Data!$K$33:$K$82,$D57,1)/(5*$E57),\"\")","v":0.14736842105263157},{"$f":"IFERROR(INDEX(Data!$L$33:$L$82,$D57,1)/(5*$E57),\"\")","v":0.15263157894736842},{"$f":"IFERROR(INDEX(Data!$M$33:$M$82,$D57,1)/(5*$E57),\"\")","v":0.33157894736842103},{"$f":"IFERROR(INDEX(Data!$N$33:$N$82,$D57,1)/(5*$E57),\"\")","v":7.8947368421052627E-2},0,"","",0,"","",0,"",""]
[null,{"$f":"'Report A'!$B59","v":"2014-07-28"},{"$f":"'Report A'!$C59","v":"Monday"},{"$f":"'Report A'!$D59","v":28},{"$f":"IFERROR(INDEX(Data!$J$33:$J$82,$D58,1),\"\")","v":38},{"$f":"IFERROR(IF($G$16=TRUE,INDEX(Data!$K$33:$K$82,$D58,1),INDEX(Data!$K$33:$K$82,$D58,1)/$E58),\"\")","v":30},{"$f":"IFERROR(IF($G$16=TRUE,INDEX(Data!$L$33:$L$82,$D58,1),INDEX(Data!$L$33:$L$82,$D58,1)/(2*$E58)),\"\")","v":41},{"$f":"IFERROR(IF($G$16=TRUE,INDEX(Data!$M$33:$M$82,$D58,1),INDEX(Data!$M$33:$M$82,$D58,1)/$E58),\"\")","v":64},{"$f":"IFERROR(IF($G$16=TRUE,INDEX(Data!$N$33:$N$82,$D58,1),INDEX(Data!$N$33:$N$82,$D58,1)/$E58),\"\")","v":22},{"$f":"IFERROR(IF($G$16=TRUE,INDEX(Data!$K$33:$K$82,$D58,1)+INDEX(Data!$L$33:$L$82,$D58,1)+INDEX(Data!$M$33:$M$82,$D58,1)+INDEX(Data!$N$33:$N$82,$D58,1),(INDEX(Data!$K$33:$K$82,$D58,1)+INDEX(Data!$L$33:$L$82,$D58,1)+INDEX(Data!$M$33:$M$82,$D58,1)+INDEX(Data!$N$33:$N$82,$D58,1))/(5*$E58)),\"\")","v":157},{"$f":"IFERROR(INDEX(Data!$K$33:$K$82,$D58,1)/(5*$E58),\"\")","v":0.15789473684210525},{"$f":"IFERROR(INDEX(Data!$L$33:$L$82,$D58,1)/(5*$E58),\"\")","v":0.21578947368421053},{"$f":"IFERROR(INDEX(Data!$M$33:$M$82,$D58,1)/(5*$E58),\"\")","v":0.33684210526315789},{"$f":"IFERROR(INDEX(Data!$N$33:$N$82,$D58,1)/(5*$E58),\"\")","v":0.11578947368421053},0,"","",0,"","",0,"",""]
[null,{"$f":"'Report A'!$B60","v":"2014-07-29"},{"$f":"'Report A'!$C60","v":"Tuesday"},{"$f":"'Report A'!$D60","v":29},{"$f":"IFERROR(INDEX(Data!$J$33:$J$82,$D59,1),\"\")","v":38},{"$f":"IFERROR(IF($G$16=TRUE,INDEX(Data!$K$33:$K$82,$D59,1),INDEX(Data!$K$33:$K$82,$D59,1)/$E59),\"\")","v":33},{"$f":"IFERROR(IF($G$16=TRUE,INDEX(Data!$L$33:$L$82,$D59,1),INDEX(Data!$L$33:$L$82,$D59,1)/(2*$E59)),\"\")","v":38},{"$f":"IFERROR(IF($G$16=TRUE,INDEX(Data!$M$33:$M$82,$D59,1),INDEX(Data!$M$33:$M$82,$D59,1)/$E59),\"\")","v":45},{"$f":"IFERROR(IF($G$16=TRUE,INDEX(Data!$N$33:$N$82,$D59,1),INDEX(Data!$N$33:$N$82,$D59,1)/$E59),\"\")","v":13},{"$f":"IFERROR(IF($G$16=TRUE,INDEX(Data!$K$33:$K$82,$D59,1)+INDEX(Data!$L$33:$L$82,$D59,1)+INDEX(Data!$M$33:$M$82,$D59,1)+INDEX(Data!$N$33:$N$82,$D59,1),(INDEX(Data!$K$33:$K$82,$D59,1)+INDEX(Data!$L$33:$L$82,$D59,1)+INDEX(Data!$M$33:$M$82,$D59,1)+INDEX(Data!$N$33:$N$82,$D59,1))/(5*$E59)),\"\")","v":129},{"$f":"IFERROR(INDEX(Data!$K$33:$K$82,$D59,1)/(5*$E59),\"\")","v":0.1736842105263158},{"$f":"IFERROR(INDEX(Data!$L$33:$L$82,$D59,1)/(5*$E59),\"\")","v":0.2},{"$f":"IFERROR(INDEX(Data!$M$33:$M$82,$D59,1)/(5*$E59),\"\")","v":0.23684210526315788},{"$f":"IFERROR(INDEX(Data!$N$33:$N$82,$D59,1)/(5*$E59),\"\")","v":6.8421052631578952E-2},0,"","",0,"","",0,"",""]
[null,{"$f":"'Report A'!$B61","v":"2014-07-30"},{"$f":"'Report A'!$C61","v":"Wednesday"},{"$f":"'Report A'!$D61","v":30},{"$f":"IFERROR(INDEX(Data!$J$33:$J$82,$D60,1),\"\")","v":38},{"$f":"IFERROR(IF($G$16=TRUE,INDEX(Data!$K$33:$K$82,$D60,1),INDEX(Data!$K$33:$K$82,$D60,1)/$E60),\"\")","v":30},{"$f":"IFERROR(IF($G$16=TRUE,INDEX(Data!$L$33:$L$82,$D60,1),INDEX(Data!$L$33:$L$82,$D60,1)/(2*$E60)),\"\")","v":37},{"$f":"IFERROR(IF($G$16=TRUE,INDEX(Data!$M$33:$M$82,$D60,1),INDEX(Data!$M$33:$M$82,$D60,1)/$E60),\"\")","v":45},{"$f":"IFERROR(IF($G$16=TRUE,INDEX(Data!$N$33:$N$82,$D60,1),INDEX(Data!$N$33:$N$82,$D60,1)/$E60),\"\")","v":18},{"$f":"IFERROR(IF($G$16=TRUE,INDEX(Data!$K$33:$K$82,$D60,1)+INDEX(Data!$L$33:$L$82,$D60,1)+INDEX(Data!$M$33:$M$82,$D60,1)+INDEX(Data!$N$33:$N$82,$D60,1),(INDEX(Data!$K$33:$K$82,$D60,1)+INDEX(Data!$L$33:$L$82,$D60,1)+INDEX(Data!$M$33:$M$82,$D60,1)+INDEX(Data!$N$33:$N$82,$D60,1))/(5*$E60)),\"\")","v":130},{"$f":"IFERROR(INDEX(Data!$K$33:$K$82,$D60,1)/(5*$E60),\"\")","v":0.15789473684210525},{"$f":"IFERROR(INDEX(Data!$L$33:$L$82,$D60,1)/(5*$E60),\"\")","v":0.19473684210526315},{"$f":"IFERROR(INDEX(Data!$M$33:$M$82,$D60,1)/(5*$E60),\"\")","v":0.23684210526315788},{"$f":"IFERROR(INDEX(Data!$N$33:$N$82,$D60,1)/(5*$E60),\"\")","v":9.4736842105263161E-2},0,"","",0,"","",0,"",""]
[null,{"$f":"'Report A'!$B62","v":"2014-07-31"},{"$f":"'Report A'!$C62","v":"Thursday"},{"$f":"'Report A'!$D62","v":31},{"$f":"IFERROR(INDEX(Data!$J$33:$J$82,$D61,1),\"\")","v":38},{"$f":"IFERROR(IF($G$16=TRUE,INDEX(Data!$K$33:$K$82,$D61,1),INDEX(Data!$K$33:$K$82,$D61,1)/$E61),\"\")","v":25},{"$f":"IFERROR(IF($G$16=TRUE,INDEX(Data!$L$33:$L$82,$D61,1),INDEX(Data!$L$33:$L$82,$D61,1)/(2*$E61)),\"\")","v":33},{"$f":"IFERROR(IF($G$16=TRUE,INDEX(Data!$M$33:$M$82,$D61,1),INDEX(Data!$M$33:$M$82,$D61,1)/$E61),\"\")","v":50},{"$f":"IFERROR(IF($G$16=TRUE,INDEX(Data!$N$33:$N$82,$D61,1),INDEX(Data!$N$33:$N$82,$D61,1)/$E61),\"\")","v":14},{"$f":"IFERROR(IF($G$16=TRUE,INDEX(Data!$K$33:$K$82,$D61,1)+INDEX(Data!$L$33:$L$82,$D61,1)+INDEX(Data!$M$33:$M$82,$D61,1)+INDEX(Data!$N$33:$N$82,$D61,1),(INDEX(Data!$K$33:$K$82,$D61,1)+INDEX(Data!$L$33:$L$82,$D61,1)+INDEX(Data!$M$33:$M$82,$D61,1)+INDEX(Data!$N$33:$N$82,$D61,1))/(5*$E61)),\"\")","v":122},{"$f":"IFERROR(INDEX(Data!$K$33:$K$82,$D61,1)/(5*$E61),\"\")","v":0.13157894736842105},{"$f":"IFERROR(INDEX(Data!$L$33:$L$82,$D61,1)/(5*$E61),\"\")","v":0.1736842105263158},{"$f":"IFERROR(INDEX(Data!$M$33:$M$82,$D61,1)/(5*$E61),\"\")","v":0.26315789473684209},{"$f":"IFERROR(INDEX(Data!$N$33:$N$82,$D61,1)/(5*$E61),\"\")","v":7.3684210526315783E-2},0,"","",0,"","",0,"",""]

{"sheet":"Report C","index":4,"n_rows":61,"n_cols":15,"rows_kept":61,"cut":false,"hidden":false,"merged":[]}
[]
[]
[null,null,"MONTHLY SALES REPORTING BY OUTLET"]
[]
[]
[null,"SUBJECT","REPORT C : PAX BY CATEGORY AND AVERAGE PAX PER ROOM"]
[]
[null,"OUTLET",{"$f":"Data!$C$8","v":"SBA"}]
[]
[null,"MONTH / YEAR",{"$f":"Data!$C$10","v":"July 2014"}]
[]
[null,"MENU"]
[]
[null,"DATE","DAY","ROW","TOTAL PAX PER SESSION BY CATEGORY",null,null,null,null,"AVERAGE PAX PER ROOM BY ALL CATEGORY",null,null,null,null,{"$f":"\"CHART : PAX BY \"&$G$15&\" ( CATEGORY ) AND AVERAGE PAX PER ROOM\"","v":"CHART : PAX BY ALL ( CATEGORY ) AND AVERAGE PAX PER ROOM"}]
[null,null,null,null,"CHOOSE CATEGORY",null,"ALL"]
[null,null,null,null,"NOON K","HAPPY","NORMAL","MIDNIGHT","ALL","NOON K","HAPPY","NORMAL","MIDNIGHT","ALL"]
[null,null,null,null,"( pax )","( pax )","( pax )","( pax )","( pax )","( pax )","( pax )","( pax )","( pax )","( pax )"]
[null,"SUMMARY FOR MONTH",null,null,null,null,null,null,null,null,null,null,null,null,"LEGEND"]
[]
[null,"TOTAL PAX",null,null,{"$f":"SUM(E$31:E$61)","v":2092},{"$f":"SUM(F$31:F$61)","v":3099},5960,2223,13374,109.49284733540216,200.78859802192167,121.91157581970241,165.18873384269671,128.99101234536735]
[null,"AVERAGE PAX",null,null,{"$f":"IFERROR(SUM(E$31:E$61)/COUNTIF($D$31:$D$61,\">0\"),\"\")","v":67.483870967741936},{"$f":"IFERROR(SUM(F$31:F$61)/COUNTIF($D$31:$D$61,\">0\"),\"\")","v":99.967741935483872},192.25806451612902,71.709677419354833,431.41935483870969,3.5320273334000696,6.4770515490942477,3.9326314780549163,5.328668833635378,4.1610003982376567]
[null,"HIGHEST PAX",null,null,{"$f":"IFERROR(IF(LARGE(E$31:E$61,1)>0,LARGE(E$31:E$61,1),\"NIL\"),\"NIL\")","v":152},191,334,128,652,4.4705882352941178,72,5.1384615384615389,9.4444444444444446,5.0153846153846153]
[null,"LOWEST PAX",null,null,{"$f":"IFERROR(IF(LARGE(E$31:E$61,COUNTIF(E$31:E$61,\">0\"))<>E$22,LARGE(E$31:E$61,COUNTIF(E$31:E$61,\">0\")),\"NIL\"),\"NIL\")","v":24},47,66,16,231,2.7857142857142856,2.9375,2.6176470588235294,2.875,3.4215686274509802]
[null,"AVERAGE FOR ","MONDAY",null,{"$f":"IFERROR(SUMIF($C$31:$C$61,\"Monday*\",E$31:E$61)/COUNTIF($C$31:$C$61,\"Monday*\"),\"\")","v":68},{"$f":"IFERROR(SUMIF($C$31:$C$61,\"Monday*\",F$31:F$61)/COUNTIF($C$31:$C$61,\"Monday*\"),\"\")","v":109.25},207,58,442.25,3.6622023809523814,4.4468757647442692,3.9721431829361409,4.2219065656565657,4.0797911031144451]
[null,null,"TUESDAY",null,{"$f":"IFERROR(SUMIF($C$31:$C$61,\"Tuesday*\",E$31:E$61)/COUNTIF($C$31:$C$61,\"Tuesday*\"),\"\")","v":83.2},{"$f":"IFERROR(SUMIF($C$31:$C$61,\"Tuesday*\",F$31:F$61)/COUNTIF($C$31:$C$61,\"Tuesday*\"),\"\")","v":93},155.4,65.8,397.4,3.7788795518207281,4.2221915676287498,3.8349731663685156,6.9527583527583516,4.2174612249720962]
[null,null,"WEDNESDAY",null,{"$f":"IFERROR(SUMIF($C$31:$C$61,\"Wednesday*\",E$31:E$61)/COUNTIF($C$31:$C$61,\"Wednesday*\"),\"\")","v":56.4},{"$f":"IFERROR(SUMIF($C$31:$C$61,\"Wednesday*\",F$31:F$61)/COUNTIF($C$31:$C$61,\"Wednesday*\"),\"\")","v":101.6},139.80000000000001,80.599999999999994,378.4,3.350617715617715,4.2462697669087124,3.6296896763873505,6.2693627450980394,4.0668867214744271]
[null,null,"THURSDAY",null,{"$f":"IFERROR(SUMIF($C$31:$C$61,\"Thursday*\",E$31:E$61)/COUNTIF($C$31:$C$61,\"Thursday*\"),\"\")","v":53.2},{"$f":"IFERROR(SUMIF($C$31:$C$61,\"Thursday*\",F$31:F$61)/COUNTIF($C$31:$C$61,\"Thursday*\"),\"\")","v":96},174.2,93.8,417.2,3.6272673796791439,4.5321428571428575,3.777882908027645,6.1096859796550191,4.2568836147543729]
[null,null,"FRIDAY",null,{"$f":"IFERROR(SUMIF($C$31:$C$61,\"Friday*\",E$31:E$61)/COUNTIF($C$31:$C$61,\"Friday*\"),\"\")","v":61.25},{"$f":"IFERROR(SUMIF($C$31:$C$61,\"Friday*\",F$31:F$61)/COUNTIF($C$31:$C$61,\"Friday*\"),\"\")","v":146.5},287,44.5,539.25,3.7273949579831931,5.6857043540441756,4.613415682677978,3.5048295454545455,4.6306289640299401]
[null,null,"SATURDAY",null,{"$f":"IFERROR(SUMIF($C$31:$C$61,\"Saturday*\",E$31:E$61)/COUNTIF($C$31:$C$61,\"Saturday*\"),\"\")","v":63},{"$f":"IFERROR(SUMIF($C$31:$C$61,\"Saturday*\",F$31:F$61)/COUNTIF($C$31:$C$61,\"Saturday*\"),\"\")","v":73.75},258.25,78.5,473.5,3.0192255062944717,3.3479509248565509,4.3831929949399111,4.0571590909090904,3.9007572632016316]
[null,null,"SUNDAY",null,{"$f":"IFERROR(SUMIF($C$31:$C$61,\"Sunday*\",E$31:E$61)/COUNTIF($C$31:$C$61,\"Sunday*\"),\"\")","v":89.75},{"$f":"IFERROR(SUMIF($C$31:$C$61,\"Sunday*\",F$31:F$61)/COUNTIF($C$31:$C$61,\"Sunday*\"),\"\")","v":82},151,74.5,397.25,3.5184331797235027,20.465863222235036,3.4559599058921817,5.348529411764706,3.960036304494698]
[null,{"$f":"'Report A'!$B32","v":"2014-07-01"},{"$f":"'Report A'!$C32","v":"Tuesday"},{"$f":"'Report A'!$D32","v":1},{"$f":"IFERROR(IF($G$15=\"ALL\",SUMIFS(INDIRECT(\"Data!$AI$\"&$D31+32&\":$AS$\"&$D31+32),Data!$AI$30:$AS$30,E$16),SUMIFS(INDIRECT(\"Data!$AI$\"&$D31+32&\":$AS$\"&$D31+32),Data!$AI$30:$AS$30,E$16,Data!$AI$31:$AS$31,$G$15)),\"\")","v":24},{"$f":"IFERROR(IF($G$15=\"ALL\",SUMIFS(INDIRECT(\"Data!$AI$\"&$D31+32&\":$AS$\"&$D31+32),Data!$AI$30:$AS$30,F$16),SUMIFS(INDIRECT(\"Data!$AI$\"&$D31+32&\":$AS$\"&$D31+32),Data!$AI$30:$AS$30,F$16,Data!$AI$31:$AS$31,$G$15)),\"\")","v":96},{"$f":"IFERROR(IF($G$15=\"ALL\",SUMIFS(INDIRECT(\"Data!$AI$\"&$D31+32&\":$AS$\"&$D31+32),Data!$AI$30:$AS$30,G$16),SUMIFS(INDIRECT(\"Data!$AI$\"&$D31+32&\":$AS$\"&$D31+32),Data!$AI$30:$AS$30,G$16,Data!$AI$31:$AS$31,$G$15)),\"\")","v":182},{"$f":"IFERROR(IF($G$15=\"ALL\",SUMIFS(INDIRECT(\"Data!$AI$\"&$D31+32&\":$AS$\"&$D31+32),Data!$AI$30:$AS$30,H$16),SUMIFS(INDIRECT(\"Data!$AI$\"&$D31+32&\":$AS$\"&$D31+32),Data!$AI$30:$AS$30,H$16,Data!$AI$31:$AS$31,$G$15)),\"\")","v":65},{"$f":"IFERROR(SUM($E31:$H31),\"\")","v":367},{"$f":"IFERROR((SUMIFS(INDIRECT(\"Data!$AI$\"&$D31+32&\":$AS$\"&$D31+32),Data!$AI$30:$AS$30,J$16))/(INDEX(Data!$K$33:$K$82,$D31,1)),\"\")","v":3},{"$f":"IFERROR((SUMIFS(INDIRECT(\"Data!$AI$\"&$D31+32&\":$AS$\"&$D31+32),Data!$AI$30:$AS$30,K$16))/(INDEX(Data!$L$33:$L$82,$D31,1)),\"\")","v":5.0526315789473681},{"$f":"IFERROR((SUMIFS(INDIRECT(\"Data!$AI$\"&$D31+32&\":$AS$\"&$D31+32),Data!$AI$30:$AS$30,L$16))/(INDEX(Data!$M$33:$M$82,$D31,1)),\"\")","v":4.2325581395348841},{"$f":"IFERROR((SUMIFS(INDIRECT(\"Data!$AI$\"&$D31+32&\":$AS$\"&$D31+32),Data!$AI$30:$AS$30,M$16))/(INDEX(Data!$N$33:$N$82,$D31,1)),\"\")","v":5.9090909090909092},{"$f":"IFERROR((SUM(INDIRECT(\"Data!$AI$\"&$D31+32&\":$AS$\"&$D31+32)))/(INDEX(Data!$K$33:$K$82,$D31,1)+INDEX(Data!$L$33:$L$82,$D31,1)+INDEX(Data!$M$33:$M$82,$D31,1)+INDEX(Data!$N$33:$N$82,$D31,1)),\"\")","v":4.5308641975308639}]
[null,{"$f":"'Report A'!$B33","v":"2014-07-02"},{"$f":"'Report A'!$C33","v":"Wednesday"},{"$f":"'Report A'!$D33","v":2},{"$f":"IFERROR(IF($G$15=\"ALL\",SUMIFS(INDIRECT(\"Data!$AI$\"&$D32+32&\":$AS$\"&$D32+32),Data!$AI$30:$AS$30,E$16),SUMIFS(INDIRECT(\"Data!$AI$\"&$D32+32&\":$AS$\"&$D32+32),Data!$AI$30:$AS$30,E$16,Data!$AI$31:$AS$31,$G$15)),\"\")","v":53},{"$f":"IFERROR(IF($G$15=\"ALL\",SUMIFS(INDIRECT(\"Data!$AI$\"&$D32+32&\":$AS$\"&$D32+32),Data!$AI$30:$AS$30,F$16),SUMIFS(INDIRECT(\"Data!$AI$\"&$D32+32&\":$AS$\"&$D32+32),Data!$AI$30:$AS$30,F$16,Data!$AI$31:$AS$31,$G$15)),\"\")","v":79},{"$f":"IFERROR(IF($G$15=\"ALL\",SUMIFS(INDIRECT(\"Data!$AI$\"&$D32+32&\":$AS$\"&$D32+32),Data!$AI$30:$AS$30,G$16),SUMIFS(INDIRECT(\"Data!$AI$\"&$D32+32&\":$AS$\"&$D32+32),Data!$AI$30:$AS$30,G$16,Data!$AI$31:$AS$31,$G$15)),\"\")","v":134},{"$f":"IFERROR(IF($G$15=\"ALL\",SUMIFS(INDIRECT(\"Data!$AI$\"&$D32+32&\":$AS$\"&$D32+32),Data!$AI$30:$AS$30,H$16),SUMIFS(INDIRECT(\"Data!$AI$\"&$D32+32&\":$AS$\"&$D32+32),Data!$AI$30:$AS$30,H$16,Data!$AI$31:$AS$31,$G$15)),\"\")","v":93},{"$f":"IFERROR(SUM($E32:$H32),\"\")","v":359},{"$f":"IFERROR((SUMIFS(INDIRECT(\"Data!$AI$\"&$D32+32&\":$AS$\"&$D32+32),Data!$AI$30:$AS$30,J$16))/(INDEX(Data!$K$33:$K$82,$D32,1)),\"\")","v":3.3125},{"$f":"IFERROR((SUMIFS(INDIRECT(\"Data!$AI$\"&$D32+32&\":$AS$\"&$D32+32),Data!$AI$30:$AS$30,K$16))/(INDEX(Data!$L$33:$L$82,$D32,1)),\"\")","v":4.6470588235294121},{"$f":"IFERROR((SUMIFS(INDIRECT(\"Data!$AI$\"&$D32+32&\":$AS$\"&$D32+32),Data!$AI$30:$AS$30,L$16))/(INDEX(Data!$M$33:$M$82,$D32,1)),\"\")","v":3.1162790697674421},{"$f":"IFERROR((SUMIFS(INDIRECT(\"Data!$AI$\"&$D32+32&\":$AS$\"&$D32+32),Data!$AI$30:$AS$30,M$16))/(INDEX(Data!$N$33:$N$82,$D32,1)),\"\")","v":5.8125},{"$f":"IFERROR((SUM(INDIRECT(\"Data!$AI$\"&$D32+32&\":$AS$\"&$D32+32)))/(INDEX(Data!$K$33:$K$82,$D32,1)+INDEX(Data!$L$33:$L$82,$D32,1)+INDEX(Data!$M$33:$M$82,$D32,1)+INDEX(Data!$N$33:$N$82,$D32,1)),\"\")","v":3.902173913043478}]
[null,{"$f":"'Report A'!$B34","v":"2014-07-03"},{"$f":"'Report A'!$C34","v":"Thursday"},{"$f":"'Report A'!$D34","v":3},{"$f":"IFERROR(IF($G$15=\"ALL\",SUMIFS(INDIRECT(\"Data!$AI$\"&$D33+32&\":$AS$\"&$D33+32),Data!$AI$30:$AS$30,E$16),SUMIFS(INDIRECT(\"Data!$AI$\"&$D33+32&\":$AS$\"&$D33+32),Data!$AI$30:$AS$30,E$16,Data!$AI$31:$AS$31,$G$15)),\"\")","v":39},{"$f":"IFERROR(IF($G$15=\"ALL\",SUMIFS(INDIRECT(\"Data!$AI$\"&$D33+32&\":$AS$\"&$D33+32),Data!$AI$30:$AS$30,F$16),SUMIFS(INDIRECT(\"Data!$AI$\"&$D33+32&\":$AS$\"&$D33+32),Data!$AI$30:$AS$30,F$16,Data!$AI$31:$AS$31,$G$15)),\"\")","v":76},{"$f":"IFERROR(IF($G$15=\"ALL\",SUMIFS(INDIRECT(\"Data!$AI$\"&$D33+32&\":$AS$\"&$D33+32),Data!$AI$30:$AS$30,G$16),SUMIFS(INDIRECT(\"Data!$AI$\"&$D33+32&\":$AS$\"&$D33+32),Data!$AI$30:$AS$30,G$16,Data!$AI$31:$AS$31,$G$15)),\"\")","v":223},{"$f":"IFERROR(IF($G$15=\"ALL\",SUMIFS(INDIRECT(\"Data!$AI$\"&$D33+32&\":$AS$\"&$D33+32),Data!$AI$30:$AS$30,H$16),SUMIFS(INDIRECT(\"Data!$AI$\"&$D33+32&\":$AS$\"&$D33+32),Data!$AI$30:$AS$30,H$16,Data!$AI$31:$AS$31,$G$15)),\"\")","v":128},466,{"$f":"IFERROR((SUMIFS(INDIRECT(\"Data!$AI$\"&$D33+32&\":$AS$\"&$D33+32),Data!$AI$30:$AS$30,J$16))/(INDEX(Data!$K$33:$K$82,$D33,1)),\"\")","v":3.25},{"$f":"IFERROR((SUMIFS(INDIRECT(\"Data!$AI$\"&$D33+32&\":$AS$\"&$D33+32),Data!$AI$30:$AS$30,K$16))/(INDEX(Data!$L$33:$L$82,$D33,1)),\"\")","v":4.75},{"$f":"IFERROR((SUMIFS(INDIRECT(\"Data!$AI$\"&$D33+32&\":$AS$\"&$D33+32),Data!$AI$30:$AS$30,L$16))/(INDEX(Data!$M$33:$M$82,$D33,1)),\"\")","v":3.9122807017543861},{"$f":"IFERROR((SUMIFS(INDIRECT(\"Data!$AI$\"&$D33+32&\":$AS$\"&$D33+32),Data!$AI$30:$AS$30,M$16))/(INDEX(Data!$N$33:$N$82,$D33,1)),\"\")","v":9.1428571428571423},{"$f":"IFERROR((SUM(INDIRECT(\"Data!$AI$\"&$D33+32&\":$AS$\"&$D33+32)))/(INDEX(Data!$K$33:$K$82,$D33,1)+INDEX(Data!$L$33:$L$82,$D33,1)+INDEX(Data!$M$33:$M$82,$D33,1)+INDEX(Data!$N$33:$N$82,$D33,1)),\"\")","v":4.7070707070707067}]
[null,{"$f":"'Report A'!$B35","v":"2014-07-04"},{"$f":"'Report A'!$C35","v":"Friday"},{"$f":"'Report A'!$D35","v":4},{"$f":"IFERROR(IF($G$15=\"ALL\",SUMIFS(INDIRECT(\"Data!$AI$\"&$D34+32&\":$AS$\"&$D34+32),Data!$AI$30:$AS$30,E$16),SUMIFS(INDIRECT(\"Data!$AI$\"&$D34+32&\":$AS$\"&$D34+32),Data!$AI$30:$AS$30,E$16,Data!$AI$31:$AS$31,$G$15)),\"\")","v":37},{"$f":"IFERROR(IF($G$15=\"ALL\",SUMIFS(INDIRECT(\"Data!$AI$\"&$D34+32&\":$AS$\"&$D34+32),Data!$AI$30:$AS$30,F$16),SUMIFS(INDIRECT(\"Data!$AI$\"&$D34+32&\":$AS$\"&$D34+32),Data!$AI$30:$AS$30,F$16,Data!$AI$31:$AS$31,$G$15)),\"\")","v":107},{"$f":"IFERROR(IF($G$15=\"ALL\",SUMIFS(INDIRECT(\"Data!$AI$\"&$D34+32&\":$AS$\"&$D34+32),Data!$AI$30:$AS$30,G$16),SUMIFS(INDIRECT(\"Data!$AI$\"&$D34+32&\":$AS$\"&$D34+32),Data!$AI$30:$AS$30,G$16,Data!$AI$31:$AS$31,$G$15)),\"\")","v":333},{"$f":"IFERROR(IF($G$15=\"ALL\",SUMIFS(INDIRECT(\"Data!$AI$\"&$D34+32&\":$AS$\"&$D34+32),Data!$AI$30:$AS$30,H$16),SUMIFS(INDIRECT(\"Data!$AI$\"&$D34+32&\":$AS$\"&$D34+32),Data!$AI$30:$AS$30,H$16,Data!$AI$31:$AS$31,$G$15)),\"\")","v":39},516,{"$f":"IFERROR((SUMIFS(INDIRECT(\"Data!$AI$\"&$D34+32&\":$AS$\"&$D34+32),Data!$AI$30:$AS$30,J$16))/(INDEX(Data!$K$33:$K$82,$D34,1)),\"\")","v":3.7},{"$f":"IFERROR((SUMIFS(INDIRECT(\"Data!$AI$\"&$D34+32&\":$AS$\"&$D34+32),Data!$AI$30:$AS$30,K$16))/(INDEX(Data!$L$33:$L$82,$D34,1)),\"\")","v":5.35},{"$f":"IFERROR((SUMIFS(INDIRECT(\"Data!$AI$\"&$D34+32&\":$AS$\"&$D34+32),Data!$AI$30:$AS$30,L$16))/(INDEX(Data!$M$33:$M$82,$D34,1)),\"\")","v":5.0454545454545459},{"$f":"IFERROR((SUMIFS(INDIRECT(\"Data!$AI$\"&$D34+32&\":$AS$\"&$D34+32),Data!$AI$30:$AS$30,M$16))/(INDEX(Data!$N$33:$N$82,$D34,1)),\"\")","v":3.9},{"$f":"IFERROR((SUM(INDIRECT(\"Data!$AI$\"&$D34+32&\":$AS$\"&$D34+32)))/(INDEX(Data!$K$33:$K$82,$D34,1)+INDEX(Data!$L$33:$L$82,$D34,1)+INDEX(Data!$M$33:$M$82,$D34,1)+INDEX(Data!$N$33:$N$82,$D34,1)),\"\")","v":4.867924528301887}]
[null,{"$f":"'Report A'!$B36","v":"2014-07-05"},{"$f":"'Report A'!$C36","v":"Saturday"},{"$f":"'Report A'!$D36","v":5},{"$f":"IFERROR(IF($G$15=\"ALL\",SUMIFS(INDIRECT(\"Data!$AI$\"&$D35+32&\":$AS$\"&$D35+32),Data!$AI$30:$AS$30,E$16),SUMIFS(INDIRECT(\"Data!$AI$\"&$D35+32&\":$AS$\"&$D35+32),Data!$AI$30:$AS$30,E$16,Data!$AI$31:$AS$31,$G$15)),\"\")","v":66},{"$f":"IFERROR(IF($G$15=\"ALL\",SUMIFS(INDIRECT(\"Data!$AI$\"&$D35+32&\":$AS$\"&$D35+32),Data!$AI$30:$AS$30,F$16),SUMIFS(INDIRECT(\"Data!$AI$\"&$D35+32&\":$AS$\"&$D35+32),Data!$AI$30:$AS$30,F$16,Data!$AI$31:$AS$31,$G$15)),\"\")","v":70},{"$f":"IFERROR(IF($G$15=\"ALL\",SUMIFS(INDIRECT(\"Data!$AI$\"&$D35+32&\":$AS$\"&$D35+32),Data!$AI$30:$AS$30,G$16),SUMIFS(INDIRECT(\"Data!$AI$\"&$D35+32&\":$AS$\"&$D35+32),Data!$AI$30:$AS$30,G$16,Data!$AI$31:$AS$31,$G$15)),\"\")","v":248},{"$f":"IFERROR(IF($G$15=\"ALL\",SUMIFS(INDIRECT(\"Data!$AI$\"&$D35+32&\":$AS$\"&$D35+32),Data!$AI$30:$AS$30,H$16),SUMIFS(INDIRECT(\"Data!$AI$\"&$D35+32&\":$AS$\"&$D35+32),Data!$AI$30:$AS$30,H$16,Data!$AI$31:$AS$31,$G$15)),\"\")","v":106},490,{"$f":"IFERROR((SUMIFS(INDIRECT(\"Data!$AI$\"&$D35+32&\":$AS$\"&$D35+32),Data!$AI$30:$AS$30,J$16))/(INDEX(Data!$K$33:$K$82,$D35,1)),\"\")","v":3},{"$f":"IFERROR((SUMIFS(INDIRECT(\"Data!$AI$\"&$D35+32&\":$AS$\"&$D35+32),Data!$AI$30:$AS$30,K$16))/(INDEX(Data!$L$33:$L$82,$D35,1)),\"\")","v":3.6842105263157894},{"$f":"IFERROR((SUMIFS(INDIRECT(\"Data!$AI$\"&$D35+32&\":$AS$\"&$D35+32),Data!$AI$30:$AS$30,L$16))/(INDEX(Data!$M$33:$M$82,$D35,1)),\"\")","v":4.8627450980392153},{"$f":"IFERROR((SUMIFS(INDIRECT(\"Data!$AI$\"&$D35+32&\":$AS$\"&$D35+32),Data!$AI$30:$AS$30,M$16))/(INDEX(Data!$N$33:$N$82,$D35,1)),\"\")","v":4.24},{"$f":"IFERROR((SUM(INDIRECT(\"Data!$AI$\"&$D35+32&\":$AS$\"&$D35+32)))/(INDEX(Data!$K$33:$K$82,$D35,1)+INDEX(Data!$L$33:$L$82,$D35,1)+INDEX(Data!$M$33:$M$82,$D35,1)+INDEX(Data!$N$33:$N$82,$D35,1)),\"\")","v":4.1880341880341883}]
[null,{"$f":"'Report A'!$B37","v":"2014-07-06"},{"$f":"'Report A'!$C37","v":"Sunday"},{"$f":"'Report A'!$D37","v":6},{"$f":"IFERROR(IF($G$15=\"ALL\",SUMIFS(INDIRECT(\"Data!$AI$\"&$D36+32&\":$AS$\"&$D36+32),Data!$AI$30:$AS$30,E$16),SUMIFS(INDIRECT(\"Data!$AI$\"&$D36+32&\":$AS$\"&$D36+32),Data!$AI$30:$AS$30,E$16,Data!$AI$31:$AS$31,$G$15)),\"\")","v":113},{"$f":"IFERROR(IF($G$15=\"ALL\",SUMIFS(INDIRECT(\"Data!$AI$\"&$D36+32&\":$AS$\"&$D36+32),Data!$AI$30:$AS$30,F$16),SUMIFS(INDIRECT(\"Data!$AI$\"&$D36+32&\":$AS$\"&$D36+32),Data!$AI$30:$AS$30,F$16,Data!$AI$31:$AS$31,$G$15)),\"\")","v":72},{"$f":"IFERROR(IF($G$15=\"ALL\",SUMIFS(INDIRECT(\"Data!$AI$\"&$D36+32&\":$AS$\"&$D36+32),Data!$AI$30:$AS$30,G$16),SUMIFS(INDIRECT(\"Data!$AI$\"&$D36+32&\":$AS$\"&$D36+32),Data!$AI$30:$AS$30,G$16,Data!$AI$31:$AS$31,$G$15)),\"\")","v":146},{"$f":"IFERROR(IF($G$15=\"ALL\",SUMIFS(INDIRECT(\"Data!$AI$\"&$D36+32&\":$AS$\"&$D36+32),Data!$AI$30:$AS$30,H$16),SUMIFS(INDIRECT(\"Data!$AI$\"&$D36+32&\":$AS$\"&$D36+32),Data!$AI$30:$AS$30,H$16,Data!$AI$31:$AS$31,$G$15)),\"\")","v":71},402,{"$f":"IFERROR((SUMIFS(INDIRECT(\"Data!$AI$\"&$D36+32&\":$AS$\"&$D36+32),Data!$AI$30:$AS$30,J$16))/(INDEX(Data!$K$33:$K$82,$D36,1)),\"\")","v":3.6451612903225805},{"$f":"IFERROR((SUMIFS(INDIRECT(\"Data!$AI$\"&$D36+32&\":$AS$\"&$D36+32),Data!$AI$30:$AS$30,K$16))/(INDEX(Data!$L$33:$L$82,$D36,1)),\"\")","v":72},{"$f":"IFERROR((SUMIFS(INDIRECT(\"Data!$AI$\"&$D36+32&\":$AS$\"&$D36+32),Data!$AI$30:$AS$30,L$16))/(INDEX(Data!$M$33:$M$82,$D36,1)),\"\")","v":3.8421052631578947},{"$f":"IFERROR((SUMIFS(INDIRECT(\"Data!$AI$\"&$D36+32&\":$AS$\"&$D36+32),Data!$AI$30:$AS$30,M$16))/(INDEX(Data!$N$33:$N$82,$D36,1)),\"\")","v":5.916666666666667},{"$f":"IFERROR((SUM(INDIRECT(\"Data!$AI$\"&$D36+32&\":$AS$\"&$D36+32)))/(INDEX(Data!$K$33:$K$82,$D36,1)+INDEX(Data!$L$33:$L$82,$D36,1)+INDEX(Data!$M$33:$M$82,$D36,1)+INDEX(Data!$N$33:$N$82,$D36,1)),\"\")","v":4.9024390243902438}]
[null,{"$f":"'Report A'!$B38","v":"2014-07-07"},{"$f":"'Report A'!$C38","v":"Monday"},{"$f":"'Report A'!$D38","v":7},{"$f":"IFERROR(IF($G$15=\"ALL\",SUMIFS(INDIRECT(\"Data!$AI$\"&$D37+32&\":$AS$\"&$D37+32),Data!$AI$30:$AS$30,E$16),SUMIFS(INDIRECT(\"Data!$AI$\"&$D37+32&\":$AS$\"&$D37+32),Data!$AI$30:$AS$30,E$16,Data!$AI$31:$AS$31,$G$15)),\"\")","v":36},{"$f":"IFERROR(IF($G$15=\"ALL\",SUMIFS(INDIRECT(\"Data!$AI$\"&$D37+32&\":$AS$\"&$D37+32),Data!$AI$30:$AS$30,F$16),SUMIFS(INDIRECT(\"Data!$AI$\"&$D37+32&\":$AS$\"&$D37+32),Data!$AI$30:$AS$30,F$16,Data!$AI$31:$AS$31,$G$15)),\"\")","v":125},{"$f":"IFERROR(IF($G$15=\"ALL\",SUMIFS(INDIRECT(\"Data!$AI$\"&$D37+32&\":$AS$\"&$D37+32),Data!$AI$30:$AS$30,G$16),SUMIFS(INDIRECT(\"Data!$AI$\"&$D37+32&\":$AS$\"&$D37+32),Data!$AI$30:$AS$30,G$16,Data!$AI$31:$AS$31,$G$15)),\"\")","v":185},{"$f":"IFERROR(IF($G$15=\"ALL\",SUMIFS(INDIRECT(\"Data!$AI$\"&$D37+32&\":$AS$\"&$D37+32),Data!$AI$30:$AS$30,H$16),SUMIFS(INDIRECT(\"Data!$AI$\"&$D37+32&\":$AS$\"&$D37+32),Data!$AI$30:$AS$30,H$16,Data!$AI$31:$AS$31,$G$15)),\"\")","v":46},392,{"$f":"IFERROR((SUMIFS(INDIRECT(\"Data!$AI$\"&$D37+32&\":$AS$\"&$D37+32),Data!$AI$30:$AS$30,J$16))/(INDEX(Data!$K$33:$K$82,$D37,1)),\"\")","v":3},{"$f":"IFERROR((SUMIFS(INDIRECT(\"Data!$AI$\"&$D37+32&\":$AS$\"&$D37+32),Data!$AI$30:$AS$30,K$16))/(INDEX(Data!$L$33:$L$82,$D37,1)),\"\")","v":5.4347826086956523},{"$f":"IFERROR((SUMIFS(INDIRECT(\"Data!$AI$\"&$D37+32&\":$AS$\"&$D37+32),Data!$AI$30:$AS$30,L$16))/(INDEX(Data!$M$33:$M$82,$D37,1)),\"\")","v":3.9361702127659575},{"$f":"IFERROR((SUMIFS(INDIRECT(\"Data!$AI$\"&$D37+32&\":$AS$\"&$D37+32),Data!$AI$30:$AS$30,M$16))/(INDEX(Data!$N$33:$N$82,$D37,1)),\"\")","v":5.1111111111111107},{"$f":"IFERROR((SUM(INDIRECT(\"Data!$AI$\"&$D37+32&\":$AS$\"&$D37+32)))/(INDEX(Data!$K$33:$K$82,$D37,1)+INDEX(Data!$L$33:$L$82,$D37,1)+INDEX(Data!$M$33:$M$82,$D37,1)+INDEX(Data!$N$33:$N$82,$D37,1)),\"\")","v":4.3076923076923075}]
[null,{"$f":"'Report A'!$B39","v":"2014-07-08"},{"$f":"'Report A'!$C39","v":"Tuesday"},{"$f":"'Report A'!$D39","v":8},{"$f":"IFERROR(IF($G$15=\"ALL\",SUMIFS(INDIRECT(\"Data!$AI$\"&$D38+32&\":$AS$\"&$D38+32),Data!$AI$30:$AS$30,E$16),SUMIFS(INDIRECT(\"Data!$AI$\"&$D38+32&\":$AS$\"&$D38+32),Data!$AI$30:$AS$30,E$16,Data!$AI$31:$AS$31,$G$15)),\"\")","v":47},{"$f":"IFERROR(IF($G$15=\"ALL\",SUMIFS(INDIRECT(\"Data!$AI$\"&$D38+32&\":$AS$\"&$D38+32),Data!$AI$30:$AS$30,F$16),SUMIFS(INDIRECT(\"Data!$AI$\"&$D38+32&\":$AS$\"&$D38+32),Data!$AI$30:$AS$30,F$16,Data!$AI$31:$AS$31,$G$15)),\"\")","v":47},{"$f":"IFERROR(IF($G$15=\"ALL\",SUMIFS(INDIRECT(\"Data!$AI$\"&$D38+32&\":$AS$\"&$D38+32),Data!$AI$30:$AS$30,G$16),SUMIFS(INDIRECT(\"Data!$AI$\"&$D38+32&\":$AS$\"&$D38+32),Data!$AI$30:$AS$30,G$16,Data!$AI$31:$AS$31,$G$15)),\"\")","v":165},{"$f":"IFERROR(IF($G$15=\"ALL\",SUMIFS(INDIRECT(\"Data!$AI$\"&$D38+32&\":$AS$\"&$D38+32),Data!$AI$30:$AS$30,H$16),SUMIFS(INDIRECT(\"Data!$AI$\"&$D38+32&\":$AS$\"&$D38+32),Data!$AI$30:$AS$30,H$16,Data!$AI$31:$AS$31,$G$15)),\"\")","v":22},281,{"$f":"IFERROR((SUMIFS(INDIRECT(\"Data!$AI$\"&$D38+32&\":$AS$\"&$D38+32),Data!$AI$30:$AS$30,J$16))/(INDEX(Data!$K$33:$K$82,$D38,1)),\"\")","v":3.3571428571428572},{"$f":"IFERROR((SUMIFS(INDIRECT(\"Data!$AI$\"&$D38+32&\":$AS$\"&$D38+32),Data!$AI$30:$AS$30,K$16))/(INDEX(Data!$L$33:$L$82,$D38,1)),\"\")","v":2.9375},{"$f":"IFERROR((SUMIFS(INDIRECT(\"Data!$AI$\"&$D38+32&\":$AS$\"&$D38+32),Data!$AI$30:$AS$30,L$16))/(INDEX(Data!$M$33:$M$82,$D38,1)),\"\")","v":3.75},{"$f":"IFERROR((SUMIFS(INDIRECT(\"Data!$AI$\"&$D38+32&\":$AS$\"&$D38+32),Data!$AI$30:$AS$30,M$16))/(INDEX(Data!$N$33:$N$82,$D38,1)),\"\")","v":7.333333333333333},{"$f":"IFERROR((SUM(INDIRECT(\"Data!$AI$\"&$D38+32&\":$AS$\"&$D38+32)))/(INDEX(Data!$K$33:$K$82,$D38,1)+INDEX(Data!$L$33:$L$82,$D38,1)+INDEX(Data!$M$33:$M$82,$D38,1)+INDEX(Data!$N$33:$N$82,$D38,1)),\"\")","v":3.6493506493506493}]
[null,{"$f":"'Report A'!$B40","v":"2014-07-09"},{"$f":"'Report A'!$C40","v":"Wednesday"},{"$f":"'Report A'!$D40","v":9},{"$f":"IFERROR(IF($G$15=\"ALL\",SUMIFS(INDIRECT(\"Data!$AI$\"&$D39+32&\":$AS$\"&$D39+32),Data!$AI$30:$AS$30,E$16),SUMIFS(INDIRECT(\"Data!$AI$\"&$D39+32&\":$AS$\"&$D39+32),Data!$AI$30:$AS$30,E$16,Data!$AI$31:$AS$31,$G$15)),\"\")","v":41},{"$f":"IFERROR(IF($G$15=\"ALL\",SUMIFS(INDIRECT(\"Data!$AI$\"&$D39+32&\":$AS$\"&$D39+32),Data!$AI$30:$AS$30,F$16),SUMIFS(INDIRECT(\"Data!$AI$\"&$D39+32&\":$AS$\"&$D39+32),Data!$AI$30:$AS$30,F$16,Data!$AI$31:$AS$31,$G$15)),\"\")","v":58},{"$f":"IFERROR(IF($G$15=\"ALL\",SUMIFS(INDIRECT(\"Data!$AI$\"&$D39+32&\":$AS$\"&$D39+32),Data!$AI$30:$AS$30,G$16),SUMIFS(INDIRECT(\"Data!$AI$\"&$D39+32&\":$AS$\"&$D39+32),Data!$AI$30:$AS$30,G$16,Data!$AI$31:$AS$31,$G$15)),\"\")","v":166},{"$f":"IFERROR(IF($G$15=\"ALL\",SUMIFS(INDIRECT(\"Data!$AI$\"&$D39+32&\":$AS$\"&$D39+32),Data!$AI$30:$AS$30,H$16),SUMIFS(INDIRECT(\"Data!$AI$\"&$D39+32&\":$AS$\"&$D39+32),Data!$AI$30:$AS$30,H$16,Data!$AI$31:$AS$31,$G$15)),\"\")","v":70},335,{"$f":"IFERROR((SUMIFS(INDIRECT(\"Data!$AI$\"&$D39+32&\":$AS$\"&$D39+32),Data!$AI$30:$AS$30,J$16))/(INDEX(Data!$K$33:$K$82,$D39,1)),\"\")","v":3.1538461538461537},{"$f":"IFERROR((SUMIFS(INDIRECT(\"Data!$AI$\"&$D39+32&\":$AS$\"&$D39+32),Data!$AI$30:$AS$30,K$16))/(INDEX(Data!$L$33:$L$82,$D39,1)),\"\")","v":3.625},{"$f":"IFERROR((SUMIFS(INDIRECT(\"Data!$AI$\"&$D39+32&\":$AS$\"&$D39+32),Data!$AI$30:$AS$30,L$16))/(INDEX(Data!$M$33:$M$82,$D39,1)),\"\")","v":3.32},{"$f":"IFERROR((SUMIFS(INDIRECT(\"Data!$AI$\"&$D39+32&\":$AS$\"&$D39+32),Data!$AI$30:$AS$30,M$16))/(INDEX(Data!$N$33:$N$82,$D39,1)),\"\")","v":8.75},{"$f":"IFERROR((SUM(INDIRECT(\"Data!$AI$\"&$D39+32&\":$AS$\"&$D39+32)))/(INDEX(Data!$K$33:$K$82,$D39,1)+INDEX(Data!$L$33:$L$82,$D39,1)+INDEX(Data!$M$33:$M$82,$D39,1)+INDEX(Data!$N$33:$N$82,$D39,1)),\"\")","v":3.8505747126436782}]
[null,{"$f":"'Report A'!$B41","v":"2014-07-10"},{"$f":"'Report A'!$C41","v":"Thursday"},{"$f":"'Report A'!$D41","v":10},{"$f":"IFERROR(IF($G$15=\"ALL\",SUMIFS(INDIRECT(\"Data!$AI$\"&$D40+32&\":$AS$\"&$D40+32),Data!$AI$30:$AS$30,E$16),SUMIFS(INDIRECT(\"Data!$AI$\"&$D40+32&\":$AS$\"&$D40+32),Data!$AI$30:$AS$30,E$16,Data!$AI$31:$AS$31,$G$15)),\"\")","v":39},{"$f":"IFERROR(IF($G$15=\"ALL\",SUMIFS(INDIRECT(\"Data!$AI$\"&$D40+32&\":$AS$\"&$D40+32),Data!$AI$30:$AS$30,F$16),SUMIFS(INDIRECT(\"Data!$AI$\"&$D40+32&\":$AS$\"&$D40+32),Data!$AI$30:$AS$30,F$16,Data!$AI$31:$AS$31,$G$15)),\"\")","v":60},{"$f":"IFERROR(IF($G$15=\"ALL\",SUMIFS(INDIRECT(\"Data!$AI$\"&$D40+32&\":$AS$\"&$D40+32),Data!$AI$30:$AS$30,G$16),SUMIFS(INDIRECT(\"Data!$AI$\"&$D40+32&\":$AS$\"&$D40+32),Data!$AI$30:$AS$30,G$16,Data!$AI$31:$AS$31,$G$15)),\"\")","v":131},{"$f":"IFERROR(IF($G$15=\"ALL\",SUMIFS(INDIRECT(\"Data!$AI$\"&$D40+32&\":$AS$\"&$D40+32),Data!$AI$30:$AS$30,H$16),SUMIFS(INDIRECT(\"Data!$AI$\"&$D40+32&\":$AS$\"&$D40+32),Data!$AI$30:$AS$30,H$16,Data!$AI$31:$AS$31,$G$15)),\"\")","v":91},321,{"$f":"IFERROR((SUMIFS(INDIRECT(\"Data!$AI$\"&$D40+32&\":$AS$\"&$D40+32),Data!$AI$30:$AS$30,J$16))/(INDEX(Data!$K$33:$K$82,$D40,1)),\"\")","v":3.5454545454545454},{"$f":"IFERROR((SUMIFS(INDIRECT(\"Data!$AI$\"&$D40+32&\":$AS$\"&$D40+32),Data!$AI$30:$AS$30,K$16))/(INDEX(Data!$L$33:$L$82,$D40,1)),\"\")","v":4.2857142857142856},{"$f":"IFERROR((SUMIFS(INDIRECT(\"Data!$AI$\"&$D40+32&\":$AS$\"&$D40+32),Data!$AI$30:$AS$30,L$16))/(INDEX(Data!$M$33:$M$82,$D40,1)),\"\")","v":2.9772727272727271},{"$f":"IFERROR((SUMIFS(INDIRECT(\"Data!$AI$\"&$D40+32&\":$AS$\"&$D40+32),Data!$AI$30:$AS$30,M$16))/(INDEX(Data!$N$33:$N$82,$D40,1)),\"\")","v":5.3529411764705879},{"$f":"IFERROR((SUM(INDIRECT(\"Data!$AI$\"&$D40+32&\":$AS$\"&$D40+32)))/(INDEX(Data!$K$33:$K$82,$D40,1)+INDEX(Data!$L$33:$L$82,$D40,1)+INDEX(Data!$M$33:$M$82,$D40,1)+INDEX(Data!$N$33:$N$82,$D40,1)),\"\")","v":3.7325581395348837}]
[null,{"$f":"'Report A'!$B42","v":"2014-07-11"},{"$f":"'Report A'!$C42","v":"Friday"},{"$f":"'Report A'!$D42","v":11},{"$f":"IFERROR(IF($G$15=\"ALL\",SUMIFS(INDIRECT(\"Data!$AI$\"&$D41+32&\":$AS$\"&$D41+32),Data!$AI$30:$AS$30,E$16),SUMIFS(INDIRECT(\"Data!$AI$\"&$D41+32&\":$AS$\"&$D41+32),Data!$AI$30:$AS$30,E$16,Data!$AI$31:$AS$31,$G$15)),\"\")","v":55},{"$f":"IFERROR(IF($G$15=\"ALL\",SUMIFS(INDIRECT(\"Data!$AI$\"&$D41+32&\":$AS$\"&$D41+32),Data!$AI$30:$AS$30,F$16),SUMIFS(INDIRECT(\"Data!$AI$\"&$D41+32&\":$AS$\"&$D41+32),Data!$AI$30:$AS$30,F$16,Data!$AI$31:$AS$31,$G$15)),\"\")","v":99},{"$f":"IFERROR(IF($G$15=\"ALL\",SUMIFS(INDIRECT(\"Data!$AI$\"&$D41+32&\":$AS$\"&$D41+32),Data!$AI$30:$AS$30,G$16),SUMIFS(INDIRECT(\"Data!$AI$\"&$D41+32&\":$AS$\"&$D41+32),Data!$AI$30:$AS$30,G$16,Data!$AI$31:$AS$31,$G$15)),\"\")","v":266},{"$f":"IFERROR(IF($G$15=\"ALL\",SUMIFS(INDIRECT(\"Data!$AI$\"&$D41+32&\":$AS$\"&$D41+32),Data!$AI$30:$AS$30,H$16),SUMIFS(INDIRECT(\"Data!$AI$\"&$D41+32&\":$AS$\"&$D41+32),Data!$AI$30:$AS$30,H$16,Data!$AI$31:$AS$31,$G$15)),\"\")","v":55},475,{"$f":"IFERROR((SUMIFS(INDIRECT(\"Data!$AI$\"&$D41+32&\":$AS$\"&$D41+32),Data!$AI$30:$AS$30,J$16))/(INDEX(Data!$K$33:$K$82,$D41,1)),\"\")","v":3.2352941176470589},{"$f":"IFERROR((SUMIFS(INDIRECT(\"Data!$AI$\"&$D41+32&\":$AS$\"&$D41+32),Data!$AI$30:$AS$30,K$16))/(INDEX(Data!$L$33:$L$82,$D41,1)),\"\")","v":4.7142857142857144},{"$f":"IFERROR((SUMIFS(INDIRECT(\"Data!$AI$\"&$D41+32&\":$AS$\"&$D41+32),Data!$AI$30:$AS$30,L$16))/(INDEX(Data!$M$33:$M$82,$D41,1)),\"\")","v":4.360655737704918},{"$f":"IFERROR((SUMIFS(INDIRECT(\"Data!$AI$\"&$D41+32&\":$AS$\"&$D41+32),Data!$AI$30:$AS$30,M$16))/(INDEX(Data!$N$33:$N$82,$D41,1)),\"\")","v":3.4375},{"$f":"IFERROR((SUM(INDIRECT(\"Data!$AI$\"&$D41+32&\":$AS$\"&$D41+32)))/(INDEX(Data!$K$33:$K$82,$D41,1)+INDEX(Data!$L$33:$L$82,$D41,1)+INDEX(Data!$M$33:$M$82,$D41,1)+INDEX(Data!$N$33:$N$82,$D41,1)),\"\")","v":4.1304347826086953}]
[null,{"$f":"'Report A'!$B43","v":"2014-07-12"},{"$f":"'Report A'!$C43","v":"Saturday"},{"$f":"'Report A'!$D43","v":12},{"$f":"IFERROR(IF($G$15=\"ALL\",SUMIFS(INDIRECT(\"Data!$AI$\"&$D42+32&\":$AS$\"&$D42+32),Data!$AI$30:$AS$30,E$16),SUMIFS(INDIRECT(\"Data!$AI$\"&$D42+32&\":$AS$\"&$D42+32),Data!$AI$30:$AS$30,E$16,Data!$AI$31:$AS$31,$G$15)),\"\")","v":58},{"$f":"IFERROR(IF($G$15=\"ALL\",SUMIFS(INDIRECT(\"Data!$AI$\"&$D42+32&\":$AS$\"&$D42+32),Data!$AI$30:$AS$30,F$16),SUMIFS(INDIRECT(\"Data!$AI$\"&$D42+32&\":$AS$\"&$D42+32),Data!$AI$30:$AS$30,F$16,Data!$AI$31:$AS$31,$G$15)),\"\")","v":72},{"$f":"IFERROR(IF($G$15=\"ALL\",SUMIFS(INDIRECT(\"Data!$AI$\"&$D42+32&\":$AS$\"&$D42+32),Data!$AI$30:$AS$30,G$16),SUMIFS(INDIRECT(\"Data!$AI$\"&$D42+32&\":$AS$\"&$D42+32),Data!$AI$30:$AS$30,G$16,Data!$AI$31:$AS$31,$G$15)),\"\")","v":260},{"$f":"IFERROR(IF($G$15=\"ALL\",SUMIFS(INDIRECT(\"Data!$AI$\"&$D42+32&\":$AS$\"&$D42+32),Data!$AI$30:$AS$30,H$16),SUMIFS(INDIRECT(\"Data!$AI$\"&$D42+32&\":$AS$\"&$D42+32),Data!$AI$30:$AS$30,H$16,Data!$AI$31:$AS$31,$G$15)),\"\")","v":48},438,{"$f":"IFERROR((SUMIFS(INDIRECT(\"Data!$AI$\"&$D42+32&\":$AS$\"&$D42+32),Data!$AI$30:$AS$30,J$16))/(INDEX(Data!$K$33:$K$82,$D42,1)),\"\")","v":3.2222222222222223},{"$f":"IFERROR((SUMIFS(INDIRECT(\"Data!$AI$\"&$D42+32&\":$AS$\"&$D42+32),Data!$AI$30:$AS$30,K$16))/(INDEX(Data!$L$33:$L$82,$D42,1)),\"\")","v":3.2727272727272729},{"$f":"IFERROR((SUMIFS(INDIRECT(\"Data!$AI$\"&$D42+32&\":$AS$\"&$D42+32),Data!$AI$30:$AS$30,L$16))/(INDEX(Data!$M$33:$M$82,$D42,1)),\"\")","v":4.0625},{"$f":"IFERROR((SUMIFS(INDIRECT(\"Data!$AI$\"&$D42+32&\":$AS$\"&$D42+32),Data!$AI$30:$AS$30,M$16))/(INDEX(Data!$N$33:$N$82,$D42,1)),\"\")","v":4.3636363636363633},{"$f":"IFERROR((SUM(INDIRECT(\"Data!$AI$\"&$D42+32&\":$AS$\"&$D42+32)))/(INDEX(Data!$K$33:$K$82,$D42,1)+INDEX(Data!$L$33:$L$82,$D42,1)+INDEX(Data!$M$33:$M$82,$D42,1)+INDEX(Data!$N$33:$N$82,$D42,1)),\"\")","v":3.8086956521739133}]
[null,{"$f":"'Report A'!$B44","v":"2014-07-13"},{"$f":"'Report A'!$C44","v":"Sunday"},{"$f":"'Report A'!$D44","v":13},{"$f":"IFERROR(IF($G$15=\"ALL\",SUMIFS(INDIRECT(\"Data!$AI$\"&$D43+32&\":$AS$\"&$D43+32),Data!$AI$30:$AS$30,E$16),SUMIFS(INDIRECT(\"Data!$AI$\"&$D43+32&\":$AS$\"&$D43+32),Data!$AI$30:$AS$30,E$16,Data!$AI$31:$AS$31,$G$15)),\"\")","v":46},{"$f":"IFERROR(IF($G$15=\"ALL\",SUMIFS(INDIRECT(\"Data!$AI$\"&$D43+32&\":$AS$\"&$D43+32),Data!$AI$30:$AS$30,F$16),SUMIFS(INDIRECT(\"Data!$AI$\"&$D43+32&\":$AS$\"&$D43+32),Data!$AI$30:$AS$30,F$16,Data!$AI$31:$AS$31,$G$15)),\"\")","v":84},{"$f":"IFERROR(IF($G$15=\"ALL\",SUMIFS(INDIRECT(\"Data!$AI$\"&$D43+32&\":$AS$\"&$D43+32),Data!$AI$30:$AS$30,G$16),SUMIFS(INDIRECT(\"Data!$AI$\"&$D43+32&\":$AS$\"&$D43+32),Data!$AI$30:$AS$30,G$16,Data!$AI$31:$AS$31,$G$15)),\"\")","v":98},{"$f":"IFERROR(IF($G$15=\"ALL\",SUMIFS(INDIRECT(\"Data!$AI$\"&$D43+32&\":$AS$\"&$D43+32),Data!$AI$30:$AS$30,H$16),SUMIFS(INDIRECT(\"Data!$AI$\"&$D43+32&\":$AS$\"&$D43+32),Data!$AI$30:$AS$30,H$16,Data!$AI$31:$AS$31,$G$15)),\"\")","v":63},291,{"$f":"IFERROR((SUMIFS(INDIRECT(\"Data!$AI$\"&$D43+32&\":$AS$\"&$D43+32),Data!$AI$30:$AS$30,J$16))/(INDEX(Data!$K$33:$K$82,$D43,1)),\"\")","v":3.2857142857142856},{"$f":"IFERROR((SUMIFS(INDIRECT(\"Data!$AI$\"&$D43+32&\":$AS$\"&$D43+32),Data!$AI$30:$AS$30,K$16))/(INDEX(Data!$L$33:$L$82,$D43,1)),\"\")","v":3.2307692307692308},{"$f":"IFERROR((SUMIFS(INDIRECT(\"Data!$AI$\"&$D43+32&\":$AS$\"&$D43+32),Data!$AI$30:$AS$30,L$16))/(INDEX(Data!$M$33:$M$82,$D43,1)),\"\")","v":3.0625},{"$f":"IFERROR((SUMIFS(INDIRECT(\"Data!$AI$\"&$D43+32&\":$AS$\"&$D43+32),Data!$AI$30:$AS$30,M$16))/(INDEX(Data!$N$33:$N$82,$D43,1)),\"\")","v":5.25},{"$f":"IFERROR((SUM(INDIRECT(\"Data!$AI$\"&$D43+32&\":$AS$\"&$D43+32)))/(INDEX(Data!$K$33:$K$82,$D43,1)+INDEX(Data!$L$33:$L$82,$D43,1)+INDEX(Data!$M$33:$M$82,$D43,1)+INDEX(Data!$N$33:$N$82,$D43,1)),\"\")","v":3.4642857142857144}]
[null,{"$f":"'Report A'!$B45","v":"2014-07-14"},{"$f":"'Report A'!$C45","v":"Monday"},{"$f":"'Report A'!$D45","v":14},{"$f":"IFERROR(IF($G$15=\"ALL\",SUMIFS(INDIRECT(\"Data!$AI$\"&$D44+32&\":$AS$\"&$D44+32),Data!$AI$30:$AS$30,E$16),SUMIFS(INDIRECT(\"Data!$AI$\"&$D44+32&\":$AS$\"&$D44+32),Data!$AI$30:$AS$30,E$16,Data!$AI$31:$AS$31,$G$15)),\"\")","v":61},{"$f":"IFERROR(IF($G$15=\"ALL\",SUMIFS(INDIRECT(\"Data!$AI$\"&$D44+32&\":$AS$\"&$D44+32),Data!$AI$30:$AS$30,F$16),SUMIFS(INDIRECT(\"Data!$AI$\"&$D44+32&\":$AS$\"&$D44+32),Data!$AI$30:$AS$30,F$16,Data!$AI$31:$AS$31,$G$15)),\"\")","v":136},{"$f":"IFERROR(IF($G$15=\"ALL\",SUMIFS(INDIRECT(\"Data!$AI$\"&$D44+32&\":$AS$\"&$D44+32),Data!$AI$30:$AS$30,G$16),SUMIFS(INDIRECT(\"Data!$AI$\"&$D44+32&\":$AS$\"&$D44+32),Data!$AI$30:$AS$30,G$16,Data!$AI$31:$AS$31,$G$15)),\"\")","v":271},{"$f":"IFERROR(IF($G$15=\"ALL\",SUMIFS(INDIRECT(\"Data!$AI$\"&$D44+32&\":$AS$\"&$D44+32),Data!$AI$30:$AS$30,H$16),SUMIFS(INDIRECT(\"Data!$AI$\"&$D44+32&\":$AS$\"&$D44+32),Data!$AI$30:$AS$30,H$16,Data!$AI$31:$AS$31,$G$15)),\"\")","v":46},514,{"$f":"IFERROR((SUMIFS(INDIRECT(\"Data!$AI$\"&$D44+32&\":$AS$\"&$D44+32),Data!$AI$30:$AS$30,J$16))/(INDEX(Data!$K$33:$K$82,$D44,1)),\"\")","v":4.3571428571428568},{"$f":"IFERROR((SUMIFS(INDIRECT(\"Data!$AI$\"&$D44+32&\":$AS$\"&$D44+32),Data!$AI$30:$AS$30,K$16))/(INDEX(Data!$L$33:$L$82,$D44,1)),\"\")","v":5.2307692307692308},{"$f":"IFERROR((SUMIFS(INDIRECT(\"Data!$AI$\"&$D44+32&\":$AS$\"&$D44+32),Data!$AI$30:$AS$30,L$16))/(INDEX(Data!$M$33:$M$82,$D44,1)),\"\")","v":4.3015873015873014},{"$f":"IFERROR((SUMIFS(INDIRECT(\"Data!$AI$\"&$D44+32&\":$AS$\"&$D44+32),Data!$AI$30:$AS$30,M$16))/(INDEX(Data!$N$33:$N$82,$D44,1)),\"\")","v":2.875},{"$f":"IFERROR((SUM(INDIRECT(\"Data!$AI$\"&$D44+32&\":$AS$\"&$D44+32)))/(INDEX(Data!$K$33:$K$82,$D44,1)+INDEX(Data!$L$33:$L$82,$D44,1)+INDEX(Data!$M$33:$M$82,$D44,1)+INDEX(Data!$N$33:$N$82,$D44,1)),\"\")","v":4.3193277310924367}]
[null,{"$f":"'Report A'!$B46","v":"2014-07-15"},{"$f":"'Report A'!$C46","v":"Tuesday"},{"$f":"'Report A'!$D46","v":15},{"$f":"IFERROR(IF($G$15=\"ALL\",SUMIFS(INDIRECT(\"Data!$AI$\"&$D45+32&\":$AS$\"&$D45+32),Data!$AI$30:$AS$30,E$16),SUMIFS(INDIRECT(\"Data!$AI$\"&$D45+32&\":$AS$\"&$D45+32),Data!$AI$30:$AS$30,E$16,Data!$AI$31:$AS$31,$G$15)),\"\")","v":152},{"$f":"IFERROR(IF($G$15=\"ALL\",SUMIFS(INDIRECT(\"Data!$AI$\"&$D45+32&\":$AS$\"&$D45+32),Data!$AI$30:$AS$30,F$16),SUMIFS(INDIRECT(\"Data!$AI$\"&$D45+32&\":$AS$\"&$D45+32),Data!$AI$30:$AS$30,F$16,Data!$AI$31:$AS$31,$G$15)),\"\")","v":103},{"$f":"IFERROR(IF($G$15=\"ALL\",SUMIFS(INDIRECT(\"Data!$AI$\"&$D45+32&\":$AS$\"&$D45+32),Data!$AI$30:$AS$30,G$16),SUMIFS(INDIRECT(\"Data!$AI$\"&$D45+32&\":$AS$\"&$D45+32),Data!$AI$30:$AS$30,G$16,Data!$AI$31:$AS$31,$G$15)),\"\")","v":103},{"$f":"IFERROR(IF($G$15=\"ALL\",SUMIFS(INDIRECT(\"Data!$AI$\"&$D45+32&\":$AS$\"&$D45+32),Data!$AI$30:$AS$30,H$16),SUMIFS(INDIRECT(\"Data!$AI$\"&$D45+32&\":$AS$\"&$D45+32),Data!$AI$30:$AS$30,H$16,Data!$AI$31:$AS$31,$G$15)),\"\")","v":85},443,{"$f":"IFERROR((SUMIFS(INDIRECT(\"Data!$AI$\"&$D45+32&\":$AS$\"&$D45+32),Data!$AI$30:$AS$30,J$16))/(INDEX(Data!$K$33:$K$82,$D45,1)),\"\")","v":4.4705882352941178},{"$f":"IFERROR((SUMIFS(INDIRECT(\"Data!$AI$\"&$D45+32&\":$AS$\"&$D45+32),Data!$AI$30:$AS$30,K$16))/(INDEX(Data!$L$33:$L$82,$D45,1)),\"\")","v":3.3225806451612905},{"$f":"IFERROR((SUMIFS(INDIRECT(\"Data!$AI$\"&$D45+32&\":$AS$\"&$D45+32),Data!$AI$30:$AS$30,L$16))/(INDEX(Data!$M$33:$M$82,$D45,1)),\"\")","v":3.4333333333333331},{"$f":"IFERROR((SUMIFS(INDIRECT(\"Data!$AI$\"&$D45+32&\":$AS$\"&$D45+32),Data!$AI$30:$AS$30,M$16))/(INDEX(Data!$N$33:$N$82,$D45,1)),\"\")","v":9.4444444444444446},{"$f":"IFERROR((SUM(INDIRECT(\"Data!$AI$\"&$D45+32&\":$AS$\"&$D45+32)))/(INDEX(Data!$K$33:$K$82,$D45,1)+INDEX(Data!$L$33:$L$82,$D45,1)+INDEX(Data!$M$33:$M$82,$D45,1)+INDEX(Data!$N$33:$N$82,$D45,1)),\"\")","v":4.259615384615385}]
[null,{"$f":"'Report A'!$B47","v":"2014-07-16"},{"$f":"'Report A'!$C47","v":"Wednesday"},{"$f":"'Report A'!$D47","v":16},{"$f":"IFERROR(IF($G$15=\"ALL\",SUMIFS(INDIRECT(\"Data!$AI$\"&$D46+32&\":$AS$\"&$D46+32),Data!$AI$30:$AS$30,E$16),SUMIFS(INDIRECT(\"Data!$AI$\"&$D46+32&\":$AS$\"&$D46+32),Data!$AI$30:$AS$30,E$16,Data!$AI$31:$AS$31,$G$15)),\"\")","v":45},{"$f":"IFERROR(IF($G$15=\"ALL\",SUMIFS(INDIRECT(\"Data!$AI$\"&$D46+32&\":$AS$\"&$D46+32),Data!$AI$30:$AS$30,F$16),SUMIFS(INDIRECT(\"Data!$AI$\"&$D46+32&\":$AS$\"&$D46+32),Data!$AI$30:$AS$30,F$16,Data!$AI$31:$AS$31,$G$15)),\"\")","v":114},{"$f":"IFERROR(IF($G$15=\"ALL\",SUMIFS(INDIRECT(\"Data!$AI$\"&$D46+32&\":$AS$\"&$D46+32),Data!$AI$30:$AS$30,G$16),SUMIFS(INDIRECT(\"Data!$AI$\"&$D46+32&\":$AS$\"&$D46+32),Data!$AI$30:$AS$30,G$16,Data!$AI$31:$AS$31,$G$15)),\"\")","v":101},{"$f":"IFERROR(IF($G$15=\"ALL\",SUMIFS(INDIRECT(\"Data!$AI$\"&$D46+32&\":$AS$\"&$D46+32),Data!$AI$30:$AS$30,H$16),SUMIFS(INDIRECT(\"Data!$AI$\"&$D46+32&\":$AS$\"&$D46+32),Data!$AI$30:$AS$30,H$16,Data!$AI$31:$AS$31,$G$15)),\"\")","v":104},364,{"$f":"IFERROR((SUMIFS(INDIRECT(\"Data!$AI$\"&$D46+32&\":$AS$\"&$D46+32),Data!$AI$30:$AS$30,J$16))/(INDEX(Data!$K$33:$K$82,$D46,1)),\"\")","v":4.0909090909090908},{"$f":"IFERROR((SUMIFS(INDIRECT(\"Data!$AI$\"&$D46+32&\":$AS$\"&$D46+32),Data!$AI$30:$AS$30,K$16))/(INDEX(Data!$L$33:$L$82,$D46,1)),\"\")","v":3.9310344827586206},{"$f":"IFERROR((SUMIFS(INDIRECT(\"Data!$AI$\"&$D46+32&\":$AS$\"&$D46+32),Data!$AI$30:$AS$30,L$16))/(INDEX(Data!$M$33:$M$82,$D46,1)),\"\")","v":3.7407407407407409},{"$f":"IFERROR((SUMIFS(INDIRECT(\"Data!$AI$\"&$D46+32&\":$AS$\"&$D46+32),Data!$AI$30:$AS$30,M$16))/(INDEX(Data!$N$33:$N$82,$D46,1)),\"\")","v":6.117647058823529},{"$f":"IFERROR((SUM(INDIRECT(\"Data!$AI$\"&$D46+32&\":$AS$\"&$D46+32)))/(INDEX(Data!$K$33:$K$82,$D46,1)+INDEX(Data!$L$33:$L$82,$D46,1)+INDEX(Data!$M$33:$M$82,$D46,1)+INDEX(Data!$N$33:$N$82,$D46,1)),\"\")","v":4.333333333333333}]
[null,{"$f":"'Report A'!$B48","v":"2014-07-17"},{"$f":"'Report A'!$C48","v":"Thursday"},{"$f":"'Report A'!$D48","v":17},{"$f":"IFERROR(IF($G$15=\"ALL\",SUMIFS(INDIRECT(\"Data!$AI$\"&$D47+32&\":$AS$\"&$D47+32),Data!$AI$30:$AS$30,E$16),SUMIFS(INDIRECT(\"Data!$AI$\"&$D47+32&\":$AS$\"&$D47+32),Data!$AI$30:$AS$30,E$16,Data!$AI$31:$AS$31,$G$15)),\"\")","v":31},{"$f":"IFERROR(IF($G$15=\"ALL\",SUMIFS(INDIRECT(\"Data!$AI$\"&$D47+32&\":$AS$\"&$D47+32),Data!$AI$30:$AS$30,F$16),SUMIFS(INDIRECT(\"Data!$AI$\"&$D47+32&\":$AS$\"&$D47+32),Data!$AI$30:$AS$30,F$16,Data!$AI$31:$AS$31,$G$15)),\"\")","v":75},{"$f":"IFERROR(IF($G$15=\"ALL\",SUMIFS(INDIRECT(\"Data!$AI$\"&$D47+32&\":$AS$\"&$D47+32),Data!$AI$30:$AS$30,G$16),SUMIFS(INDIRECT(\"Data!$AI$\"&$D47+32&\":$AS$\"&$D47+32),Data!$AI$30:$AS$30,G$16,Data!$AI$31:$AS$31,$G$15)),\"\")","v":111},{"$f":"IFERROR(IF($G$15=\"ALL\",SUMIFS(INDIRECT(\"Data!$AI$\"&$D47+32&\":$AS$\"&$D47+32),Data!$AI$30:$AS$30,H$16),SUMIFS(INDIRECT(\"Data!$AI$\"&$D47+32&\":$AS$\"&$D47+32),Data!$AI$30:$AS$30,H$16,Data!$AI$31:$AS$31,$G$15)),\"\")","v":62},279,{"$f":"IFERROR((SUMIFS(INDIRECT(\"Data!$AI$\"&$D47+32&\":$AS$\"&$D47+32),Data!$AI$30:$AS$30,J$16))/(INDEX(Data!$K$33:$K$82,$D47,1)),\"\")","v":3.875},{"$f":"IFERROR((SUMIFS(INDIRECT(\"Data!$AI$\"&$D47+32&\":$AS$\"&$D47+32),Data!$AI$30:$AS$30,K$16))/(INDEX(Data!$L$33:$L$82,$D47,1)),\"\")","v":4.166666666666667},{"$f":"IFERROR((SUMIFS(INDIRECT(\"Data!$AI$\"&$D47+32&\":$AS$\"&$D47+32),Data!$AI$30:$AS$30,L$16))/(INDEX(Data!$M$33:$M$82,$D47,1)),\"\")","v":3.46875},{"$f":"IFERROR((SUMIFS(INDIRECT(\"Data!$AI$\"&$D47+32&\":$AS$\"&$D47+32),Data!$AI$30:$AS$30,M$16))/(INDEX(Data!$N$33:$N$82,$D47,1)),\"\")","v":4.4285714285714288},{"$f":"IFERROR((SUM(INDIRECT(\"Data!$AI$\"&$D47+32&\":$AS$\"&$D47+32)))/(INDEX(Data!$K$33:$K$82,$D47,1)+INDEX(Data!$L$33:$L$82,$D47,1)+INDEX(Data!$M$33:$M$82,$D47,1)+INDEX(Data!$N$33:$N$82,$D47,1)),\"\")","v":3.875}]
[null,{"$f":"'Report A'!$B49","v":"2014-07-18"},{"$f":"'Report A'!$C49","v":"Friday"},{"$f":"'Report A'!$D49","v":18},{"$f":"IFERROR(IF($G$15=\"ALL\",SUMIFS(INDIRECT(\"Data!$AI$\"&$D48+32&\":$AS$\"&$D48+32),Data!$AI$30:$AS$30,E$16),SUMIFS(INDIRECT(\"Data!$AI$\"&$D48+32&\":$AS$\"&$D48+32),Data!$AI$30:$AS$30,E$16,Data!$AI$31:$AS$31,$G$15)),\"\")","v":59},{"$f":"IFERROR(IF($G$15=\"ALL\",SUMIFS(INDIRECT(\"Data!$AI$\"&$D48+32&\":$AS$\"&$D48+32),Data!$AI$30:$AS$30,F$16),SUMIFS(INDIRECT(\"Data!$AI$\"&$D48+32&\":$AS$\"&$D48+32),Data!$AI$30:$AS$30,F$16,Data!$AI$31:$AS$31,$G$15)),\"\")","v":191},{"$f":"IFERROR(IF($G$15=\"ALL\",SUMIFS(INDIRECT(\"Data!$AI$\"&$D48+32&\":$AS$\"&$D48+32),Data!$AI$30:$AS$30,G$16),SUMIFS(INDIRECT(\"Data!$AI$\"&$D48+32&\":$AS$\"&$D48+32),Data!$AI$30:$AS$30,G$16,Data!$AI$31:$AS$31,$G$15)),\"\")","v":215},{"$f":"IFERROR(IF($G$15=\"ALL\",SUMIFS(INDIRECT(\"Data!$AI$\"&$D48+32&\":$AS$\"&$D48+32),Data!$AI$30:$AS$30,H$16),SUMIFS(INDIRECT(\"Data!$AI$\"&$D48+32&\":$AS$\"&$D48+32),Data!$AI$30:$AS$30,H$16,Data!$AI$31:$AS$31,$G$15)),\"\")","v":49},514,{"$f":"IFERROR((SUMIFS(INDIRECT(\"Data!$AI$\"&$D48+32&\":$AS$\"&$D48+32),Data!$AI$30:$AS$30,J$16))/(INDEX(Data!$K$33:$K$82,$D48,1)),\"\")","v":4.2142857142857144},{"$f":"IFERROR((SUMIFS(INDIRECT(\"Data!$AI$\"&$D48+32&\":$AS$\"&$D48+32),Data!$AI$30:$AS$30,K$16))/(INDEX(Data!$L$33:$L$82,$D48,1)),\"\")","v":6.161290322580645},{"$f":"IFERROR((SUMIFS(INDIRECT(\"Data!$AI$\"&$D48+32&\":$AS$\"&$D48+32),Data!$AI$30:$AS$30,L$16))/(INDEX(Data!$M$33:$M$82,$D48,1)),\"\")","v":3.9090909090909092},{"$f":"IFERROR((SUMIFS(INDIRECT(\"Data!$AI$\"&$D48+32&\":$AS$\"&$D48+32),Data!$AI$30:$AS$30,M$16))/(INDEX(Data!$N$33:$N$82,$D48,1)),\"\")","v":3.5},{"$f":"IFERROR((SUM(INDIRECT(\"Data!$AI$\"&$D48+32&\":$AS$\"&$D48+32)))/(INDEX(Data!$K$33:$K$82,$D48,1)+INDEX(Data!$L$33:$L$82,$D48,1)+INDEX(Data!$M$33:$M$82,$D48,1)+INDEX(Data!$N$33:$N$82,$D48,1)),\"\")","v":4.5087719298245617}]
[null,{"$f":"'Report A'!$B50","v":"2014-07-19"},{"$f":"'Report A'!$C50","v":"Saturday"},{"$f":"'Report A'!$D50","v":19},{"$f":"IFERROR(IF($G$15=\"ALL\",SUMIFS(INDIRECT(\"Data!$AI$\"&$D49+32&\":$AS$\"&$D49+32),Data!$AI$30:$AS$30,E$16),SUMIFS(INDIRECT(\"Data!$AI$\"&$D49+32&\":$AS$\"&$D49+32),Data!$AI$30:$AS$30,E$16,Data!$AI$31:$AS$31,$G$15)),\"\")","v":39},{"$f":"IFERROR(IF($G$15=\"ALL\",SUMIFS(INDIRECT(\"Data!$AI$\"&$D49+32&\":$AS$\"&$D49+32),Data!$AI$30:$AS$30,F$16),SUMIFS(INDIRECT(\"Data!$AI$\"&$D49+32&\":$AS$\"&$D49+32),Data!$AI$30:$AS$30,F$16,Data!$AI$31:$AS$31,$G$15)),\"\")","v":98},{"$f":"IFERROR(IF($G$15=\"ALL\",SUMIFS(INDIRECT(\"Data!$AI$\"&$D49+32&\":$AS$\"&$D49+32),Data!$AI$30:$AS$30,G$16),SUMIFS(INDIRECT(\"Data!$AI$\"&$D49+32&\":$AS$\"&$D49+32),Data!$AI$30:$AS$30,G$16,Data!$AI$31:$AS$31,$G$15)),\"\")","v":260},{"$f":"IFERROR(IF($G$15=\"ALL\",SUMIFS(INDIRECT(\"Data!$AI$\"&$D49+32&\":$AS$\"&$D49+32),Data!$AI$30:$AS$30,H$16),SUMIFS(INDIRECT(\"Data!$AI$\"&$D49+32&\":$AS$\"&$D49+32),Data!$AI$30:$AS$30,H$16,Data!$AI$31:$AS$31,$G$15)),\"\")","v":91},488,{"$f":"IFERROR((SUMIFS(INDIRECT(\"Data!$AI$\"&$D49+32&\":$AS$\"&$D49+32),Data!$AI$30:$AS$30,J$16))/(INDEX(Data!$K$33:$K$82,$D49,1)),\"\")","v":2.7857142857142856},{"$f":"IFERROR((SUMIFS(INDIRECT(\"Data!$AI$\"&$D49+32&\":$AS$\"&$D49+32),Data!$AI$30:$AS$30,K$16))/(INDEX(Data!$L$33:$L$82,$D49,1)),\"\")","v":3.3793103448275863},{"$f":"IFERROR((SUMIFS(INDIRECT(\"Data!$AI$\"&$D49+32&\":$AS$\"&$D49+32),Data!$AI$30:$AS$30,L$16))/(INDEX(Data!$M$33:$M$82,$D49,1)),\"\")","v":4.333333333333333},{"$f":"IFERROR((SUMIFS(INDIRECT(\"Data!$AI$\"&$D49+32&\":$AS$\"&$D49+32),Data!$AI$30:$AS$30,M$16))/(INDEX(Data!$N$33:$N$82,$D49,1)),\"\")","v":3.7916666666666665},{"$f":"IFERROR((SUM(INDIRECT(\"Data!$AI$\"&$D49+32&\":$AS$\"&$D49+32)))/(INDEX(Data!$K$33:$K$82,$D49,1)+INDEX(Data!$L$33:$L$82,$D49,1)+INDEX(Data!$M$33:$M$82,$D49,1)+INDEX(Data!$N$33:$N$82,$D49,1)),\"\")","v":3.8425196850393699}]
[null,{"$f":"'Report A'!$B51","v":"2014-07-20"},{"$f":"'Report A'!$C51","v":"Sunday"},{"$f":"'Report A'!$D51","v":20},{"$f":"IFERROR(IF($G$15=\"ALL\",SUMIFS(INDIRECT(\"Data!$AI$\"&$D50+32&\":$AS$\"&$D50+32),Data!$AI$30:$AS$30,E$16),SUMIFS(INDIRECT(\"Data!$AI$\"&$D50+32&\":$AS$\"&$D50+32),Data!$AI$30:$AS$30,E$16,Data!$AI$31:$AS$31,$G$15)),\"\")","v":92},{"$f":"IFERROR(IF($G$15=\"ALL\",SUMIFS(INDIRECT(\"Data!$AI$\"&$D50+32&\":$AS$\"&$D50+32),Data!$AI$30:$AS$30,F$16),SUMIFS(INDIRECT(\"Data!$AI$\"&$D50+32&\":$AS$\"&$D50+32),Data!$AI$30:$AS$30,F$16,Data!$AI$31:$AS$31,$G$15)),\"\")","v":78},{"$f":"IFERROR(IF($G$15=\"ALL\",SUMIFS(INDIRECT(\"Data!$AI$\"&$D50+32&\":$AS$\"&$D50+32),Data!$AI$30:$AS$30,G$16),SUMIFS(INDIRECT(\"Data!$AI$\"&$D50+32&\":$AS$\"&$D50+32),Data!$AI$30:$AS$30,G$16,Data!$AI$31:$AS$31,$G$15)),\"\")","v":89},{"$f":"IFERROR(IF($G$15=\"ALL\",SUMIFS(INDIRECT(\"Data!$AI$\"&$D50+32&\":$AS$\"&$D50+32),Data!$AI$30:$AS$30,H$16),SUMIFS(INDIRECT(\"Data!$AI$\"&$D50+32&\":$AS$\"&$D50+32),Data!$AI$30:$AS$30,H$16,Data!$AI$31:$AS$31,$G$15)),\"\")","v":90},349,{"$f":"IFERROR((SUMIFS(INDIRECT(\"Data!$AI$\"&$D50+32&\":$AS$\"&$D50+32),Data!$AI$30:$AS$30,J$16))/(INDEX(Data!$K$33:$K$82,$D50,1)),\"\")","v":3.2857142857142856},{"$f":"IFERROR((SUMIFS(INDIRECT(\"Data!$AI$\"&$D50+32&\":$AS$\"&$D50+32),Data!$AI$30:$AS$30,K$16))/(INDEX(Data!$L$33:$L$82,$D50,1)),\"\")","v":3.3913043478260869},{"$f":"IFERROR((SUMIFS(INDIRECT(\"Data!$AI$\"&$D50+32&\":$AS$\"&$D50+32),Data!$AI$30:$AS$30,L$16))/(INDEX(Data!$M$33:$M$82,$D50,1)),\"\")","v":2.6176470588235294},{"$f":"IFERROR((SUMIFS(INDIRECT(\"Data!$AI$\"&$D50+32&\":$AS$\"&$D50+32),Data!$AI$30:$AS$30,M$16))/(INDEX(Data!$N$33:$N$82,$D50,1)),\"\")","v":5.2941176470588234},{"$f":"IFERROR((SUM(INDIRECT(\"Data!$AI$\"&$D50+32&\":$AS$\"&$D50+32)))/(INDEX(Data!$K$33:$K$82,$D50,1)+INDEX(Data!$L$33:$L$82,$D50,1)+INDEX(Data!$M$33:$M$82,$D50,1)+INDEX(Data!$N$33:$N$82,$D50,1)),\"\")","v":3.4215686274509802}]
[null,{"$f":"'Report A'!$B52","v":"2014-07-21"},{"$f":"'Report A'!$C52","v":"Monday"},{"$f":"'Report A'!$D52","v":21},{"$f":"IFERROR(IF($G$15=\"ALL\",SUMIFS(INDIRECT(\"Data!$AI$\"&$D51+32&\":$AS$\"&$D51+32),Data!$AI$30:$AS$30,E$16),SUMIFS(INDIRECT(\"Data!$AI$\"&$D51+32&\":$AS$\"&$D51+32),Data!$AI$30:$AS$30,E$16,Data!$AI$31:$AS$31,$G$15)),\"\")","v":50},{"$f":"IFERROR(IF($G$15=\"ALL\",SUMIFS(INDIRECT(\"Data!$AI$\"&$D51+32&\":$AS$\"&$D51+32),Data!$AI$30:$AS$30,F$16),SUMIFS(INDIRECT(\"Data!$AI$\"&$D51+32&\":$AS$\"&$D51+32),Data!$AI$30:$AS$30,F$16,Data!$AI$31:$AS$31,$G$15)),\"\")","v":48},{"$f":"IFERROR(IF($G$15=\"ALL\",SUMIFS(INDIRECT(\"Data!$AI$\"&$D51+32&\":$AS$\"&$D51+32),Data!$AI$30:$AS$30,G$16),SUMIFS(INDIRECT(\"Data!$AI$\"&$D51+32&\":$AS$\"&$D51+32),Data!$AI$30:$AS$30,G$16,Data!$AI$31:$AS$31,$G$15)),\"\")","v":66},{"$f":"IFERROR(IF($G$15=\"ALL\",SUMIFS(INDIRECT(\"Data!$AI$\"&$D51+32&\":$AS$\"&$D51+32),Data!$AI$30:$AS$30,H$16),SUMIFS(INDIRECT(\"Data!$AI$\"&$D51+32&\":$AS$\"&$D51+32),Data!$AI$30:$AS$30,H$16,Data!$AI$31:$AS$31,$G$15)),\"\")","v":67},231,{"$f":"IFERROR((SUMIFS(INDIRECT(\"Data!$AI$\"&$D51+32&\":$AS$\"&$D51+32),Data!$AI$30:$AS$30,J$16))/(INDEX(Data!$K$33:$K$82,$D51,1)),\"\")","v":3.125},{"$f":"IFERROR((SUMIFS(INDIRECT(\"Data!$AI$\"&$D51+32&\":$AS$\"&$D51+32),Data!$AI$30:$AS$30,K$16))/(INDEX(Data!$L$33:$L$82,$D51,1)),\"\")","v":4},{"$f":"IFERROR((SUMIFS(INDIRECT(\"Data!$AI$\"&$D51+32&\":$AS$\"&$D51+32),Data!$AI$30:$AS$30,L$16))/(INDEX(Data!$M$33:$M$82,$D51,1)),\"\")","v":2.8695652173913042},{"$f":"IFERROR((SUMIFS(INDIRECT(\"Data!$AI$\"&$D51+32&\":$AS$\"&$D51+32),Data!$AI$30:$AS$30,M$16))/(INDEX(Data!$N$33:$N$82,$D51,1)),\"\")","v":5.583333333333333},{"$f":"IFERROR((SUM(INDIRECT(\"Data!$AI$\"&$D51+32&\":$AS$\"&$D51+32)))/(INDEX(Data!$K$33:$K$82,$D51,1)+INDEX(Data!$L$33:$L$82,$D51,1)+INDEX(Data!$M$33:$M$82,$D51,1)+INDEX(Data!$N$33:$N$82,$D51,1)),\"\")","v":3.6666666666666665}]
[null,{"$f":"'Report A'!$B53","v":"2014-07-22"},{"$f":"'Report A'!$C53","v":"Tuesday"},{"$f":"'Report A'!$D53","v":22},{"$f":"IFERROR(IF($G$15=\"ALL\",SUMIFS(INDIRECT(\"Data!$AI$\"&$D52+32&\":$AS$\"&$D52+32),Data!$AI$30:$AS$30,E$16),SUMIFS(INDIRECT(\"Data!$AI$\"&$D52+32&\":$AS$\"&$D52+32),Data!$AI$30:$AS$30,E$16,Data!$AI$31:$AS$31,$G$15)),\"\")","v":61},{"$f":"IFERROR(IF($G$15=\"ALL\",SUMIFS(INDIRECT(\"Data!$AI$\"&$D52+32&\":$AS$\"&$D52+32),Data!$AI$30:$AS$30,F$16),SUMIFS(INDIRECT(\"Data!$AI$\"&$D52+32&\":$AS$\"&$D52+32),Data!$AI$30:$AS$30,F$16,Data!$AI$31:$AS$31,$G$15)),\"\")","v":100},{"$f":"IFERROR(IF($G$15=\"ALL\",SUMIFS(INDIRECT(\"Data!$AI$\"&$D52+32&\":$AS$\"&$D52+32),Data!$AI$30:$AS$30,G$16),SUMIFS(INDIRECT(\"Data!$AI$\"&$D52+32&\":$AS$\"&$D52+32),Data!$AI$30:$AS$30,G$16,Data!$AI$31:$AS$31,$G$15)),\"\")","v":144},{"$f":"IFERROR(IF($G$15=\"ALL\",SUMIFS(INDIRECT(\"Data!$AI$\"&$D52+32&\":$AS$\"&$D52+32),Data!$AI$30:$AS$30,H$16),SUMIFS(INDIRECT(\"Data!$AI$\"&$D52+32&\":$AS$\"&$D52+32),Data!$AI$30:$AS$30,H$16,Data!$AI$31:$AS$31,$G$15)),\"\")","v":78},383,{"$f":"IFERROR((SUMIFS(INDIRECT(\"Data!$AI$\"&$D52+32&\":$AS$\"&$D52+32),Data!$AI$30:$AS$30,J$16))/(INDEX(Data!$K$33:$K$82,$D52,1)),\"\")","v":4.0666666666666664},{"$f":"IFERROR((SUMIFS(INDIRECT(\"Data!$AI$\"&$D52+32&\":$AS$\"&$D52+32),Data!$AI$30:$AS$30,K$16))/(INDEX(Data!$L$33:$L$82,$D52,1)),\"\")","v":6.666666666666667},{"$f":"IFERROR((SUMIFS(INDIRECT(\"Data!$AI$\"&$D52+32&\":$AS$\"&$D52+32),Data!$AI$30:$AS$30,L$16))/(INDEX(Data!$M$33:$M$82,$D52,1)),\"\")","v":3.6923076923076925},{"$f":"IFERROR((SUMIFS(INDIRECT(\"Data!$AI$\"&$D52+32&\":$AS$\"&$D52+32),Data!$AI$30:$AS$30,M$16))/(INDEX(Data!$N$33:$N$82,$D52,1)),\"\")","v":6},{"$f":"IFERROR((SUM(INDIRECT(\"Data!$AI$\"&$D52+32&\":$AS$\"&$D52+32)))/(INDEX(Data!$K$33:$K$82,$D52,1)+INDEX(Data!$L$33:$L$82,$D52,1)+INDEX(Data!$M$33:$M$82,$D52,1)+INDEX(Data!$N$33:$N$82,$D52,1)),\"\")","v":4.6707317073170733}]
[null,{"$f":"'Report A'!$B54","v":"2014-07-23"},{"$f":"'Report A'!$C54","v":"Wednesday"},{"$f":"'Report A'!$D54","v":23},{"$f":"IFERROR(IF($G$15=\"ALL\",SUMIFS(INDIRECT(\"Data!$AI$\"&$D53+32&\":$AS$\"&$D53+32),Data!$AI$30:$AS$30,E$16),SUMIFS(INDIRECT(\"Data!$AI$\"&$D53+32&\":$AS$\"&$D53+32),Data!$AI$30:$AS$30,E$16,Data!$AI$31:$AS$31,$G$15)),\"\")","v":49},{"$f":"IFERROR(IF($G$15=\"ALL\",SUMIFS(INDIRECT(\"Data!$AI$\"&$D53+32&\":$AS$\"&$D53+32),Data!$AI$30:$AS$30,F$16),SUMIFS(INDIRECT(\"Data!$AI$\"&$D53+32&\":$AS$\"&$D53+32),Data!$AI$30:$AS$30,F$16,Data!$AI$31:$AS$31,$G$15)),\"\")","v":113},{"$f":"IFERROR(IF($G$15=\"ALL\",SUMIFS(INDIRECT(\"Data!$AI$\"&$D53+32&\":$AS$\"&$D53+32),Data!$AI$30:$AS$30,G$16),SUMIFS(INDIRECT(\"Data!$AI$\"&$D53+32&\":$AS$\"&$D53+32),Data!$AI$30:$AS$30,G$16,Data!$AI$31:$AS$31,$G$15)),\"\")","v":100},{"$f":"IFERROR(IF($G$15=\"ALL\",SUMIFS(INDIRECT(\"Data!$AI$\"&$D53+32&\":$AS$\"&$D53+32),Data!$AI$30:$AS$30,H$16),SUMIFS(INDIRECT(\"Data!$AI$\"&$D53+32&\":$AS$\"&$D53+32),Data!$AI$30:$AS$30,H$16,Data!$AI$31:$AS$31,$G$15)),\"\")","v":16},278,{"$f":"IFERROR((SUMIFS(INDIRECT(\"Data!$AI$\"&$D53+32&\":$AS$\"&$D53+32),Data!$AI$30:$AS$30,J$16))/(INDEX(Data!$K$33:$K$82,$D53,1)),\"\")","v":3.0625},{"$f":"IFERROR((SUMIFS(INDIRECT(\"Data!$AI$\"&$D53+32&\":$AS$\"&$D53+32),Data!$AI$30:$AS$30,K$16))/(INDEX(Data!$L$33:$L$82,$D53,1)),\"\")","v":5.1363636363636367},{"$f":"IFERROR((SUMIFS(INDIRECT(\"Data!$AI$\"&$D53+32&\":$AS$\"&$D53+32),Data!$AI$30:$AS$30,L$16))/(INDEX(Data!$M$33:$M$82,$D53,1)),\"\")","v":3.5714285714285716},{"$f":"IFERROR((SUMIFS(INDIRECT(\"Data!$AI$\"&$D53+32&\":$AS$\"&$D53+32),Data!$AI$30:$AS$30,M$16))/(INDEX(Data!$N$33:$N$82,$D53,1)),\"\")","v":4},{"$f":"IFERROR((SUM(INDIRECT(\"Data!$AI$\"&$D53+32&\":$AS$\"&$D53+32)))/(INDEX(Data!$K$33:$K$82,$D53,1)+INDEX(Data!$L$33:$L$82,$D53,1)+INDEX(Data!$M$33:$M$82,$D53,1)+INDEX(Data!$N$33:$N$82,$D53,1)),\"\")","v":3.9714285714285715}]
[null,{"$f":"'Report A'!$B55","v":"2014-07-24"},{"$f":"'Report A'!$C55","v":"Thursday"},{"$f":"'Report A'!$D55","v":24},{"$f":"IFERROR(IF($G$15=\"ALL\",SUMIFS(INDIRECT(\"Data!$AI$\"&$D54+32&\":$AS$\"&$D54+32),Data!$AI$30:$AS$30,E$16),SUMIFS(INDIRECT(\"Data!$AI$\"&$D54+32&\":$AS$\"&$D54+32),Data!$AI$30:$AS$30,E$16,Data!$AI$31:$AS$31,$G$15)),\"\")","v":63},{"$f":"IFERROR(IF($G$15=\"ALL\",SUMIFS(INDIRECT(\"Data!$AI$\"&$D54+32&\":$AS$\"&$D54+32),Data!$AI$30:$AS$30,F$16),SUMIFS(INDIRECT(\"Data!$AI$\"&$D54+32&\":$AS$\"&$D54+32),Data!$AI$30:$AS$30,F$16,Data!$AI$31:$AS$31,$G$15)),\"\")","v":115},{"$f":"IFERROR(IF($G$15=\"ALL\",SUMIFS(INDIRECT(\"Data!$AI$\"&$D54+32&\":$AS$\"&$D54+32),Data!$AI$30:$AS$30,G$16),SUMIFS(INDIRECT(\"Data!$AI$\"&$D54+32&\":$AS$\"&$D54+32),Data!$AI$30:$AS$30,G$16,Data!$AI$31:$AS$31,$G$15)),\"\")","v":185},{"$f":"IFERROR(IF($G$15=\"ALL\",SUMIFS(INDIRECT(\"Data!$AI$\"&$D54+32&\":$AS$\"&$D54+32),Data!$AI$30:$AS$30,H$16),SUMIFS(INDIRECT(\"Data!$AI$\"&$D54+32&\":$AS$\"&$D54+32),Data!$AI$30:$AS$30,H$16,Data!$AI$31:$AS$31,$G$15)),\"\")","v":96},459,{"$f":"IFERROR((SUMIFS(INDIRECT(\"Data!$AI$\"&$D54+32&\":$AS$\"&$D54+32),Data!$AI$30:$AS$30,J$16))/(INDEX(Data!$K$33:$K$82,$D54,1)),\"\")","v":3.7058823529411766},{"$f":"IFERROR((SUMIFS(INDIRECT(\"Data!$AI$\"&$D54+32&\":$AS$\"&$D54+32),Data!$AI$30:$AS$30,K$16))/(INDEX(Data!$L$33:$L$82,$D54,1)),\"\")","v":4.791666666666667},{"$f":"IFERROR((SUMIFS(INDIRECT(\"Data!$AI$\"&$D54+32&\":$AS$\"&$D54+32),Data!$AI$30:$AS$30,L$16))/(INDEX(Data!$M$33:$M$82,$D54,1)),\"\")","v":4.1111111111111107},{"$f":"IFERROR((SUMIFS(INDIRECT(\"Data!$AI$\"&$D54+32&\":$AS$\"&$D54+32),Data!$AI$30:$AS$30,M$16))/(INDEX(Data!$N$33:$N$82,$D54,1)),\"\")","v":5.0526315789473681},{"$f":"IFERROR((SUM(INDIRECT(\"Data!$AI$\"&$D54+32&\":$AS$\"&$D54+32)))/(INDEX(Data!$K$33:$K$82,$D54,1)+INDEX(Data!$L$33:$L$82,$D54,1)+INDEX(Data!$M$33:$M$82,$D54,1)+INDEX(Data!$N$33:$N$82,$D54,1)),\"\")","v":4.371428571428571}]
[null,{"$f":"'Report A'!$B56","v":"2014-07-25"},{"$f":"'Report A'!$C56","v":"Friday"},{"$f":"'Report A'!$D56","v":25},{"$f":"IFERROR(IF($G$15=\"ALL\",SUMIFS(INDIRECT(\"Data!$AI$\"&$D55+32&\":$AS$\"&$D55+32),Data!$AI$30:$AS$30,E$16),SUMIFS(INDIRECT(\"Data!$AI$\"&$D55+32&\":$AS$\"&$D55+32),Data!$AI$30:$AS$30,E$16,Data!$AI$31:$AS$31,$G$15)),\"\")","v":94},{"$f":"IFERROR(IF($G$15=\"ALL\",SUMIFS(INDIRECT(\"Data!$AI$\"&$D55+32&\":$AS$\"&$D55+32),Data!$AI$30:$AS$30,F$16),SUMIFS(INDIRECT(\"Data!$AI$\"&$D55+32&\":$AS$\"&$D55+32),Data!$AI$30:$AS$30,F$16,Data!$AI$31:$AS$31,$G$15)),\"\")","v":189},{"$f":"IFERROR(IF($G$15=\"ALL\",SUMIFS(INDIRECT(\"Data!$AI$\"&$D55+32&\":$AS$\"&$D55+32),Data!$AI$30:$AS$30,G$16),SUMIFS(INDIRECT(\"Data!$AI$\"&$D55+32&\":$AS$\"&$D55+32),Data!$AI$30:$AS$30,G$16,Data!$AI$31:$AS$31,$G$15)),\"\")","v":334},{"$f":"IFERROR(IF($G$15=\"ALL\",SUMIFS(INDIRECT(\"Data!$AI$\"&$D55+32&\":$AS$\"&$D55+32),Data!$AI$30:$AS$30,H$16),SUMIFS(INDIRECT(\"Data!$AI$\"&$D55+32&\":$AS$\"&$D55+32),Data!$AI$30:$AS$30,H$16,Data!$AI$31:$AS$31,$G$15)),\"\")","v":35},652,{"$f":"IFERROR((SUMIFS(INDIRECT(\"Data!$AI$\"&$D55+32&\":$AS$\"&$D55+32),Data!$AI$30:$AS$30,J$16))/(INDEX(Data!$K$33:$K$82,$D55,1)),\"\")","v":3.76},{"$f":"IFERROR((SUMIFS(INDIRECT(\"Data!$AI$\"&$D55+32&\":$AS$\"&$D55+32),Data!$AI$30:$AS$30,K$16))/(INDEX(Data!$L$33:$L$82,$D55,1)),\"\")","v":6.5172413793103452},{"$f":"IFERROR((SUMIFS(INDIRECT(\"Data!$AI$\"&$D55+32&\":$AS$\"&$D55+32),Data!$AI$30:$AS$30,L$16))/(INDEX(Data!$M$33:$M$82,$D55,1)),\"\")","v":5.1384615384615389},{"$f":"IFERROR((SUMIFS(INDIRECT(\"Data!$AI$\"&$D55+32&\":$AS$\"&$D55+32),Data!$AI$30:$AS$30,M$16))/(INDEX(Data!$N$33:$N$82,$D55,1)),\"\")","v":3.1818181818181817},{"$f":"IFERROR((SUM(INDIRECT(\"Data!$AI$\"&$D55+32&\":$AS$\"&$D55+32)))/(INDEX(Data!$K$33:$K$82,$D55,1)+INDEX(Data!$L$33:$L$82,$D55,1)+INDEX(Data!$M$33:$M$82,$D55,1)+INDEX(Data!$N$33:$N$82,$D55,1)),\"\")","v":5.0153846153846153}]
[null,{"$f":"'Report A'!$B57","v":"2014-07-26"},{"$f":"'Report A'!$C57","v":"Saturday"},{"$f":"'Report A'!$D57","v":26},{"$f":"IFERROR(IF($G$15=\"ALL\",SUMIFS(INDIRECT(\"Data!$AI$\"&$D56+32&\":$AS$\"&$D56+32),Data!$AI$30:$AS$30,E$16),SUMIFS(INDIRECT(\"Data!$AI$\"&$D56+32&\":$AS$\"&$D56+32),Data!$AI$30:$AS$30,E$16,Data!$AI$31:$AS$31,$G$15)),\"\")","v":89},{"$f":"IFERROR(IF($G$15=\"ALL\",SUMIFS(INDIRECT(\"Data!$AI$\"&$D56+32&\":$AS$\"&$D56+32),Data!$AI$30:$AS$30,F$16),SUMIFS(INDIRECT(\"Data!$AI$\"&$D56+32&\":$AS$\"&$D56+32),Data!$AI$30:$AS$30,F$16,Data!$AI$31:$AS$31,$G$15)),\"\")","v":55},{"$f":"IFERROR(IF($G$15=\"ALL\",SUMIFS(INDIRECT(\"Data!$AI$\"&$D56+32&\":$AS$\"&$D56+32),Data!$AI$30:$AS$30,G$16),SUMIFS(INDIRECT(\"Data!$AI$\"&$D56+32&\":$AS$\"&$D56+32),Data!$AI$30:$AS$30,G$16,Data!$AI$31:$AS$31,$G$15)),\"\")","v":265},{"$f":"IFERROR(IF($G$15=\"ALL\",SUMIFS(INDIRECT(\"Data!$AI$\"&$D56+32&\":$AS$\"&$D56+32),Data!$AI$30:$AS$30,H$16),SUMIFS(INDIRECT(\"Data!$AI$\"&$D56+32&\":$AS$\"&$D56+32),Data!$AI$30:$AS$30,H$16,Data!$AI$31:$AS$31,$G$15)),\"\")","v":69},478,{"$f":"IFERROR((SUMIFS(INDIRECT(\"Data!$AI$\"&$D56+32&\":$AS$\"&$D56+32),Data!$AI$30:$AS$30,J$16))/(INDEX(Data!$K$33:$K$82,$D56,1)),\"\")","v":3.0689655172413794},{"$f":"IFERROR((SUMIFS(INDIRECT(\"Data!$AI$\"&$D56+32&\":$AS$\"&$D56+32),Data!$AI$30:$AS$30,K$16))/(INDEX(Data!$L$33:$L$82,$D56,1)),\"\")","v":3.0555555555555554},{"$f":"IFERROR((SUMIFS(INDIRECT(\"Data!$AI$\"&$D56+32&\":$AS$\"&$D56+32),Data!$AI$30:$AS$30,L$16))/(INDEX(Data!$M$33:$M$82,$D56,1)),\"\")","v":4.274193548387097},{"$f":"IFERROR((SUMIFS(INDIRECT(\"Data!$AI$\"&$D56+32&\":$AS$\"&$D56+32),Data!$AI$30:$AS$30,M$16))/(INDEX(Data!$N$33:$N$82,$D56,1)),\"\")","v":3.8333333333333335},{"$f":"IFERROR((SUM(INDIRECT(\"Data!$AI$\"&$D56+32&\":$AS$\"&$D56+32)))/(INDEX(Data!$K$33:$K$82,$D56,1)+INDEX(Data!$L$33:$L$82,$D56,1)+INDEX(Data!$M$33:$M$82,$D56,1)+INDEX(Data!$N$33:$N$82,$D56,1)),\"\")","v":3.7637795275590551}]
[null,{"$f":"'Report A'!$B58","v":"2014-07-27"},{"$f":"'Report A'!$C58","v":"Sunday"},{"$f":"'Report A'!$D58","v":27},{"$f":"IFERROR(IF($G$15=\"ALL\",SUMIFS(INDIRECT(\"Data!$AI$\"&$D57+32&\":$AS$\"&$D57+32),Data!$AI$30:$AS$30,E$16),SUMIFS(INDIRECT(\"Data!$AI$\"&$D57+32&\":$AS$\"&$D57+32),Data!$AI$30:$AS$30,E$16,Data!$AI$31:$AS$31,$G$15)),\"\")","v":108},{"$f":"IFERROR(IF($G$15=\"ALL\",SUMIFS(INDIRECT(\"Data!$AI$\"&$D57+32&\":$AS$\"&$D57+32),Data!$AI$30:$AS$30,F$16),SUMIFS(INDIRECT(\"Data!$AI$\"&$D57+32&\":$AS$\"&$D57+32),Data!$AI$30:$AS$30,F$16,Data!$AI$31:$AS$31,$G$15)),\"\")","v":94},{"$f":"IFERROR(IF($G$15=\"ALL\",SUMIFS(INDIRECT(\"Data!$AI$\"&$D57+32&\":$AS$\"&$D57+32),Data!$AI$30:$AS$30,G$16),SUMIFS(INDIRECT(\"Data!$AI$\"&$D57+32&\":$AS$\"&$D57+32),Data!$AI$30:$AS$30,G$16,Data!$AI$31:$AS$31,$G$15)),\"\")","v":271},{"$f":"IFERROR(IF($G$15=\"ALL\",SUMIFS(INDIRECT(\"Data!$AI$\"&$D57+32&\":$AS$\"&$D57+32),Data!$AI$30:$AS$30,H$16),SUMIFS(INDIRECT(\"Data!$AI$\"&$D57+32&\":$AS$\"&$D57+32),Data!$AI$30:$AS$30,H$16,Data!$AI$31:$AS$31,$G$15)),\"\")","v":74},547,{"$f":"IFERROR((SUMIFS(INDIRECT(\"Data!$AI$\"&$D57+32&\":$AS$\"&$D57+32),Data!$AI$30:$AS$30,J$16))/(INDEX(Data!$K$33:$K$82,$D57,1)),\"\")","v":3.8571428571428572},{"$f":"IFERROR((SUMIFS(INDIRECT(\"Data!$AI$\"&$D57+32&\":$AS$\"&$D57+32),Data!$AI$30:$AS$30,K$16))/(INDEX(Data!$L$33:$L$82,$D57,1)),\"\")","v":3.2413793103448274},{"$f":"IFERROR((SUMIFS(INDIRECT(\"Data!$AI$\"&$D57+32&\":$AS$\"&$D57+32),Data!$AI$30:$AS$30,L$16))/(INDEX(Data!$M$33:$M$82,$D57,1)),\"\")","v":4.3015873015873014},{"$f":"IFERROR((SUMIFS(INDIRECT(\"Data!$AI$\"&$D57+32&\":$AS$\"&$D57+32),Data!$AI$30:$AS$30,M$16))/(INDEX(Data!$N$33:$N$82,$D57,1)),\"\")","v":4.9333333333333336},{"$f":"IFERROR((SUM(INDIRECT(\"Data!$AI$\"&$D57+32&\":$AS$\"&$D57+32)))/(INDEX(Data!$K$33:$K$82,$D57,1)+INDEX(Data!$L$33:$L$82,$D57,1)+INDEX(Data!$M$33:$M$82,$D57,1)+INDEX(Data!$N$33:$N$82,$D57,1)),\"\")","v":4.0518518518518523}]
[null,{"$f":"'Report A'!$B59","v":"2014-07-28"},{"$f":"'Report A'!$C59","v":"Monday"},{"$f":"'Report A'!$D59","v":28},{"$f":"IFERROR(IF($G$15=\"ALL\",SUMIFS(INDIRECT(\"Data!$AI$\"&$D58+32&\":$AS$\"&$D58+32),Data!$AI$30:$AS$30,E$16),SUMIFS(INDIRECT(\"Data!$AI$\"&$D58+32&\":$AS$\"&$D58+32),Data!$AI$30:$AS$30,E$16,Data!$AI$31:$AS$31,$G$15)),\"\")","v":125},{"$f":"IFERROR(IF($G$15=\"ALL\",SUMIFS(INDIRECT(\"Data!$AI$\"&$D58+32&\":$AS$\"&$D58+32),Data!$AI$30:$AS$30,F$16),SUMIFS(INDIRECT(\"Data!$AI$\"&$D58+32&\":$AS$\"&$D58+32),Data!$AI$30:$AS$30,F$16,Data!$AI$31:$AS$31,$G$15)),\"\")","v":128},{"$f":"IFERROR(IF($G$15=\"ALL\",SUMIFS(INDIRECT(\"Data!$AI$\"&$D58+32&\":$AS$\"&$D58+32),Data!$AI$30:$AS$30,G$16),SUMIFS(INDIRECT(\"Data!$AI$\"&$D58+32&\":$AS$\"&$D58+32),Data!$AI$30:$AS$30,G$16,Data!$AI$31:$AS$31,$G$15)),\"\")","v":306},{"$f":"IFERROR(IF($G$15=\"ALL\",SUMIFS(INDIRECT(\"Data!$AI$\"&$D58+32&\":$AS$\"&$D58+32),Data!$AI$30:$AS$30,H$16),SUMIFS(INDIRECT(\"Data!$AI$\"&$D58+32&\":$AS$\"&$D58+32),Data!$AI$30:$AS$30,H$16,Data!$AI$31:$AS$31,$G$15)),\"\")","v":73},632,{"$f":"IFERROR((SUMIFS(INDIRECT(\"Data!$AI$\"&$D58+32&\":$AS$\"&$D58+32),Data!$AI$30:$AS$30,J$16))/(INDEX(Data!$K$33:$K$82,$D58,1)),\"\")","v":4.166666666666667},{"$f":"IFERROR((SUMIFS(INDIRECT(\"Data!$AI$\"&$D58+32&\":$AS$\"&$D58+32),Data!$AI$30:$AS$30,K$16))/(INDEX(Data!$L$33:$L$82,$D58,1)),\"\")","v":3.1219512195121952},{"$f":"IFERROR((SUMIFS(INDIRECT(\"Data!$AI$\"&$D58+32&\":$AS$\"&$D58+32),Data!$AI$30:$AS$30,L$16))/(INDEX(Data!$M$33:$M$82,$D58,1)),\"\")","v":4.78125},{"$f":"IFERROR((SUMIFS(INDIRECT(\"Data!$AI$\"&$D58+32&\":$AS$\"&$D58+32),Data!$AI$30:$AS$30,M$16))/(INDEX(Data!$N$33:$N$82,$D58,1)),\"\")","v":3.3181818181818183},{"$f":"IFERROR((SUM(INDIRECT(\"Data!$AI$\"&$D58+32&\":$AS$\"&$D58+32)))/(INDEX(Data!$K$33:$K$82,$D58,1)+INDEX(Data!$L$33:$L$82,$D58,1)+INDEX(Data!$M$33:$M$82,$D58,1)+INDEX(Data!$N$33:$N$82,$D58,1)),\"\")","v":4.0254777070063694}]
[null,{"$f":"'Report A'!$B60","v":"2014-07-29"},{"$f":"'Report A'!$C60","v":"Tuesday"},{"$f":"'Report A'!$D60","v":29},{"$f":"IFERROR(IF($G$15=\"ALL\",SUMIFS(INDIRECT(\"Data!$AI$\"&$D59+32&\":$AS$\"&$D59+32),Data!$AI$30:$AS$30,E$16),SUMIFS(INDIRECT(\"Data!$AI$\"&$D59+32&\":$AS$\"&$D59+32),Data!$AI$30:$AS$30,E$16,Data!$AI$31:$AS$31,$G$15)),\"\")","v":132},{"$f":"IFERROR(IF($G$15=\"ALL\",SUMIFS(INDIRECT(\"Data!$AI$\"&$D59+32&\":$AS$\"&$D59+32),Data!$AI$30:$AS$30,F$16),SUMIFS(INDIRECT(\"Data!$AI$\"&$D59+32&\":$AS$\"&$D59+32),Data!$AI$30:$AS$30,F$16,Data!$AI$31:$AS$31,$G$15)),\"\")","v":119},{"$f":"IFERROR(IF($G$15=\"ALL\",SUMIFS(INDIRECT(\"Data!$AI$\"&$D59+32&\":$AS$\"&$D59+32),Data!$AI$30:$AS$30,G$16),SUMIFS(INDIRECT(\"Data!$AI$\"&$D59+32&\":$AS$\"&$D59+32),Data!$AI$30:$AS$30,G$16,Data!$AI$31:$AS$31,$G$15)),\"\")","v":183},{"$f":"IFERROR(IF($G$15=\"ALL\",SUMIFS(INDIRECT(\"Data!$AI$\"&$D59+32&\":$AS$\"&$D59+32),Data!$AI$30:$AS$30,H$16),SUMIFS(INDIRECT(\"Data!$AI$\"&$D59+32&\":$AS$\"&$D59+32),Data!$AI$30:$AS$30,H$16,Data!$AI$31:$AS$31,$G$15)),\"\")","v":79},513,{"$f":"IFERROR((SUMIFS(INDIRECT(\"Data!$AI$\"&$D59+32&\":$AS$\"&$D59+32),Data!$AI$30:$AS$30,J$16))/(INDEX(Data!$K$33:$K$82,$D59,1)),\"\")","v":4},{"$f":"IFERROR((SUMIFS(INDIRECT(\"Data!$AI$\"&$D59+32&\":$AS$\"&$D59+32),Data!$AI$30:$AS$30,K$16))/(INDEX(Data!$L$33:$L$82,$D59,1)),\"\")","v":3.1315789473684212},{"$f":"IFERROR((SUMIFS(INDIRECT(\"Data!$AI$\"&$D59+32&\":$AS$\"&$D59+32),Data!$AI$30:$AS$30,L$16))/(INDEX(Data!$M$33:$M$82,$D59,1)),\"\")","v":4.0666666666666664},{"$f":"IFERROR((SUMIFS(INDIRECT(\"Data!$AI$\"&$D59+32&\":$AS$\"&$D59+32),Data!$AI$30:$AS$30,M$16))/(INDEX(Data!$N$33:$N$82,$D59,1)),\"\")","v":6.0769230769230766},{"$f":"IFERROR((SUM(INDIRECT(\"Data!$AI$\"&$D59+32&\":$AS$\"&$D59+32)))/(INDEX(Data!$K$33:$K$82,$D59,1)+INDEX(Data!$L$33:$L$82,$D59,1)+INDEX(Data!$M$33:$M$82,$D59,1)+INDEX(Data!$N$33:$N$82,$D59,1)),\"\")","v":3.9767441860465116}]
[null,{"$f":"'Report A'!$B61","v":"2014-07-30"},{"$f":"'Report A'!$C61","v":"Wednesday"},{"$f":"'Report A'!$D61","v":30},{"$f":"IFERROR(IF($G$15=\"ALL\",SUMIFS(INDIRECT(\"Data!$AI$\"&$D60+32&\":$AS$\"&$D60+32),Data!$AI$30:$AS$30,E$16),SUMIFS(INDIRECT(\"Data!$AI$\"&$D60+32&\":$AS$\"&$D60+32),Data!$AI$30:$AS$30,E$16,Data!$AI$31:$AS$31,$G$15)),\"\")","v":94},{"$f":"IFERROR(IF($G$15=\"ALL\",SUMIFS(INDIRECT(\"Data!$AI$\"&$D60+32&\":$AS$\"&$D60+32),Data!$AI$30:$AS$30,F$16),SUMIFS(INDIRECT(\"Data!$AI$\"&$D60+32&\":$AS$\"&$D60+32),Data!$AI$30:$AS$30,F$16,Data!$AI$31:$AS$31,$G$15)),\"\")","v":144},{"$f":"IFERROR(IF($G$15=\"ALL\",SUMIFS(INDIRECT(\"Data!$AI$\"&$D60+32&\":$AS$\"&$D60+32),Data!$AI$30:$AS$30,G$16),SUMIFS(INDIRECT(\"Data!$AI$\"&$D60+32&\":$AS$\"&$D60+32),Data!$AI$30:$AS$30,G$16,Data!$AI$31:$AS$31,$G$15)),\"\")","v":198},{"$f":"IFERROR(IF($G$15=\"ALL\",SUMIFS(INDIRECT(\"Data!$AI$\"&$D60+32&\":$AS$\"&$D60+32),Data!$AI$30:$AS$30,H$16),SUMIFS(INDIRECT(\"Data!$AI$\"&$D60+32&\":$AS$\"&$D60+32),Data!$AI$30:$AS$30,H$16,Data!$AI$31:$AS$31,$G$15)),\"\")","v":120},556,{"$f":"IFERROR((SUMIFS(INDIRECT(\"Data!$AI$\"&$D60+32&\":$AS$\"&$D60+32),Data!$AI$30:$AS$30,J$16))/(INDEX(Data!$K$33:$K$82,$D60,1)),\"\")","v":3.1333333333333333},{"$f":"IFERROR((SUMIFS(INDIRECT(\"Data!$AI$\"&$D60+32&\":$AS$\"&$D60+32),Data!$AI$30:$AS$30,K$16))/(INDEX(Data!$L$33:$L$82,$D60,1)),\"\")","v":3.8918918918918921},{"$f":"IFERROR((SUMIFS(INDIRECT(\"Data!$AI$\"&$D60+32&\":$AS$\"&$D60+32),Data!$AI$30:$AS$30,L$16))/(INDEX(Data!$M$33:$M$82,$D60,1)),\"\")","v":4.4000000000000004},{"$f":"IFERROR((SUMIFS(INDIRECT(\"Data!$AI$\"&$D60+32&\":$AS$\"&$D60+32),Data!$AI$30:$AS$30,M$16))/(INDEX(Data!$N$33:$N$82,$D60,1)),\"\")","v":6.666666666666667},{"$f":"IFERROR((SUM(INDIRECT(\"Data!$AI$\"&$D60+32&\":$AS$\"&$D60+32)))/(INDEX(Data!$K$33:$K$82,$D60,1)+INDEX(Data!$L$33:$L$82,$D60,1)+INDEX(Data!$M$33:$M$82,$D60,1)+INDEX(Data!$N$33:$N$82,$D60,1)),\"\")","v":4.2769230769230768}]
[null,{"$f":"'Report A'!$B62","v":"2014-07-31"},{"$f":"'Report A'!$C62","v":"Thursday"},{"$f":"'Report A'!$D62","v":31},{"$f":"IFERROR(IF($G$15=\"ALL\",SUMIFS(INDIRECT(\"Data!$AI$\"&$D61+32&\":$AS$\"&$D61+32),Data!$AI$30:$AS$30,E$16),SUMIFS(INDIRECT(\"Data!$AI$\"&$D61+32&\":$AS$\"&$D61+32),Data!$AI$30:$AS$30,E$16,Data!$AI$31:$AS$31,$G$15)),\"\")","v":94},{"$f":"IFERROR(IF($G$15=\"ALL\",SUMIFS(INDIRECT(\"Data!$AI$\"&$D61+32&\":$AS$\"&$D61+32),Data!$AI$30:$AS$30,F$16),SUMIFS(INDIRECT(\"Data!$AI$\"&$D61+32&\":$AS$\"&$D61+32),Data!$AI$30:$AS$30,F$16,Data!$AI$31:$AS$31,$G$15)),\"\")","v":154},{"$f":"IFERROR(IF($G$15=\"ALL\",SUMIFS(INDIRECT(\"Data!$AI$\"&$D61+32&\":$AS$\"&$D61+32),Data!$AI$30:$AS$30,G$16),SUMIFS(INDIRECT(\"Data!$AI$\"&$D61+32&\":$AS$\"&$D61+32),Data!$AI$30:$AS$30,G$16,Data!$AI$31:$AS$31,$G$15)),\"\")","v":221},{"$f":"IFERROR(IF($G$15=\"ALL\",SUMIFS(INDIRECT(\"Data!$AI$\"&$D61+32&\":$AS$\"&$D61+32),Data!$AI$30:$AS$30,H$16),SUMIFS(INDIRECT(\"Data!$AI$\"&$D61+32&\":$AS$\"&$D61+32),Data!$AI$30:$AS$30,H$16,Data!$AI$31:$AS$31,$G$15)),\"\")","v":92},561,{"$f":"IFERROR((SUMIFS(INDIRECT(\"Data!$AI$\"&$D61+32&\":$AS$\"&$D61+32),Data!$AI$30:$AS$30,J$16))/(INDEX(Data!$K$33:$K$82,$D61,1)),\"\")","v":3.76},{"$f":"IFERROR((SUMIFS(INDIRECT(\"Data!$AI$\"&$D61+32&\":$AS$\"&$D61+32),Data!$AI$30:$AS$30,K$16))/(INDEX(Data!$L$33:$L$82,$D61,1)),\"\")","v":4.666666666666667},{"$f":"IFERROR((SUMIFS(INDIRECT(\"Data!$AI$\"&$D61+32&\":$AS$\"&$D61+32),Data!$AI$30:$AS$30,L$16))/(INDEX(Data!$M$33:$M$82,$D61,1)),\"\")","v":4.42},{"$f":"IFERROR((SUMIFS(INDIRECT(\"Data!$AI$\"&$D61+32&\":$AS$\"&$D61+32),Data!$AI$30:$AS$30,M$16))/(INDEX(Data!$N$33:$N$82,$D61,1)),\"\")","v":6.5714285714285712},{"$f":"IFERROR((SUM(INDIRECT(\"Data!$AI$\"&$D61+32&\":$AS$\"&$D61+32)))/(INDEX(Data!$K$33:$K$82,$D61,1)+INDEX(Data!$L$33:$L$82,$D61,1)+INDEX(Data!$M$33:$M$82,$D61,1)+INDEX(Data!$N$33:$N$82,$D61,1)),\"\")","v":4.5983606557377046}]

{"sheet":"Report D","index":5,"n_rows":59,"n_cols":11,"rows_kept":59,"cut":false,"hidden":false,"merged":[]}
[]
[]
[null,null,"MONTHLY SALES REPORTING BY OUTLET"]
[]
[]
[null,"SUBJECT","REPORT D : AVERAGE SALES PER ROOM AND AVERAGE SALES PER PAX"]
[]
[null,"OUTLET",{"$f":"Data!$C$8","v":"SBA"}]
[]
[null,"MONTH / YEAR",{"$f":"Data!$C$10","v":"July 2014"}]
[]
[null,"MENU"]
[]
[null,"DATE","DAY","ROW","AVERAGE SALES PER ROOM",null,null,"AVERAGE SALES PER PAX",null,null,"CHART : AVERAGE SALES PER ROOM AND AVERAGE SALES PER PAX"]
[null,null,null,null,"A.M.","P.M.","TOTAL","A.M.","P.M.","TOTAL"]
[]
[null,null,null,null,"( RM )","( RM )","( RM )","( RM )","( RM )","( RM )"]
[null,"SUMMARY FOR MONTH",null,null,null,null,null,null,null,null,"LEGEND"]
[null,"AVERAGE SALES",null,null,{"$f":"IFERROR(SUM(E$29:E$59)/COUNTIF($D$29:$D$59,\">0\"),\"\")","v":71.475232212417708},{"$f":"IFERROR(SUM(F$29:F$59)/COUNTIF($D$29:$D$59,\">0\"),\"\")","v":117.50239536833723},99.353351333404248,18.201893522156862,27.408311549027029,23.851088944276484]
[null,"HIGHEST SALES",null,null,{"$f":"IFERROR(IF(LARGE(E$29:E$59,1)>0,LARGE(E$29:E$59,1),\"NIL\"),\"NIL\")","v":142.71875},{"$f":"IFERROR(IF(LARGE(F$29:F$59,1)>0,LARGE(F$29:F$59,1),\"NIL\"),\"NIL\")","v":183.30131578947368},150.7188679245283,29.206153846153846,38.887853107344633,34.916734693877544]
[null,"LOWEST SALES",null,null,{"$f":"IFERROR(IF(LARGE(E$29:E$59,COUNTIF(E$29:E$59,\">0\"))<>E$20,LARGE(E$29:E$59,COUNTIF(E$29:E$59,\">0\")),\"NIL\"),\"NIL\")","v":42.260714285714286},56.721311475409834,58.462790697674421,10.0184,15.585585585585585,15.662928348909658]
[null,"AVERAGE FOR ","MONDAY",null,{"$f":"IFERROR(SUMIF($C$29:$C$59,\"Monday*\",E$29:E$59)/COUNTIF($C$29:$C$59,\"Monday*\"),\"\")","v":68.937816901408453},{"$f":"IFERROR(SUMIF($C$29:$C$59,\"Monday*\",F$29:F$59)/COUNTIF($C$29:$C$59,\"Monday*\"),\"\")","v":111.91055558475966},94.726138163905119,16.910169998759319,27.256174188288384,23.119111096716228]
[null,null,"TUESDAY",null,{"$f":"IFERROR(SUMIF($C$29:$C$59,\"Tuesday*\",E$29:E$59)/COUNTIF($C$29:$C$59,\"Tuesday*\"),\"\")","v":69.294693872637524},{"$f":"IFERROR(SUMIF($C$29:$C$59,\"Tuesday*\",F$29:F$59)/COUNTIF($C$29:$C$59,\"Tuesday*\"),\"\")","v":106.26960911388275},90.720692518548432,17.64595720533368,23.869096057116998,21.50792878319503]
[null,null,"WEDNESDAY",null,{"$f":"IFERROR(SUMIF($C$29:$C$59,\"Wednesday*\",E$29:E$59)/COUNTIF($C$29:$C$59,\"Wednesday*\"),\"\")","v":48.056200880189053},{"$f":"IFERROR(SUMIF($C$29:$C$59,\"Wednesday*\",F$29:F$59)/COUNTIF($C$29:$C$59,\"Wednesday*\"),\"\")","v":101.93012431971886},77.026012026953566,12.629029420929161,24.061389737812696,18.947290817307525]
[null,null,"THURSDAY",null,{"$f":"IFERROR(SUMIF($C$29:$C$59,\"Thursday*\",E$29:E$59)/COUNTIF($C$29:$C$59,\"Thursday*\"),\"\")","v":62.221800595199582},{"$f":"IFERROR(SUMIF($C$29:$C$59,\"Thursday*\",F$29:F$59)/COUNTIF($C$29:$C$59,\"Thursday*\"),\"\")","v":100.14225314780701},85.17208229206723,15.021360128160149,22.963021394479334,19.888351393023527]
[null,null,"FRIDAY",null,{"$f":"IFERROR(SUMIF($C$29:$C$59,\"Friday*\",E$29:E$59)/COUNTIF($C$29:$C$59,\"Friday*\"),\"\")","v":74.909171539961008},{"$f":"IFERROR(SUMIF($C$29:$C$59,\"Friday*\",F$29:F$59)/COUNTIF($C$29:$C$59,\"Friday*\"),\"\")","v":155.28917878936471},127.31600299298447,15.560972621660827,34.886804085399092,27.444277552197523]
[null,null,"SATURDAY",null,{"$f":"IFERROR(SUMIF($C$29:$C$59,\"Saturday*\",E$29:E$59)/COUNTIF($C$29:$C$59,\"Saturday*\"),\"\")","v":86.175176862456397},{"$f":"IFERROR(SUMIF($C$29:$C$59,\"Saturday*\",F$29:F$59)/COUNTIF($C$29:$C$59,\"Saturday*\"),\"\")","v":151.33068515037593},128.327987853943,26.90092057295967,35.245418334198398,32.851526165610295]
[null,null,"SUNDAY",null,{"$f":"IFERROR(SUMIF($C$29:$C$59,\"Sunday*\",E$29:E$59)/COUNTIF($C$29:$C$59,\"Sunday*\"),\"\")","v":99.445015157378748},{"$f":"IFERROR(SUMIF($C$29:$C$59,\"Sunday*\",F$29:F$59)/COUNTIF($C$29:$C$59,\"Sunday*\"),\"\")","v":106.68566135335254},103.46986027608875,25.072178160307168,26.409133910312306,26.001560761711119]
[null,{"$f":"'Report A'!$B32","v":"2014-07-01"},{"$f":"'Report A'!$C32","v":"Tuesday"},{"$f":"'Report A'!$D32","v":1},{"$f":"IFERROR('Report A'!$H32/(INDEX(Data!$K$33:$K$82,$D29,1)+INDEX(Data!$L$33:$L$82,$D29,1)),\"\")","v":60.011111111111113},{"$f":"IFERROR('Report A'!$I32/(INDEX(Data!$M$33:$M$82,$D29,1)+INDEX(Data!$N$33:$N$82,$D29,1)),\"\")","v":127.97777777777776},{"$f":"IFERROR('Report A'!$J32/(INDEX(Data!$K$33:$K$82,$D29,1)+INDEX(Data!$L$33:$L$82,$D29,1)+INDEX(Data!$M$33:$M$82,$D29,1)+INDEX(Data!$N$33:$N$82,$D29,1)),\"\")","v":105.32222222222221},{"$f":"IFERROR('Report A'!$H32/(SUM(INDIRECT(\"Data!$AI$\"&$D29+32&\":$AN$\"&$D29+32))),\"\")","v":13.5025},{"$f":"IFERROR('Report A'!$I32/(SUM(INDIRECT(\"Data!$AO$\"&$D29+32&\":$AS$\"&$D29+32))),\"\")","v":27.97894736842105},{"$f":"IFERROR('Report A'!$J32/(SUM(INDIRECT(\"Data!$AI$\"&$D29+32&\":$AS$\"&$D29+32))),\"\")","v":23.245504087193456}]
[null,{"$f":"'Report A'!$B33","v":"2014-07-02"},{"$f":"'Report A'!$C33","v":"Wednesday"},{"$f":"'Report A'!$D33","v":2},{"$f":"IFERROR('Report A'!$H33/(INDEX(Data!$K$33:$K$82,$D30,1)+INDEX(Data!$L$33:$L$82,$D30,1)),\"\")","v":44.130303030303025},{"$f":"IFERROR('Report A'!$I33/(INDEX(Data!$M$33:$M$82,$D30,1)+INDEX(Data!$N$33:$N$82,$D30,1)),\"\")","v":96.188135593220323},{"$f":"IFERROR('Report A'!$J33/(INDEX(Data!$K$33:$K$82,$D30,1)+INDEX(Data!$L$33:$L$82,$D30,1)+INDEX(Data!$M$33:$M$82,$D30,1)+INDEX(Data!$N$33:$N$82,$D30,1)),\"\")","v":77.515217391304347},{"$f":"IFERROR('Report A'!$H33/(SUM(INDIRECT(\"Data!$AI$\"&$D30+32&\":$AN$\"&$D30+32))),\"\")","v":11.032575757575756},{"$f":"IFERROR('Report A'!$I33/(SUM(INDIRECT(\"Data!$AO$\"&$D30+32&\":$AS$\"&$D30+32))),\"\")","v":25.000440528634361},{"$f":"IFERROR('Report A'!$J33/(SUM(INDIRECT(\"Data!$AI$\"&$D30+32&\":$AS$\"&$D30+32))),\"\")","v":19.864623955431753}]
[null,{"$f":"'Report A'!$B34","v":"2014-07-03"},{"$f":"'Report A'!$C34","v":"Thursday"},{"$f":"'Report A'!$D34","v":3},{"$f":"IFERROR('Report A'!$H34/(INDEX(Data!$K$33:$K$82,$D31,1)+INDEX(Data!$L$33:$L$82,$D31,1)),\"\")","v":76.625},{"$f":"IFERROR('Report A'!$I34/(INDEX(Data!$M$33:$M$82,$D31,1)+INDEX(Data!$N$33:$N$82,$D31,1)),\"\")","v":110.30985915492958},{"$f":"IFERROR('Report A'!$J34/(INDEX(Data!$K$33:$K$82,$D31,1)+INDEX(Data!$L$33:$L$82,$D31,1)+INDEX(Data!$M$33:$M$82,$D31,1)+INDEX(Data!$N$33:$N$82,$D31,1)),\"\")","v":100.78282828282828},{"$f":"IFERROR('Report A'!$H34/(SUM(INDIRECT(\"Data!$AI$\"&$D31+32&\":$AN$\"&$D31+32))),\"\")","v":18.656521739130437},{"$f":"IFERROR('Report A'!$I34/(SUM(INDIRECT(\"Data!$AO$\"&$D31+32&\":$AS$\"&$D31+32))),\"\")","v":22.313390313390315},{"$f":"IFERROR('Report A'!$J34/(SUM(INDIRECT(\"Data!$AI$\"&$D31+32&\":$AS$\"&$D31+32))),\"\")","v":21.410944206008583}]
[null,{"$f":"'Report A'!$B35","v":"2014-07-04"},{"$f":"'Report A'!$C35","v":"Friday"},{"$f":"'Report A'!$D35","v":4},{"$f":"IFERROR('Report A'!$H35/(INDEX(Data!$K$33:$K$82,$D32,1)+INDEX(Data!$L$33:$L$82,$D32,1)),\"\")","v":68.176666666666662},{"$f":"IFERROR('Report A'!$I35/(INDEX(Data!$M$33:$M$82,$D32,1)+INDEX(Data!$N$33:$N$82,$D32,1)),\"\")","v":183.30131578947368},{"$f":"IFERROR('Report A'!$J35/(INDEX(Data!$K$33:$K$82,$D32,1)+INDEX(Data!$L$33:$L$82,$D32,1)+INDEX(Data!$M$33:$M$82,$D32,1)+INDEX(Data!$N$33:$N$82,$D32,1)),\"\")","v":150.7188679245283},{"$f":"IFERROR('Report A'!$H35/(SUM(INDIRECT(\"Data!$AI$\"&$D32+32&\":$AN$\"&$D32+32))),\"\")","v":14.203472222222222},{"$f":"IFERROR('Report A'!$I35/(SUM(INDIRECT(\"Data!$AO$\"&$D32+32&\":$AS$\"&$D32+32))),\"\")","v":37.448655913978492},{"$f":"IFERROR('Report A'!$J35/(SUM(INDIRECT(\"Data!$AI$\"&$D32+32&\":$AS$\"&$D32+32))),\"\")","v":30.961627906976741}]
[null,{"$f":"'Report A'!$B36","v":"2014-07-05"},{"$f":"'Report A'!$C36","v":"Saturday"},{"$f":"'Report A'!$D36","v":5},{"$f":"IFERROR('Report A'!$H36/(INDEX(Data!$K$33:$K$82,$D33,1)+INDEX(Data!$L$33:$L$82,$D33,1)),\"\")","v":81.534146341463412},{"$f":"IFERROR('Report A'!$I36/(INDEX(Data!$M$33:$M$82,$D33,1)+INDEX(Data!$N$33:$N$82,$D33,1)),\"\")","v":181.13552631578946},{"$f":"IFERROR('Report A'!$J36/(INDEX(Data!$K$33:$K$82,$D33,1)+INDEX(Data!$L$33:$L$82,$D33,1)+INDEX(Data!$M$33:$M$82,$D33,1)+INDEX(Data!$N$33:$N$82,$D33,1)),\"\")","v":146.2324786324786},{"$f":"IFERROR('Report A'!$H36/(SUM(INDIRECT(\"Data!$AI$\"&$D33+32&\":$AN$\"&$D33+32))),\"\")","v":24.580147058823528},{"$f":"IFERROR('Report A'!$I36/(SUM(INDIRECT(\"Data!$AO$\"&$D33+32&\":$AS$\"&$D33+32))),\"\")","v":38.887853107344633},{"$f":"IFERROR('Report A'!$J36/(SUM(INDIRECT(\"Data!$AI$\"&$D33+32&\":$AS$\"&$D33+32))),\"\")","v":34.916734693877544}]
[null,{"$f":"'Report A'!$B37","v":"2014-07-06"},{"$f":"'Report A'!$C37","v":"Sunday"},{"$f":"'Report A'!$D37","v":6},{"$f":"IFERROR('Report A'!$H37/(INDEX(Data!$K$33:$K$82,$D34,1)+INDEX(Data!$L$33:$L$82,$D34,1)),\"\")","v":142.71875},{"$f":"IFERROR('Report A'!$I37/(INDEX(Data!$M$33:$M$82,$D34,1)+INDEX(Data!$N$33:$N$82,$D34,1)),\"\")","v":114.51599999999999},{"$f":"IFERROR('Report A'!$J37/(INDEX(Data!$K$33:$K$82,$D34,1)+INDEX(Data!$L$33:$L$82,$D34,1)+INDEX(Data!$M$33:$M$82,$D34,1)+INDEX(Data!$N$33:$N$82,$D34,1)),\"\")","v":125.52195121951219},{"$f":"IFERROR('Report A'!$H37/(SUM(INDIRECT(\"Data!$AI$\"&$D34+32&\":$AN$\"&$D34+32))),\"\")","v":24.686486486486487},{"$f":"IFERROR('Report A'!$I37/(SUM(INDIRECT(\"Data!$AO$\"&$D34+32&\":$AS$\"&$D34+32))),\"\")","v":26.386175115207369},{"$f":"IFERROR('Report A'!$J37/(SUM(INDIRECT(\"Data!$AI$\"&$D34+32&\":$AS$\"&$D34+32))),\"\")","v":25.603980099502486}]
[null,{"$f":"'Report A'!$B38","v":"2014-07-07"},{"$f":"'Report A'!$C38","v":"Monday"},{"$f":"'Report A'!$D38","v":7},{"$f":"IFERROR('Report A'!$H38/(INDEX(Data!$K$33:$K$82,$D35,1)+INDEX(Data!$L$33:$L$82,$D35,1)),\"\")","v":61.77428571428571},{"$f":"IFERROR('Report A'!$I38/(INDEX(Data!$M$33:$M$82,$D35,1)+INDEX(Data!$N$33:$N$82,$D35,1)),\"\")","v":83.117857142857147},{"$f":"IFERROR('Report A'!$J38/(INDEX(Data!$K$33:$K$82,$D35,1)+INDEX(Data!$L$33:$L$82,$D35,1)+INDEX(Data!$M$33:$M$82,$D35,1)+INDEX(Data!$N$33:$N$82,$D35,1)),\"\")","v":74.908791208791214},{"$f":"IFERROR('Report A'!$H38/(SUM(INDIRECT(\"Data!$AI$\"&$D35+32&\":$AN$\"&$D35+32))),\"\")","v":13.429192546583851},{"$f":"IFERROR('Report A'!$I38/(SUM(INDIRECT(\"Data!$AO$\"&$D35+32&\":$AS$\"&$D35+32))),\"\")","v":20.149783549783553},{"$f":"IFERROR('Report A'!$J38/(SUM(INDIRECT(\"Data!$AI$\"&$D35+32&\":$AS$\"&$D35+32))),\"\")","v":17.389540816326534}]
[null,{"$f":"'Report A'!$B39","v":"2014-07-08"},{"$f":"'Report A'!$C39","v":"Tuesday"},{"$f":"'Report A'!$D39","v":8},{"$f":"IFERROR('Report A'!$H39/(INDEX(Data!$K$33:$K$82,$D36,1)+INDEX(Data!$L$33:$L$82,$D36,1)),\"\")","v":52.809999999999995},{"$f":"IFERROR('Report A'!$I39/(INDEX(Data!$M$33:$M$82,$D36,1)+INDEX(Data!$N$33:$N$82,$D36,1)),\"\")","v":75.465957446808503},{"$f":"IFERROR('Report A'!$J39/(INDEX(Data!$K$33:$K$82,$D36,1)+INDEX(Data!$L$33:$L$82,$D36,1)+INDEX(Data!$M$33:$M$82,$D36,1)+INDEX(Data!$N$33:$N$82,$D36,1)),\"\")","v":66.638961038961043},{"$f":"IFERROR('Report A'!$H39/(SUM(INDIRECT(\"Data!$AI$\"&$D36+32&\":$AN$\"&$D36+32))),\"\")","v":16.854255319148937},{"$f":"IFERROR('Report A'!$I39/(SUM(INDIRECT(\"Data!$AO$\"&$D36+32&\":$AS$\"&$D36+32))),\"\")","v":18.967379679144383},{"$f":"IFERROR('Report A'!$J39/(SUM(INDIRECT(\"Data!$AI$\"&$D36+32&\":$AS$\"&$D36+32))),\"\")","v":18.260498220640567}]
[null,{"$f":"'Report A'!$B40","v":"2014-07-09"},{"$f":"'Report A'!$C40","v":"Wednesday"},{"$f":"'Report A'!$D40","v":9},{"$f":"IFERROR('Report A'!$H40/(INDEX(Data!$K$33:$K$82,$D37,1)+INDEX(Data!$L$33:$L$82,$D37,1)),\"\")","v":55.396551724137929},{"$f":"IFERROR('Report A'!$I40/(INDEX(Data!$M$33:$M$82,$D37,1)+INDEX(Data!$N$33:$N$82,$D37,1)),\"\")","v":80.634482758620678},{"$f":"IFERROR('Report A'!$J40/(INDEX(Data!$K$33:$K$82,$D37,1)+INDEX(Data!$L$33:$L$82,$D37,1)+INDEX(Data!$M$33:$M$82,$D37,1)+INDEX(Data!$N$33:$N$82,$D37,1)),\"\")","v":72.221839080459759},{"$f":"IFERROR('Report A'!$H40/(SUM(INDIRECT(\"Data!$AI$\"&$D37+32&\":$AN$\"&$D37+32))),\"\")","v":16.227272727272727},{"$f":"IFERROR('Report A'!$I40/(SUM(INDIRECT(\"Data!$AO$\"&$D37+32&\":$AS$\"&$D37+32))),\"\")","v":19.816949152542371},{"$f":"IFERROR('Report A'!$J40/(SUM(INDIRECT(\"Data!$AI$\"&$D37+32&\":$AS$\"&$D37+32))),\"\")","v":18.756119402985071}]
[null,{"$f":"'Report A'!$B41","v":"2014-07-10"},{"$f":"'Report A'!$C41","v":"Thursday"},{"$f":"'Report A'!$D41","v":10},{"$f":"IFERROR('Report A'!$H41/(INDEX(Data!$K$33:$K$82,$D38,1)+INDEX(Data!$L$33:$L$82,$D38,1)),\"\")","v":62.711999999999996},{"$f":"IFERROR('Report A'!$I41/(INDEX(Data!$M$33:$M$82,$D38,1)+INDEX(Data!$N$33:$N$82,$D38,1)),\"\")","v":56.721311475409834},{"$f":"IFERROR('Report A'!$J41/(INDEX(Data!$K$33:$K$82,$D38,1)+INDEX(Data!$L$33:$L$82,$D38,1)+INDEX(Data!$M$33:$M$82,$D38,1)+INDEX(Data!$N$33:$N$82,$D38,1)),\"\")","v":58.462790697674421},{"$f":"IFERROR('Report A'!$H41/(SUM(INDIRECT(\"Data!$AI$\"&$D38+32&\":$AN$\"&$D38+32))),\"\")","v":15.836363636363636},{"$f":"IFERROR('Report A'!$I41/(SUM(INDIRECT(\"Data!$AO$\"&$D38+32&\":$AS$\"&$D38+32))),\"\")","v":15.585585585585585},{"$f":"IFERROR('Report A'!$J41/(SUM(INDIRECT(\"Data!$AI$\"&$D38+32&\":$AS$\"&$D38+32))),\"\")","v":15.662928348909658}]
[null,{"$f":"'Report A'!$B42","v":"2014-07-11"},{"$f":"'Report A'!$C42","v":"Friday"},{"$f":"'Report A'!$D42","v":11},{"$f":"IFERROR('Report A'!$H42/(INDEX(Data!$K$33:$K$82,$D39,1)+INDEX(Data!$L$33:$L$82,$D39,1)),\"\")","v":80.026315789473685},{"$f":"IFERROR('Report A'!$I42/(INDEX(Data!$M$33:$M$82,$D39,1)+INDEX(Data!$N$33:$N$82,$D39,1)),\"\")","v":137.31428571428572},{"$f":"IFERROR('Report A'!$J42/(INDEX(Data!$K$33:$K$82,$D39,1)+INDEX(Data!$L$33:$L$82,$D39,1)+INDEX(Data!$M$33:$M$82,$D39,1)+INDEX(Data!$N$33:$N$82,$D39,1)),\"\")","v":118.38434782608697},{"$f":"IFERROR('Report A'!$H42/(SUM(INDIRECT(\"Data!$AI$\"&$D39+32&\":$AN$\"&$D39+32))),\"\")","v":19.746753246753247},{"$f":"IFERROR('Report A'!$I42/(SUM(INDIRECT(\"Data!$AO$\"&$D39+32&\":$AS$\"&$D39+32))),\"\")","v":32.938317757009351},{"$f":"IFERROR('Report A'!$J42/(SUM(INDIRECT(\"Data!$AI$\"&$D39+32&\":$AS$\"&$D39+32))),\"\")","v":28.661473684210527}]
[null,{"$f":"'Report A'!$B43","v":"2014-07-12"},{"$f":"'Report A'!$C43","v":"Saturday"},{"$f":"'Report A'!$D43","v":12},{"$f":"IFERROR('Report A'!$H43/(INDEX(Data!$K$33:$K$82,$D40,1)+INDEX(Data!$L$33:$L$82,$D40,1)),\"\")","v":94.92},{"$f":"IFERROR('Report A'!$I43/(INDEX(Data!$M$33:$M$82,$D40,1)+INDEX(Data!$N$33:$N$82,$D40,1)),\"\")","v":130.71733333333333},{"$f":"IFERROR('Report A'!$J43/(INDEX(Data!$K$33:$K$82,$D40,1)+INDEX(Data!$L$33:$L$82,$D40,1)+INDEX(Data!$M$33:$M$82,$D40,1)+INDEX(Data!$N$33:$N$82,$D40,1)),\"\")","v":118.26608695652173},{"$f":"IFERROR('Report A'!$H43/(SUM(INDIRECT(\"Data!$AI$\"&$D40+32&\":$AN$\"&$D40+32))),\"\")","v":29.206153846153846},{"$f":"IFERROR('Report A'!$I43/(SUM(INDIRECT(\"Data!$AO$\"&$D40+32&\":$AS$\"&$D40+32))),\"\")","v":31.830519480519477},{"$f":"IFERROR('Report A'!$J43/(SUM(INDIRECT(\"Data!$AI$\"&$D40+32&\":$AS$\"&$D40+32))),\"\")","v":31.051598173515977}]
[null,{"$f":"'Report A'!$B44","v":"2014-07-13"},{"$f":"'Report A'!$C44","v":"Sunday"},{"$f":"'Report A'!$D44","v":13},{"$f":"IFERROR('Report A'!$H44/(INDEX(Data!$K$33:$K$82,$D41,1)+INDEX(Data!$L$33:$L$82,$D41,1)),\"\")","v":85.190000000000012},{"$f":"IFERROR('Report A'!$I44/(INDEX(Data!$M$33:$M$82,$D41,1)+INDEX(Data!$N$33:$N$82,$D41,1)),\"\")","v":90.638636363636365},{"$f":"IFERROR('Report A'!$J44/(INDEX(Data!$K$33:$K$82,$D41,1)+INDEX(Data!$L$33:$L$82,$D41,1)+INDEX(Data!$M$33:$M$82,$D41,1)+INDEX(Data!$N$33:$N$82,$D41,1)),\"\")","v":88.044047619047632},{"$f":"IFERROR('Report A'!$H44/(SUM(INDIRECT(\"Data!$AI$\"&$D41+32&\":$AN$\"&$D41+32))),\"\")","v":26.212307692307697},{"$f":"IFERROR('Report A'!$I44/(SUM(INDIRECT(\"Data!$AO$\"&$D41+32&\":$AS$\"&$D41+32))),\"\")","v":24.770807453416147},{"$f":"IFERROR('Report A'!$J44/(SUM(INDIRECT(\"Data!$AI$\"&$D41+32&\":$AS$\"&$D41+32))),\"\")","v":25.414776632302409}]
[null,{"$f":"'Report A'!$B45","v":"2014-07-14"},{"$f":"'Report A'!$C45","v":"Monday"},{"$f":"'Report A'!$D45","v":14},{"$f":"IFERROR('Report A'!$H45/(INDEX(Data!$K$33:$K$82,$D42,1)+INDEX(Data!$L$33:$L$82,$D42,1)),\"\")","v":78.004999999999995},{"$f":"IFERROR('Report A'!$I45/(INDEX(Data!$M$33:$M$82,$D42,1)+INDEX(Data!$N$33:$N$82,$D42,1)),\"\")","v":140.29240506329114},{"$f":"IFERROR('Report A'!$J45/(INDEX(Data!$K$33:$K$82,$D42,1)+INDEX(Data!$L$33:$L$82,$D42,1)+INDEX(Data!$M$33:$M$82,$D42,1)+INDEX(Data!$N$33:$N$82,$D42,1)),\"\")","v":119.35546218487394},{"$f":"IFERROR('Report A'!$H45/(SUM(INDIRECT(\"Data!$AI$\"&$D42+32&\":$AN$\"&$D42+32))),\"\")","v":15.838578680203044},{"$f":"IFERROR('Report A'!$I45/(SUM(INDIRECT(\"Data!$AO$\"&$D42+32&\":$AS$\"&$D42+32))),\"\")","v":34.962460567823342},{"$f":"IFERROR('Report A'!$J45/(SUM(INDIRECT(\"Data!$AI$\"&$D42+32&\":$AS$\"&$D42+32))),\"\")","v":27.632879377431905}]
[null,{"$f":"'Report A'!$B46","v":"2014-07-15"},{"$f":"'Report A'!$C46","v":"Tuesday"},{"$f":"'Report A'!$D46","v":15},{"$f":"IFERROR('Report A'!$H46/(INDEX(Data!$K$33:$K$82,$D43,1)+INDEX(Data!$L$33:$L$82,$D43,1)),\"\")","v":82.418461538461543},{"$f":"IFERROR('Report A'!$I46/(INDEX(Data!$M$33:$M$82,$D43,1)+INDEX(Data!$N$33:$N$82,$D43,1)),\"\")","v":107.81538461538462},{"$f":"IFERROR('Report A'!$J46/(INDEX(Data!$K$33:$K$82,$D43,1)+INDEX(Data!$L$33:$L$82,$D43,1)+INDEX(Data!$M$33:$M$82,$D43,1)+INDEX(Data!$N$33:$N$82,$D43,1)),\"\")","v":91.942307692307693},{"$f":"IFERROR('Report A'!$H46/(SUM(INDIRECT(\"Data!$AI$\"&$D43+32&\":$AN$\"&$D43+32))),\"\")","v":21.008627450980391},{"$f":"IFERROR('Report A'!$I46/(SUM(INDIRECT(\"Data!$AO$\"&$D43+32&\":$AS$\"&$D43+32))),\"\")","v":22.365957446808512},{"$f":"IFERROR('Report A'!$J46/(SUM(INDIRECT(\"Data!$AI$\"&$D43+32&\":$AS$\"&$D43+32))),\"\")","v":21.584650112866818}]
[null,{"$f":"'Report A'!$B47","v":"2014-07-16"},{"$f":"'Report A'!$C47","v":"Wednesday"},{"$f":"'Report A'!$D47","v":16},{"$f":"IFERROR('Report A'!$H47/(INDEX(Data!$K$33:$K$82,$D44,1)+INDEX(Data!$L$33:$L$82,$D44,1)),\"\")","v":42.602499999999999},{"$f":"IFERROR('Report A'!$I47/(INDEX(Data!$M$33:$M$82,$D44,1)+INDEX(Data!$N$33:$N$82,$D44,1)),\"\")","v":114.59318181818183},{"$f":"IFERROR('Report A'!$J47/(INDEX(Data!$K$33:$K$82,$D44,1)+INDEX(Data!$L$33:$L$82,$D44,1)+INDEX(Data!$M$33:$M$82,$D44,1)+INDEX(Data!$N$33:$N$82,$D44,1)),\"\")","v":80.311904761904771},{"$f":"IFERROR('Report A'!$H47/(SUM(INDIRECT(\"Data!$AI$\"&$D44+32&\":$AN$\"&$D44+32))),\"\")","v":10.717610062893081},{"$f":"IFERROR('Report A'!$I47/(SUM(INDIRECT(\"Data!$AO$\"&$D44+32&\":$AS$\"&$D44+32))),\"\")","v":24.595609756097563},{"$f":"IFERROR('Report A'!$J47/(SUM(INDIRECT(\"Data!$AI$\"&$D44+32&\":$AS$\"&$D44+32))),\"\")","v":18.533516483516486}]
[null,{"$f":"'Report A'!$B48","v":"2014-07-17"},{"$f":"'Report A'!$C48","v":"Thursday"},{"$f":"'Report A'!$D48","v":17},{"$f":"IFERROR('Report A'!$H48/(INDEX(Data!$K$33:$K$82,$D45,1)+INDEX(Data!$L$33:$L$82,$D45,1)),\"\")","v":54.976923076923079},{"$f":"IFERROR('Report A'!$I48/(INDEX(Data!$M$33:$M$82,$D45,1)+INDEX(Data!$N$33:$N$82,$D45,1)),\"\")","v":100.48478260869564},{"$f":"IFERROR('Report A'!$J48/(INDEX(Data!$K$33:$K$82,$D45,1)+INDEX(Data!$L$33:$L$82,$D45,1)+INDEX(Data!$M$33:$M$82,$D45,1)+INDEX(Data!$N$33:$N$82,$D45,1)),\"\")","v":84.05138888888888},{"$f":"IFERROR('Report A'!$H48/(SUM(INDIRECT(\"Data!$AI$\"&$D45+32&\":$AN$\"&$D45+32))),\"\")","v":13.484905660377359},{"$f":"IFERROR('Report A'!$I48/(SUM(INDIRECT(\"Data!$AO$\"&$D45+32&\":$AS$\"&$D45+32))),\"\")","v":26.718497109826586},{"$f":"IFERROR('Report A'!$J48/(SUM(INDIRECT(\"Data!$AI$\"&$D45+32&\":$AS$\"&$D45+32))),\"\")","v":21.690681003584224}]
[null,{"$f":"'Report A'!$B49","v":"2014-07-18"},{"$f":"'Report A'!$C49","v":"Friday"},{"$f":"'Report A'!$D49","v":18},{"$f":"IFERROR('Report A'!$H49/(INDEX(Data!$K$33:$K$82,$D46,1)+INDEX(Data!$L$33:$L$82,$D46,1)),\"\")","v":55.657777777777774},{"$f":"IFERROR('Report A'!$I49/(INDEX(Data!$M$33:$M$82,$D46,1)+INDEX(Data!$N$33:$N$82,$D46,1)),\"\")","v":131.0463768115942},{"$f":"IFERROR('Report A'!$J49/(INDEX(Data!$K$33:$K$82,$D46,1)+INDEX(Data!$L$33:$L$82,$D46,1)+INDEX(Data!$M$33:$M$82,$D46,1)+INDEX(Data!$N$33:$N$82,$D46,1)),\"\")","v":101.28771929824562},{"$f":"IFERROR('Report A'!$H49/(SUM(INDIRECT(\"Data!$AI$\"&$D46+32&\":$AN$\"&$D46+32))),\"\")","v":10.0184},{"$f":"IFERROR('Report A'!$I49/(SUM(INDIRECT(\"Data!$AO$\"&$D46+32&\":$AS$\"&$D46+32))),\"\")","v":34.250757575757575},{"$f":"IFERROR('Report A'!$J49/(SUM(INDIRECT(\"Data!$AI$\"&$D46+32&\":$AS$\"&$D46+32))),\"\")","v":22.464591439688718}]
[null,{"$f":"'Report A'!$B50","v":"2014-07-19"},{"$f":"'Report A'!$C50","v":"Saturday"},{"$f":"'Report A'!$D50","v":19},{"$f":"IFERROR('Report A'!$H50/(INDEX(Data!$K$33:$K$82,$D47,1)+INDEX(Data!$L$33:$L$82,$D47,1)),\"\")","v":87.572093023255817},{"$f":"IFERROR('Report A'!$I50/(INDEX(Data!$M$33:$M$82,$D47,1)+INDEX(Data!$N$33:$N$82,$D47,1)),\"\")","v":141.10238095238097},{"$f":"IFERROR('Report A'!$J50/(INDEX(Data!$K$33:$K$82,$D47,1)+INDEX(Data!$L$33:$L$82,$D47,1)+INDEX(Data!$M$33:$M$82,$D47,1)+INDEX(Data!$N$33:$N$82,$D47,1)),\"\")","v":122.97795275590552},{"$f":"IFERROR('Report A'!$H50/(SUM(INDIRECT(\"Data!$AI$\"&$D47+32&\":$AN$\"&$D47+32))),\"\")","v":27.486131386861313},{"$f":"IFERROR('Report A'!$I50/(SUM(INDIRECT(\"Data!$AO$\"&$D47+32&\":$AS$\"&$D47+32))),\"\")","v":33.768091168091168},{"$f":"IFERROR('Report A'!$J50/(SUM(INDIRECT(\"Data!$AI$\"&$D47+32&\":$AS$\"&$D47+32))),\"\")","v":32.004508196721311}]
[null,{"$f":"'Report A'!$B51","v":"2014-07-20"},{"$f":"'Report A'!$C51","v":"Sunday"},{"$f":"'Report A'!$D51","v":20},{"$f":"IFERROR('Report A'!$H51/(INDEX(Data!$K$33:$K$82,$D48,1)+INDEX(Data!$L$33:$L$82,$D48,1)),\"\")","v":81.694117647058818},{"$f":"IFERROR('Report A'!$I51/(INDEX(Data!$M$33:$M$82,$D48,1)+INDEX(Data!$N$33:$N$82,$D48,1)),\"\")","v":74.476470588235301},{"$f":"IFERROR('Report A'!$J51/(INDEX(Data!$K$33:$K$82,$D48,1)+INDEX(Data!$L$33:$L$82,$D48,1)+INDEX(Data!$M$33:$M$82,$D48,1)+INDEX(Data!$N$33:$N$82,$D48,1)),\"\")","v":78.085294117647052},{"$f":"IFERROR('Report A'!$H51/(SUM(INDIRECT(\"Data!$AI$\"&$D48+32&\":$AN$\"&$D48+32))),\"\")","v":24.508235294117647},{"$f":"IFERROR('Report A'!$I51/(SUM(INDIRECT(\"Data!$AO$\"&$D48+32&\":$AS$\"&$D48+32))),\"\")","v":21.2195530726257},{"$f":"IFERROR('Report A'!$J51/(SUM(INDIRECT(\"Data!$AI$\"&$D48+32&\":$AS$\"&$D48+32))),\"\")","v":22.821489971346704}]
[null,{"$f":"'Report A'!$B52","v":"2014-07-21"},{"$f":"'Report A'!$C52","v":"Monday"},{"$f":"'Report A'!$D52","v":21},{"$f":"IFERROR('Report A'!$H52/(INDEX(Data!$K$33:$K$82,$D49,1)+INDEX(Data!$L$33:$L$82,$D49,1)),\"\")","v":42.260714285714286},{"$f":"IFERROR('Report A'!$I52/(INDEX(Data!$M$33:$M$82,$D49,1)+INDEX(Data!$N$33:$N$82,$D49,1)),\"\")","v":83.63428571428571},{"$f":"IFERROR('Report A'!$J52/(INDEX(Data!$K$33:$K$82,$D49,1)+INDEX(Data!$L$33:$L$82,$D49,1)+INDEX(Data!$M$33:$M$82,$D49,1)+INDEX(Data!$N$33:$N$82,$D49,1)),\"\")","v":65.246031746031747},{"$f":"IFERROR('Report A'!$H52/(SUM(INDIRECT(\"Data!$AI$\"&$D49+32&\":$AN$\"&$D49+32))),\"\")","v":12.074489795918367},{"$f":"IFERROR('Report A'!$I52/(SUM(INDIRECT(\"Data!$AO$\"&$D49+32&\":$AS$\"&$D49+32))),\"\")","v":22.009022556390978},{"$f":"IFERROR('Report A'!$J52/(SUM(INDIRECT(\"Data!$AI$\"&$D49+32&\":$AS$\"&$D49+32))),\"\")","v":17.794372294372295}]
[null,{"$f":"'Report A'!$B53","v":"2014-07-22"},{"$f":"'Report A'!$C53","v":"Tuesday"},{"$f":"'Report A'!$D53","v":22},{"$f":"IFERROR('Report A'!$H53/(INDEX(Data!$K$33:$K$82,$D50,1)+INDEX(Data!$L$33:$L$82,$D50,1)),\"\")","v":61.273333333333333},{"$f":"IFERROR('Report A'!$I53/(INDEX(Data!$M$33:$M$82,$D50,1)+INDEX(Data!$N$33:$N$82,$D50,1)),\"\")","v":101.95961538461538},{"$f":"IFERROR('Report A'!$J53/(INDEX(Data!$K$33:$K$82,$D50,1)+INDEX(Data!$L$33:$L$82,$D50,1)+INDEX(Data!$M$33:$M$82,$D50,1)+INDEX(Data!$N$33:$N$82,$D50,1)),\"\")","v":87.074390243902428},{"$f":"IFERROR('Report A'!$H53/(SUM(INDIRECT(\"Data!$AI$\"&$D50+32&\":$AN$\"&$D50+32))),\"\")","v":11.417391304347827},{"$f":"IFERROR('Report A'!$I53/(SUM(INDIRECT(\"Data!$AO$\"&$D50+32&\":$AS$\"&$D50+32))),\"\")","v":23.882432432432431},{"$f":"IFERROR('Report A'!$J53/(SUM(INDIRECT(\"Data!$AI$\"&$D50+32&\":$AS$\"&$D50+32))),\"\")","v":18.642558746736292}]
[null,{"$f":"'Report A'!$B54","v":"2014-07-23"},{"$f":"'Report A'!$C54","v":"Wednesday"},{"$f":"'Report A'!$D54","v":23},{"$f":"IFERROR('Report A'!$H54/(INDEX(Data!$K$33:$K$82,$D51,1)+INDEX(Data!$L$33:$L$82,$D51,1)),\"\")","v":52.471052631578949},{"$f":"IFERROR('Report A'!$I54/(INDEX(Data!$M$33:$M$82,$D51,1)+INDEX(Data!$N$33:$N$82,$D51,1)),\"\")","v":98.506249999999994},{"$f":"IFERROR('Report A'!$J54/(INDEX(Data!$K$33:$K$82,$D51,1)+INDEX(Data!$L$33:$L$82,$D51,1)+INDEX(Data!$M$33:$M$82,$D51,1)+INDEX(Data!$N$33:$N$82,$D51,1)),\"\")","v":73.515714285714296},{"$f":"IFERROR('Report A'!$H54/(SUM(INDIRECT(\"Data!$AI$\"&$D51+32&\":$AN$\"&$D51+32))),\"\")","v":12.308024691358025},{"$f":"IFERROR('Report A'!$I54/(SUM(INDIRECT(\"Data!$AO$\"&$D51+32&\":$AS$\"&$D51+32))),\"\")","v":27.17413793103448},{"$f":"IFERROR('Report A'!$J54/(SUM(INDIRECT(\"Data!$AI$\"&$D51+32&\":$AS$\"&$D51+32))),\"\")","v":18.511151079136692}]
[null,{"$f":"'Report A'!$B55","v":"2014-07-24"},{"$f":"'Report A'!$C55","v":"Thursday"},{"$f":"'Report A'!$D55","v":24},{"$f":"IFERROR('Report A'!$H55/(INDEX(Data!$K$33:$K$82,$D52,1)+INDEX(Data!$L$33:$L$82,$D52,1)),\"\")","v":52.62439024390244},{"$f":"IFERROR('Report A'!$I55/(INDEX(Data!$M$33:$M$82,$D52,1)+INDEX(Data!$N$33:$N$82,$D52,1)),\"\")","v":108.03125},{"$f":"IFERROR('Report A'!$J55/(INDEX(Data!$K$33:$K$82,$D52,1)+INDEX(Data!$L$33:$L$82,$D52,1)+INDEX(Data!$M$33:$M$82,$D52,1)+INDEX(Data!$N$33:$N$82,$D52,1)),\"\")","v":86.396190476190483},{"$f":"IFERROR('Report A'!$H55/(SUM(INDIRECT(\"Data!$AI$\"&$D52+32&\":$AN$\"&$D52+32))),\"\")","v":12.121348314606742},{"$f":"IFERROR('Report A'!$I55/(SUM(INDIRECT(\"Data!$AO$\"&$D52+32&\":$AS$\"&$D52+32))),\"\")","v":24.604982206405694},{"$f":"IFERROR('Report A'!$J55/(SUM(INDIRECT(\"Data!$AI$\"&$D52+32&\":$AS$\"&$D52+32))),\"\")","v":19.763834422657954}]
[null,{"$f":"'Report A'!$B56","v":"2014-07-25"},{"$f":"'Report A'!$C56","v":"Friday"},{"$f":"'Report A'!$D56","v":25},{"$f":"IFERROR('Report A'!$H56/(INDEX(Data!$K$33:$K$82,$D53,1)+INDEX(Data!$L$33:$L$82,$D53,1)),\"\")","v":95.775925925925918},{"$f":"IFERROR('Report A'!$I56/(INDEX(Data!$M$33:$M$82,$D53,1)+INDEX(Data!$N$33:$N$82,$D53,1)),\"\")","v":169.49473684210525},{"$f":"IFERROR('Report A'!$J56/(INDEX(Data!$K$33:$K$82,$D53,1)+INDEX(Data!$L$33:$L$82,$D53,1)+INDEX(Data!$M$33:$M$82,$D53,1)+INDEX(Data!$N$33:$N$82,$D53,1)),\"\")","v":138.87307692307692},{"$f":"IFERROR('Report A'!$H56/(SUM(INDIRECT(\"Data!$AI$\"&$D53+32&\":$AN$\"&$D53+32))),\"\")","v":18.275265017667842},{"$f":"IFERROR('Report A'!$I56/(SUM(INDIRECT(\"Data!$AO$\"&$D53+32&\":$AS$\"&$D53+32))),\"\")","v":34.90948509485095},{"$f":"IFERROR('Report A'!$J56/(SUM(INDIRECT(\"Data!$AI$\"&$D53+32&\":$AS$\"&$D53+32))),\"\")","v":27.689417177914109}]
[null,{"$f":"'Report A'!$B57","v":"2014-07-26"},{"$f":"'Report A'!$C57","v":"Saturday"},{"$f":"'Report A'!$D57","v":26},{"$f":"IFERROR('Report A'!$H57/(INDEX(Data!$K$33:$K$82,$D54,1)+INDEX(Data!$L$33:$L$82,$D54,1)),\"\")","v":80.674468085106383},{"$f":"IFERROR('Report A'!$I57/(INDEX(Data!$M$33:$M$82,$D54,1)+INDEX(Data!$N$33:$N$82,$D54,1)),\"\")","v":152.36750000000001},{"$f":"IFERROR('Report A'!$J57/(INDEX(Data!$K$33:$K$82,$D54,1)+INDEX(Data!$L$33:$L$82,$D54,1)+INDEX(Data!$M$33:$M$82,$D54,1)+INDEX(Data!$N$33:$N$82,$D54,1)),\"\")","v":125.83543307086613},{"$f":"IFERROR('Report A'!$H57/(SUM(INDIRECT(\"Data!$AI$\"&$D54+32&\":$AN$\"&$D54+32))),\"\")","v":26.331249999999997},{"$f":"IFERROR('Report A'!$I57/(SUM(INDIRECT(\"Data!$AO$\"&$D54+32&\":$AS$\"&$D54+32))),\"\")","v":36.495209580838321},{"$f":"IFERROR('Report A'!$J57/(SUM(INDIRECT(\"Data!$AI$\"&$D54+32&\":$AS$\"&$D54+32))),\"\")","v":33.433263598326356}]
[null,{"$f":"'Report A'!$B58","v":"2014-07-27"},{"$f":"'Report A'!$C58","v":"Sunday"},{"$f":"'Report A'!$D58","v":27},{"$f":"IFERROR('Report A'!$H58/(INDEX(Data!$K$33:$K$82,$D55,1)+INDEX(Data!$L$33:$L$82,$D55,1)),\"\")","v":88.177192982456148},{"$f":"IFERROR('Report A'!$I58/(INDEX(Data!$M$33:$M$82,$D55,1)+INDEX(Data!$N$33:$N$82,$D55,1)),\"\")","v":147.11153846153846},{"$f":"IFERROR('Report A'!$J58/(INDEX(Data!$K$33:$K$82,$D55,1)+INDEX(Data!$L$33:$L$82,$D55,1)+INDEX(Data!$M$33:$M$82,$D55,1)+INDEX(Data!$N$33:$N$82,$D55,1)),\"\")","v":122.22814814814816},{"$f":"IFERROR('Report A'!$H58/(SUM(INDIRECT(\"Data!$AI$\"&$D55+32&\":$AN$\"&$D55+32))),\"\")","v":24.881683168316833},{"$f":"IFERROR('Report A'!$I58/(SUM(INDIRECT(\"Data!$AO$\"&$D55+32&\":$AS$\"&$D55+32))),\"\")","v":33.260000000000005},{"$f":"IFERROR('Report A'!$J58/(SUM(INDIRECT(\"Data!$AI$\"&$D55+32&\":$AS$\"&$D55+32))),\"\")","v":30.165996343692875}]
[null,{"$f":"'Report A'!$B59","v":"2014-07-28"},{"$f":"'Report A'!$C59","v":"Monday"},{"$f":"'Report A'!$D59","v":28},{"$f":"IFERROR('Report A'!$H59/(INDEX(Data!$K$33:$K$82,$D56,1)+INDEX(Data!$L$33:$L$82,$D56,1)),\"\")","v":93.711267605633807},{"$f":"IFERROR('Report A'!$I59/(INDEX(Data!$M$33:$M$82,$D56,1)+INDEX(Data!$N$33:$N$82,$D56,1)),\"\")","v":140.59767441860467},{"$f":"IFERROR('Report A'!$J59/(INDEX(Data!$K$33:$K$82,$D56,1)+INDEX(Data!$L$33:$L$82,$D56,1)+INDEX(Data!$M$33:$M$82,$D56,1)+INDEX(Data!$N$33:$N$82,$D56,1)),\"\")","v":119.39426751592357},{"$f":"IFERROR('Report A'!$H59/(SUM(INDIRECT(\"Data!$AI$\"&$D56+32&\":$AN$\"&$D56+32))),\"\")","v":26.298418972332016},{"$f":"IFERROR('Report A'!$I59/(SUM(INDIRECT(\"Data!$AO$\"&$D56+32&\":$AS$\"&$D56+32))),\"\")","v":31.903430079155676},{"$f":"IFERROR('Report A'!$J59/(SUM(INDIRECT(\"Data!$AI$\"&$D56+32&\":$AS$\"&$D56+32))),\"\")","v":29.659651898734179}]
[null,{"$f":"'Report A'!$B60","v":"2014-07-29"},{"$f":"'Report A'!$C60","v":"Tuesday"},{"$f":"'Report A'!$D60","v":29},{"$f":"IFERROR('Report A'!$H60/(INDEX(Data!$K$33:$K$82,$D57,1)+INDEX(Data!$L$33:$L$82,$D57,1)),\"\")","v":89.960563380281684},{"$f":"IFERROR('Report A'!$I60/(INDEX(Data!$M$33:$M$82,$D57,1)+INDEX(Data!$N$33:$N$82,$D57,1)),\"\")","v":118.12931034482759},{"$f":"IFERROR('Report A'!$J60/(INDEX(Data!$K$33:$K$82,$D57,1)+INDEX(Data!$L$33:$L$82,$D57,1)+INDEX(Data!$M$33:$M$82,$D57,1)+INDEX(Data!$N$33:$N$82,$D57,1)),\"\")","v":102.62558139534885},{"$f":"IFERROR('Report A'!$H60/(SUM(INDIRECT(\"Data!$AI$\"&$D57+32&\":$AN$\"&$D57+32))),\"\")","v":25.447011952191236},{"$f":"IFERROR('Report A'!$I60/(SUM(INDIRECT(\"Data!$AO$\"&$D57+32&\":$AS$\"&$D57+32))),\"\")","v":26.150763358778626},{"$f":"IFERROR('Report A'!$J60/(SUM(INDIRECT(\"Data!$AI$\"&$D57+32&\":$AS$\"&$D57+32))),\"\")","v":25.806432748538015}]
[null,{"$f":"'Report A'!$B61","v":"2014-07-30"},{"$f":"'Report A'!$C61","v":"Wednesday"},{"$f":"'Report A'!$D61","v":30},{"$f":"IFERROR('Report A'!$H61/(INDEX(Data!$K$33:$K$82,$D58,1)+INDEX(Data!$L$33:$L$82,$D58,1)),\"\")","v":45.680597014925375},{"$f":"IFERROR('Report A'!$I61/(INDEX(Data!$M$33:$M$82,$D58,1)+INDEX(Data!$N$33:$N$82,$D58,1)),\"\")","v":119.72857142857143},{"$f":"IFERROR('Report A'!$J61/(INDEX(Data!$K$33:$K$82,$D58,1)+INDEX(Data!$L$33:$L$82,$D58,1)+INDEX(Data!$M$33:$M$82,$D58,1)+INDEX(Data!$N$33:$N$82,$D58,1)),\"\")","v":81.565384615384616},{"$f":"IFERROR('Report A'!$H61/(SUM(INDIRECT(\"Data!$AI$\"&$D58+32&\":$AN$\"&$D58+32))),\"\")","v":12.859663865546219},{"$f":"IFERROR('Report A'!$I61/(SUM(INDIRECT(\"Data!$AO$\"&$D58+32&\":$AS$\"&$D58+32))),\"\")","v":23.719811320754715},{"$f":"IFERROR('Report A'!$J61/(SUM(INDIRECT(\"Data!$AI$\"&$D58+32&\":$AS$\"&$D58+32))),\"\")","v":19.071043165467625}]
[null,{"$f":"'Report A'!$B62","v":"2014-07-31"},{"$f":"'Report A'!$C62","v":"Thursday"},{"$f":"'Report A'!$D62","v":31},{"$f":"IFERROR('Report A'!$H62/(INDEX(Data!$K$33:$K$82,$D59,1)+INDEX(Data!$L$33:$L$82,$D59,1)),\"\")","v":64.17068965517241},{"$f":"IFERROR('Report A'!$I62/(INDEX(Data!$M$33:$M$82,$D59,1)+INDEX(Data!$N$33:$N$82,$D59,1)),\"\")","v":125.1640625},{"$f":"IFERROR('Report A'!$J62/(INDEX(Data!$K$33:$K$82,$D59,1)+INDEX(Data!$L$33:$L$82,$D59,1)+INDEX(Data!$M$33:$M$82,$D59,1)+INDEX(Data!$N$33:$N$82,$D59,1)),\"\")","v":96.167213114754091},{"$f":"IFERROR('Report A'!$H62/(SUM(INDIRECT(\"Data!$AI$\"&$D59+32&\":$AN$\"&$D59+32))),\"\")","v":15.007661290322581},{"$f":"IFERROR('Report A'!$I62/(SUM(INDIRECT(\"Data!$AO$\"&$D59+32&\":$AS$\"&$D59+32))),\"\")","v":25.592651757188499},{"$f":"IFERROR('Report A'!$J62/(SUM(INDIRECT(\"Data!$AI$\"&$D59+32&\":$AS$\"&$D59+32))),\"\")","v":20.91336898395722}]

{"sheet":"Report E","index":6,"n_rows":60,"n_cols":29,"rows_kept":60,"cut":false,"hidden":false,"merged":[]}
[]
[]
[null,null,"MONTHLY SALES REPORTING BY OUTLET"]
[]
[]
[null,"SUBJECT","REPORT E : PERFORMANCE OF PROMOTIONAL SALES"]
[]
[null,"OUTLET",{"$f":"Data!$C$8","v":"SBA"}]
[]
[null,"MONTH / YEAR",{"$f":"Data!$C$10","v":"July 2014"}]
[]
[null,"MENU"]
[]
[null,"DATE","DAY","ROW","TYPE 01","TYPE 02","TYPE 03","TYPE 04","TYPE 05","TYPE 06","TYPE 07","TYPE 08","TYPE 09","TYPE 10","LIST 01","LIST 02","LIST 03","LIST 04","LIST 05","LIST 06","LIST 07","LIST 08","LIST 09","CHOOSE PROMOTION",null,"",null,null,{"$f":"\"CHART : PERFORMANCE OF \"&$Z$14","v":"CHART : PERFORMANCE OF "}]
[null,null,null,null,null,null,null,null,null,null,null,null,null,null,"TYPE 01","TYPE 03","TYPE 05","TYPE 07","TYPE 09","LIST 01","LIST 03","LIST 05","LIST 07"]
[null,null,null,null,null,null,null,null,null,null,null,null,null,null,"TYPE 02","TYPE 04","TYPE 06","TYPE 08","TYPE 10","LIST 02","LIST 04","LIST 06","LIST 08","NOON K","HAPPY","NORMAL","MIDNIGHT","ALL"]
[null,null,null,null,"AT","AY","BD","BI","BN","BS","BX","CC","CH","CM",null,null,null,null,null,null,null,null,null,"( item )","( item )","( item )","( item )","( item )"]
[null,"SUMMARY FOR MONTH",null,null,null,null,null,null,null,null,null,null,null,null,null,null,null,null,null,null,null,null,null,null,null,null,null,null,"LEGEND"]
[null,"TOTAL SALES",null,null,null,null,null,null,null,null,null,null,null,null,null,null,null,null,null,null,null,null,null,{"$f":"SUM(X$30:X$60)","v":0},{"$f":"SUM(Y$30:Y$60)","v":0},0,0,0]
[null,"AVERAGE SALES",null,null,null,null,null,null,null,null,null,null,null,null,null,null,null,null,null,null,null,null,null,{"$f":"IFERROR(SUM(X$30:X$60)/COUNTIF($D$30:$D$60,\">0\"),\"\")","v":0},{"$f":"IFERROR(SUM(Y$30:Y$60)/COUNTIF($D$30:$D$60,\">0\"),\"\")","v":0},0,0,0]
[null,"HIGHEST SALES",null,null,null,null,null,null,null,null,null,null,null,null,null,null,null,null,null,null,null,null,null,{"$f":"IFERROR(IF(LARGE(X$30:X$60,1)>0,LARGE(X$30:X$60,1),\"NIL\"),\"NIL\")","v":"NIL"},{"$f":"IFERROR(IF(LARGE(Y$30:Y$60,1)>0,LARGE(Y$30:Y$60,1),\"NIL\"),\"NIL\")","v":"NIL"},"NIL","NIL","NIL"]
[null,"LOWEST SALES",null,null,null,null,null,null,null,null,null,null,null,null,null,null,null,null,null,null,null,null,null,{"$f":"IFERROR(IF(LARGE(X$30:X$60,COUNTIF(X$30:X$60,\">0\"))<>X$21,LARGE(X$30:X$60,COUNTIF(X$30:X$60,\">0\")),\"NIL\"),\"NIL\")","v":"NIL"},{"$f":"IFERROR(IF(LARGE(Y$30:Y$60,COUNTIF(Y$30:Y$60,\">0\"))<>Y$21,LARGE(Y$30:Y$60,COUNTIF(Y$30:Y$60,\">0\")),\"NIL\"),\"NIL\")","v":"NIL"},{"$f":"IFERROR(IF(LARGE(Z$30:Z$60,COUNTIF(Z$30:Z$60,\">0\"))<>Z$21,LARGE(Z$30:Z$60,COUNTIF(Z$30:Z$60,\">0\")),\"NIL\"),\"NIL\")","v":"NIL"},{"$f":"IFERROR(IF(LARGE(AA$30:AA$60,COUNTIF(AA$30:AA$60,\">0\"))<>AA$21,LARGE(AA$30:AA$60,COUNTIF(AA$30:AA$60,\">0\")),\"NIL\"),\"NIL\")","v":"NIL"},{"$f":"IFERROR(IF(LARGE(AB$30:AB$60,COUNTIF(AB$30:AB$60,\">0\"))<>AB$21,LARGE(AB$30:AB$60,COUNTIF(AB$30:AB$60,\">0\")),\"NIL\"),\"NIL\")","v":"NIL"}]
[null,"AVERAGE FOR ","MONDAY",null,null,null,null,null,null,null,null,null,null,null,null,null,null,null,null,null,null,null,null,{"$f":"IFERROR(SUMIF($C$30:$C$60,\"Monday*\",X$30:X$60)/COUNTIF($C$30:$C$60,\"Monday*\"),\"\")","v":0},{"$f":"IFERROR(SUMIF($C$30:$C$60,\"Monday*\",Y$30:Y$60)/COUNTIF($C$30:$C$60,\"Monday*\"),\"\")","v":0},0,0,0]
[null,null,"TUESDAY",null,null,null,null,null,null,null,null,null,null,null,null,null,null,null,null,null,null,null,null,{"$f":"IFERROR(SUMIF($C$30:$C$60,\"Tuesday*\",X$30:X$60)/COUNTIF($C$30:$C$60,\"Tuesday*\"),\"\")","v":0},{"$f":"IFERROR(SUMIF($C$30:$C$60,\"Tuesday*\",Y$30:Y$60)/COUNTIF($C$30:$C$60,\"Tuesday*\"),\"\")","v":0},0,0,0]
[null,null,"WEDNESDAY",null,null,null,null,null,null,null,null,null,null,null,null,null,null,null,null,null,null,null,null,{"$f":"IFERROR(SUMIF($C$30:$C$60,\"Wednesday*\",X$30:X$60)/COUNTIF($C$30:$C$60,\"Wednesday*\"),\"\")","v":0},{"$f":"IFERROR(SUMIF($C$30:$C$60,\"Wednesday*\",Y$30:Y$60)/COUNTIF($C$30:$C$60,\"Wednesday*\"),\"\")","v":0},0,0,0]
[null,null,"THURSDAY",null,null,null,null,null,null,null,null,null,null,null,null,null,null,null,null,null,null,null,null,{"$f":"IFERROR(SUMIF($C$30:$C$60,\"Thursday*\",X$30:X$60)/COUNTIF($C$30:$C$60,\"Thursday*\"),\"\")","v":0},{"$f":"IFERROR(SUMIF($C$30:$C$60,\"Thursday*\",Y$30:Y$60)/COUNTIF($C$30:$C$60,\"Thursday*\"),\"\")","v":0},0,0,0]
[null,null,"FRIDAY",null,null,null,null,null,null,null,null,null,null,null,null,null,null,null,null,null,null,null,null,{"$f":"IFERROR(SUMIF($C$30:$C$60,\"Friday*\",X$30:X$60)/COUNTIF($C$30:$C$60,\"Friday*\"),\"\")","v":0},{"$f":"IFERROR(SUMIF($C$30:$C$60,\"Friday*\",Y$30:Y$60)/COUNTIF($C$30:$C$60,\"Friday*\"),\"\")","v":0},0,0,0]
[null,null,"SATURDAY",null,null,null,null,null,null,null,null,null,null,null,null,null,null,null,null,null,null,null,null,{"$f":"IFERROR(SUMIF($C$30:$C$60,\"Saturday*\",X$30:X$60)/COUNTIF($C$30:$C$60,\"Saturday*\"),\"\")","v":0},{"$f":"IFERROR(SUMIF($C$30:$C$60,\"Saturday*\",Y$30:Y$60)/COUNTIF($C$30:$C$60,\"Saturday*\"),\"\")","v":0},0,0,0]
[null,null,"SUNDAY",null,null,null,null,null,null,null,null,null,null,null,null,null,null,null,null,null,null,null,null,{"$f":"IFERROR(SUMIF($C$30:$C$60,\"Sunday*\",X$30:X$60)/COUNTIF($C$30:$C$60,\"Sunday*\"),\"\")","v":0},{"$f":"IFERROR(SUMIF($C$30:$C$60,\"Sunday*\",Y$30:Y$60)/COUNTIF($C$30:$C$60,\"Sunday*\"),\"\")","v":0},0,0,0]
[null,{"$f":"'Report A'!$B32","v":"2014-07-01"},{"$f":"'Report A'!$C32","v":"Tuesday"},{"$f":"'Report A'!$D32","v":1},{"$f":"IFERROR(INDIRECT(\"Data!\"&E$17&$D30+32),\"\")","v":"K-Lunch"},"K-Dinner","4BP","Member 30%","Tiger 2+1","Heineken 3+1","WC Ladies 30%","2 Bkt Tiger Rm 88","5pm-8pm RM 8",0,{"$f":"IFERROR(IFERROR(INDEX(($E$30:$E$60), MATCH(0, COUNTIF($O$29:O29, ($E$30:$E$60)), 0)), INDEX(($F$30:$F$60), MATCH(0, COUNTIF($O$29:O29, ($F$30:$F$60)), 0))), \"\")","v":"K-Lunch"},{"$f":"IFERROR(IFERROR(INDEX(($G$30:$G$60), MATCH(0, COUNTIF($P$29:P29, ($G$30:$G$60)), 0)), INDEX(($H$30:$H$60), MATCH(0, COUNTIF($P$29:P29, ($H$30:$H$60)), 0))), \"\")","v":"4BP"},{"$f":"IFERROR(IFERROR(INDEX(($I$30:$I$60), MATCH(0, COUNTIF($Q$29:Q29, ($I$30:$I$60)), 0)), INDEX(($J$30:$J$60), MATCH(0, COUNTIF($Q$29:Q29, ($J$30:$J$60)), 0))), \"\")","v":"Tiger 2+1"},{"$f":"IFERROR(IFERROR(INDEX(($K$30:$K$60), MATCH(0, COUNTIF($R$29:R29, ($K$30:$K$60)), 0)), INDEX(($L$30:$L$60), MATCH(0, COUNTIF($R$29:R29, ($L$30:$L$60)), 0))), \"\")","v":"WC Ladies 30%"},{"$f":"IFERROR(IFERROR(INDEX(($M$30:$M$60), MATCH(0, COUNTIF($S$29:S29, ($M$30:$M$60)), 0)), INDEX(($N$30:$N$60), MATCH(0, COUNTIF($S$29:S29, ($N$30:$N$60)), 0))), \"\")","v":"5pm-8pm RM 8"},{"$f":"IFERROR(IFERROR(INDEX(($O$30:$O$60), MATCH(0, COUNTIF($T$29:T29, ($O$30:$O$60)), 0)), INDEX(($P$30:$P$60), MATCH(0, COUNTIF($T$29:T29, ($P$30:$P$60)), 0))), \"\")","v":"K-Lunch"},{"$f":"IFERROR(IFERROR(INDEX(($Q$30:$Q$60), MATCH(0, COUNTIF($U$29:U29, ($Q$30:$Q$60)), 0)), INDEX(($R$30:$R$60), MATCH(0, COUNTIF($U$29:U29, ($R$30:$R$60)), 0))), \"\")","v":"Tiger 2+1"},{"$f":"IFERROR(IFERROR(INDEX(($S$30:$S$60), MATCH(0, COUNTIF($V$29:V29, ($S$30:$S$60)), 0)), INDEX(($T$30:$T$60), MATCH(0, COUNTIF($V$29:V29, ($T$30:$T$60)), 0))), \"\")","v":"5pm-8pm RM 8"},{"$f":"IFERROR(IFERROR(INDEX(($U$30:$U$60), MATCH(0, COUNTIF($W$29:W29, ($U$30:$U$60)), 0)), INDEX(($V$30:$V$60), MATCH(0, COUNTIF($W$29:W29, ($V$30:$V$60)), 0))), \"\")","v":"Tiger 2+1"},{"$f":"IFERROR(INDEX((Data!$AT$33:$AX$82,Data!$AY$33:$BC$82,Data!$BD$33:$BH$82,Data!$BI$33:$BM$82,Data!$BN$33:$BR$82,Data!$BS$33:$BW$82,Data!$BX$33:$CB$82,Data!$CC$33:$CG$82,Data!$CH$33:$CL$82,Data!$CM$33:$CQ$82),$D30,2,CHOOSE(MATCH($Z$14,INDIRECT(\"Data!$AT$\"&$D30+32&\":$CM$\"&$D30+32),0),1,0,0,0,0,2,0,0,0,0,3,0,0,0,0,4,0,0,0,0,5,0,0,0,0,6,0,0,0,0,7,0,0,0,0,8,0,0,0,0,9,0,0,0,0,10)),\"\")","v":""},{"$f":"IFERROR(INDEX((Data!$AT$33:$AX$82,Data!$AY$33:$BC$82,Data!$BD$33:$BH$82,Data!$BI$33:$BM$82,Data!$BN$33:$BR$82,Data!$BS$33:$BW$82,Data!$BX$33:$CB$82,Data!$CC$33:$CG$82,Data!$CH$33:$CL$82,Data!$CM$33:$CQ$82),$D30,3,CHOOSE(MATCH($Z$14,INDIRECT(\"Data!$AT$\"&$D30+32&\":$CM$\"&$D30+32),0),1,0,0,0,0,2,0,0,0,0,3,0,0,0,0,4,0,0,0,0,5,0,0,0,0,6,0,0,0,0,7,0,0,0,0,8,0,0,0,0,9,0,0,0,0,10)),\"\")","v":""},{"$f":"IFERROR(INDEX((Data!$AT$33:$AX$82,Data!$AY$33:$BC$82,Data!$BD$33:$BH$82,Data!$BI$33:$BM$82,Data!$BN$33:$BR$82,Data!$BS$33:$BW$82,Data!$BX$33:$CB$82,Data!$CC$33:$CG$82,Data!$CH$33:$CL$82,Data!$CM$33:$CQ$82),$D30,4,CHOOSE(MATCH($Z$14,INDIRECT(\"Data!$AT$\"&$D30+32&\":$CM$\"&$D30+32),0),1,0,0,0,0,2,0,0,0,0,3,0,0,0,0,4,0,0,0,0,5,0,0,0,0,6,0,0,0,0,7,0,0,0,0,8,0,0,0,0,9,0,0,0,0,10)),\"\")","v":""},{"$f":"IFERROR(INDEX((Data!$AT$33:$AX$82,Data!$AY$33:$BC$82,Data!$BD$33:$BH$82,Data!$BI$33:$BM$82,Data!$BN$33:$BR$82,Data!$BS$33:$BW$82,Data!$BX$33:$CB$82,Data!$CC$33:$CG$82,Data!$CH$33:$CL$82,Data!$CM$33:$CQ$82),$D30,5,CHOOSE(MATCH($Z$14,INDIRECT(\"Data!$AT$\"&$D30+32&\":$CM$\"&$D30+32),0),1,0,0,0,0,2,0,0,0,0,3,0,0,0,0,4,0,0,0,0,5,0,0,0,0,6,0,0,0,0,7,0,0,0,0,8,0,0,0,0,9,0,0,0,0,10)),\"\")","v":""},{"$f":"IFERROR(SUM($X30:$AA30),\"\")","v":0}]
[null,{"$f":"'Report A'!$B33","v":"2014-07-02"},{"$f":"'Report A'!$C33","v":"Wednesday"},{"$f":"'Report A'!$D33","v":2},"K-Lunch","K-Dinner","4BP","Member 30%","Tiger 2+1","Heineken 3+1","WC Ladies 30%","2 Bkt Tiger Rm 88","5pm-8pm RM 8",0,{"$f":"IFERROR(IFERROR(INDEX(($E$30:$E$60), MATCH(0, COUNTIF($O$29:O30, ($E$30:$E$60)), 0)), INDEX(($F$30:$F$60), MATCH(0, COUNTIF($O$29:O30, ($F$30:$F$60)), 0))), \"\")","v":"K-Dinner"},{"$f":"IFERROR(IFERROR(INDEX(($G$30:$G$60), MATCH(0, COUNTIF($P$29:P30, ($G$30:$G$60)), 0)), INDEX(($H$30:$H$60), MATCH(0, COUNTIF($P$29:P30, ($H$30:$H$60)), 0))), \"\")","v":"Member 30%"},{"$f":"IFERROR(IFERROR(INDEX(($I$30:$I$60), MATCH(0, COUNTIF($Q$29:Q30, ($I$30:$I$60)), 0)), INDEX(($J$30:$J$60), MATCH(0, COUNTIF($Q$29:Q30, ($J$30:$J$60)), 0))), \"\")","v":0},{"$f":"IFERROR(IFERROR(INDEX(($K$30:$K$60), MATCH(0, COUNTIF($R$29:R30, ($K$30:$K$60)), 0)), INDEX(($L$30:$L$60), MATCH(0, COUNTIF($R$29:R30, ($L$30:$L$60)), 0))), \"\")","v":0},{"$f":"IFERROR(IFERROR(INDEX(($M$30:$M$60), MATCH(0, COUNTIF($S$29:S30, ($M$30:$M$60)), 0)), INDEX(($N$30:$N$60), MATCH(0, COUNTIF($S$29:S30, ($N$30:$N$60)), 0))), \"\")","v":0},{"$f":"IFERROR(IFERROR(INDEX(($O$30:$O$60), MATCH(0, COUNTIF($T$29:T30, ($O$30:$O$60)), 0)), INDEX(($P$30:$P$60), MATCH(0, COUNTIF($T$29:T30, ($P$30:$P$60)), 0))), \"\")","v":"K-Dinner"},{"$f":"IFERROR(IFERROR(INDEX(($Q$30:$Q$60), MATCH(0, COUNTIF($U$29:U30, ($Q$30:$Q$60)), 0)), INDEX(($R$30:$R$60), MATCH(0, COUNTIF($U$29:U30, ($R$30:$R$60)), 0))), \"\")","v":0},{"$f":"IFERROR(IFERROR(INDEX(($S$30:$S$60), MATCH(0, COUNTIF($V$29:V30, ($S$30:$S$60)), 0)), INDEX(($T$30:$T$60), MATCH(0, COUNTIF($V$29:V30, ($T$30:$T$60)), 0))), \"\")","v":0},{"$f":"IFERROR(IFERROR(INDEX(($U$30:$U$60), MATCH(0, COUNTIF($W$29:W30, ($U$30:$U$60)), 0)), INDEX(($V$30:$V$60), MATCH(0, COUNTIF($W$29:W30, ($V$30:$V$60)), 0))), \"\")","v":0},{"$f":"IFERROR(INDEX((Data!$AT$33:$AX$82,Data!$AY$33:$BC$82,Data!$BD$33:$BH$82,Data!$BI$33:$BM$82,Data!$BN$33:$BR$82,Data!$BS$33:$BW$82,Data!$BX$33:$CB$82,Data!$CC$33:$CG$82,Data!$CH$33:$CL$82,Data!$CM$33:$CQ$82),$D31,2,CHOOSE(MATCH($Z$14,INDIRECT(\"Data!$AT$\"&$D31+32&\":$CM$\"&$D31+32),0),1,0,0,0,0,2,0,0,0,0,3,0,0,0,0,4,0,0,0,0,5,0,0,0,0,6,0,0,0,0,7,0,0,0,0,8,0,0,0,0,9,0,0,0,0,10)),\"\")","v":""},{"$f":"IFERROR(INDEX((Data!$AT$33:$AX$82,Data!$AY$33:$BC$82,Data!$BD$33:$BH$82,Data!$BI$33:$BM$82,Data!$BN$33:$BR$82,Data!$BS$33:$BW$82,Data!$BX$33:$CB$82,Data!$CC$33:$CG$82,Data!$CH$33:$CL$82,Data!$CM$33:$CQ$82),$D31,3,CHOOSE(MATCH($Z$14,INDIRECT(\"Data!$AT$\"&$D31+32&\":$CM$\"&$D31+32),0),1,0,0,0,0,2,0,0,0,0,3,0,0,0,0,4,0,0,0,0,5,0,0,0,0,6,0,0,0,0,7,0,0,0,0,8,0,0,0,0,9,0,0,0,0,10)),\"\")","v":""},{"$f":"IFERROR(INDEX((Data!$AT$33:$AX$82,Data!$AY$33:$BC$82,Data!$BD$33:$BH$82,Data!$BI$33:$BM$82,Data!$BN$33:$BR$82,Data!$BS$33:$BW$82,Data!$BX$33:$CB$82,Data!$CC$33:$CG$82,Data!$CH$33:$CL$82,Data!$CM$33:$CQ$82),$D31,4,CHOOSE(MATCH($Z$14,INDIRECT(\"Data!$AT$\"&$D31+32&\":$CM$\"&$D31+32),0),1,0,0,0,0,2,0,0,0,0,3,0,0,0,0,4,0,0,0,0,5,0,0,0,0,6,0,0,0,0,7,0,0,0,0,8,0,0,0,0,9,0,0,0,0,10)),\"\")","v":""},{"$f":"IFERROR(INDEX((Data!$AT$33:$AX$82,Data!$AY$33:$BC$82,Data!$BD$33:$BH$82,Data!$BI$33:$BM$82,Data!$BN$33:$BR$82,Data!$BS$33:$BW$82,Data!$BX$33:$CB$82,Data!$CC$33:$CG$82,Data!$CH$33:$CL$82,Data!$CM$33:$CQ$82),$D31,5,CHOOSE(MATCH($Z$14,INDIRECT(\"Data!$AT$\"&$D31+32&\":$CM$\"&$D31+32),0),1,0,0,0,0,2,0,0,0,0,3,0,0,0,0,4,0,0,0,0,5,0,0,0,0,6,0,0,0,0,7,0,0,0,0,8,0,0,0,0,9,0,0,0,0,10)),\"\")","v":""},{"$f":"IFERROR(SUM($X31:$AA31),\"\")","v":0}]
[null,{"$f":"'Report A'!$B34","v":"2014-07-03"},{"$f":"'Report A'!$C34","v":"Thursday"},{"$f":"'Report A'!$D34","v":3},"K-Lunch","K-Dinner","4BP","Member 30%","Tiger 2+1","Heineken 3+1","WC Ladies 30%","2 Bkt Tiger Rm 88","5pm-8pm RM 8",0,{"$f":"IFERROR(IFERROR(INDEX(($E$30:$E$60), MATCH(0, COUNTIF($O$29:O31, ($E$30:$E$60)), 0)), INDEX(($F$30:$F$60), MATCH(0, COUNTIF($O$29:O31, ($F$30:$F$60)), 0))), \"\")","v":""},{"$f":"IFERROR(IFERROR(INDEX(($G$30:$G$60), MATCH(0, COUNTIF($P$29:P31, ($G$30:$G$60)), 0)), INDEX(($H$30:$H$60), MATCH(0, COUNTIF($P$29:P31, ($H$30:$H$60)), 0))), \"\")","v":0},{"$f":"IFERROR(IFERROR(INDEX(($I$30:$I$60), MATCH(0, COUNTIF($Q$29:Q31, ($I$30:$I$60)), 0)), INDEX(($J$30:$J$60), MATCH(0, COUNTIF($Q$29:Q31, ($J$30:$J$60)), 0))), \"\")","v":"Heineken 3+1"},{"$f":"IFERROR(IFERROR(INDEX(($K$30:$K$60), MATCH(0, COUNTIF($R$29:R31, ($K$30:$K$60)), 0)), INDEX(($L$30:$L$60), MATCH(0, COUNTIF($R$29:R31, ($L$30:$L$60)), 0))), \"\")","v":"5PM-8PM Rm 4"},{"$f":"IFERROR(IFERROR(INDEX(($M$30:$M$60), MATCH(0, COUNTIF($S$29:S31, ($M$30:$M$60)), 0)), INDEX(($N$30:$N$60), MATCH(0, COUNTIF($S$29:S31, ($N$30:$N$60)), 0))), \"\")","v":"WC COMBO"},{"$f":"IFERROR(IFERROR(INDEX(($O$30:$O$60), MATCH(0, COUNTIF($T$29:T31, ($O$30:$O$60)), 0)), INDEX(($P$30:$P$60), MATCH(0, COUNTIF($T$29:T31, ($P$30:$P$60)), 0))), \"\")","v":"4BP"},{"$f":"IFERROR(IFERROR(INDEX(($Q$30:$Q$60), MATCH(0, COUNTIF($U$29:U31, ($Q$30:$Q$60)), 0)), INDEX(($R$30:$R$60), MATCH(0, COUNTIF($U$29:U31, ($R$30:$R$60)), 0))), \"\")","v":"Heineken 3+1"},{"$f":"IFERROR(IFERROR(INDEX(($S$30:$S$60), MATCH(0, COUNTIF($V$29:V31, ($S$30:$S$60)), 0)), INDEX(($T$30:$T$60), MATCH(0, COUNTIF($V$29:V31, ($T$30:$T$60)), 0))), \"\")","v":"WC COMBO"},{"$f":"IFERROR(IFERROR(INDEX(($U$30:$U$60), MATCH(0, COUNTIF($W$29:W31, ($U$30:$U$60)), 0)), INDEX(($V$30:$V$60), MATCH(0, COUNTIF($W$29:W31, ($V$30:$V$60)), 0))), \"\")","v":"Heineken 3+1"},{"$f":"IFERROR(INDEX((Data!$AT$33:$AX$82,Data!$AY$33:$BC$82,Data!$BD$33:$BH$82,Data!$BI$33:$BM$82,Data!$BN$33:$BR$82,Data!$BS$33:$BW$82,Data!$BX$33:$CB$82,Data!$CC$33:$CG$82,Data!$CH$33:$CL$82,Data!$CM$33:$CQ$82),$D32,2,CHOOSE(MATCH($Z$14,INDIRECT(\"Data!$AT$\"&$D32+32&\":$CM$\"&$D32+32),0),1,0,0,0,0,2,0,0,0,0,3,0,0,0,0,4,0,0,0,0,5,0,0,0,0,6,0,0,0,0,7,0,0,0,0,8,0,0,0,0,9,0,0,0,0,10)),\"\")","v":""},{"$f":"IFERROR(INDEX((Data!$AT$33:$AX$82,Data!$AY$33:$BC$82,Data!$BD$33:$BH$82,Data!$BI$33:$BM$82,Data!$BN$33:$BR$82,Data!$BS$33:$BW$82,Data!$BX$33:$CB$82,Data!$CC$33:$CG$82,Data!$CH$33:$CL$82,Data!$CM$33:$CQ$82),$D32,3,CHOOSE(MATCH($Z$14,INDIRECT(\"Data!$AT$\"&$D32+32&\":$CM$\"&$D32+32),0),1,0,0,0,0,2,0,0,0,0,3,0,0,0,0,4,0,0,0,0,5,0,0,0,0,6,0,0,0,0,7,0,0,0,0,8,0,0,0,0,9,0,0,0,0,10)),\"\")","v":""},{"$f":"IFERROR(INDEX((Data!$AT$33:$AX$82,Data!$AY$33:$BC$82,Data!$BD$33:$BH$82,Data!$BI$33:$BM$82,Data!$BN$33:$BR$82,Data!$BS$33:$BW$82,Data!$BX$33:$CB$82,Data!$CC$33:$CG$82,Data!$CH$33:$CL$82,Data!$CM$33:$CQ$82),$D32,4,CHOOSE(MATCH($Z$14,INDIRECT(\"Data!$AT$\"&$D32+32&\":$CM$\"&$D32+32),0),1,0,0,0,0,2,0,0,0,0,3,0,0,0,0,4,0,0,0,0,5,0,0,0,0,6,0,0,0,0,7,0,0,0,0,8,0,0,0,0,9,0,0,0,0,10)),\"\")","v":""},{"$f":"IFERROR(INDEX((Data!$AT$33:$AX$82,Data!$AY$33:$BC$82,Data!$BD$33:$BH$82,Data!$BI$33:$BM$82,Data!$BN$33:$BR$82,Data!$BS$33:$BW$82,Data!$BX$33:$CB$82,Data!$CC$33:$CG$82,Data!$CH$33:$CL$82,Data!$CM$33:$CQ$82),$D32,5,CHOOSE(MATCH($Z$14,INDIRECT(\"Data!$AT$\"&$D32+32&\":$CM$\"&$D32+32),0),1,0,0,0,0,2,0,0,0,0,3,0,0,0,0,4,0,0,0,0,5,0,0,0,0,6,0,0,0,0,7,0,0,0,0,8,0,0,0,0,9,0,0,0,0,10)),\"\")","v":""},0]
[null,{"$f":"'Report A'!$B35","v":"2014-07-04"},{"$f":"'Report A'!$C35","v":"Friday"},{"$f":"'Report A'!$D35","v":4},"K-Lunch","K-Dinner","4BP",0,0,0,0,0,0,0,{"$f":"IFERROR(IFERROR(INDEX(($E$30:$E$60), MATCH(0, COUNTIF($O$29:O32, ($E$30:$E$60)), 0)), INDEX(($F$30:$F$60), MATCH(0, COUNTIF($O$29:O32, ($F$30:$F$60)), 0))), \"\")","v":""},{"$f":"IFERROR(IFERROR(INDEX(($G$30:$G$60), MATCH(0, COUNTIF($P$29:P32, ($G$30:$G$60)), 0)), INDEX(($H$30:$H$60), MATCH(0, COUNTIF($P$29:P32, ($H$30:$H$60)), 0))), \"\")","v":""},{"$f":"IFERROR(IFERROR(INDEX(($I$30:$I$60), MATCH(0, COUNTIF($Q$29:Q32, ($I$30:$I$60)), 0)), INDEX(($J$30:$J$60), MATCH(0, COUNTIF($Q$29:Q32, ($J$30:$J$60)), 0))), \"\")","v":"WC Ladies 30%"},{"$f":"IFERROR(IFERROR(INDEX(($K$30:$K$60), MATCH(0, COUNTIF($R$29:R32, ($K$30:$K$60)), 0)), INDEX(($L$30:$L$60), MATCH(0, COUNTIF($R$29:R32, ($L$30:$L$60)), 0))), \"\")","v":"RM4 PROMO"},{"$f":"IFERROR(IFERROR(INDEX(($M$30:$M$60), MATCH(0, COUNTIF($S$29:S32, ($M$30:$M$60)), 0)), INDEX(($N$30:$N$60), MATCH(0, COUNTIF($S$29:S32, ($N$30:$N$60)), 0))), \"\")","v":"WC 30%"},{"$f":"IFERROR(IFERROR(INDEX(($O$30:$O$60), MATCH(0, COUNTIF($T$29:T32, ($O$30:$O$60)), 0)), INDEX(($P$30:$P$60), MATCH(0, COUNTIF($T$29:T32, ($P$30:$P$60)), 0))), \"\")","v":"Member 30%"},{"$f":"IFERROR(IFERROR(INDEX(($Q$30:$Q$60), MATCH(0, COUNTIF($U$29:U32, ($Q$30:$Q$60)), 0)), INDEX(($R$30:$R$60), MATCH(0, COUNTIF($U$29:U32, ($R$30:$R$60)), 0))), \"\")","v":"WC Ladies 30%"},{"$f":"IFERROR(IFERROR(INDEX(($S$30:$S$60), MATCH(0, COUNTIF($V$29:V32, ($S$30:$S$60)), 0)), INDEX(($T$30:$T$60), MATCH(0, COUNTIF($V$29:V32, ($T$30:$T$60)), 0))), \"\")","v":"WC 30%"},{"$f":"IFERROR(IFERROR(INDEX(($U$30:$U$60), MATCH(0, COUNTIF($W$29:W32, ($U$30:$U$60)), 0)), INDEX(($V$30:$V$60), MATCH(0, COUNTIF($W$29:W32, ($V$30:$V$60)), 0))), \"\")","v":"WC Ladies 30%"},{"$f":"IFERROR(INDEX((Data!$AT$33:$AX$82,Data!$AY$33:$BC$82,Data!$BD$33:$BH$82,Data!$BI$33:$BM$82,Data!$BN$33:$BR$82,Data!$BS$33:$BW$82,Data!$BX$33:$CB$82,Data!$CC$33:$CG$82,Data!$CH$33:$CL$82,Data!$CM$33:$CQ$82),$D33,2,CHOOSE(MATCH($Z$14,INDIRECT(\"Data!$AT$\"&$D33+32&\":$CM$\"&$D33+32),0),1,0,0,0,0,2,0,0,0,0,3,0,0,0,0,4,0,0,0,0,5,0,0,0,0,6,0,0,0,0,7,0,0,0,0,8,0,0,0,0,9,0,0,0,0,10)),\"\")","v":""},{"$f":"IFERROR(INDEX((Data!$AT$33:$AX$82,Data!$AY$33:$BC$82,Data!$BD$33:$BH$82,Data!$BI$33:$BM$82,Data!$BN$33:$BR$82,Data!$BS$33:$BW$82,Data!$BX$33:$CB$82,Data!$CC$33:$CG$82,Data!$CH$33:$CL$82,Data!$CM$33:$CQ$82),$D33,3,CHOOSE(MATCH($Z$14,INDIRECT(\"Data!$AT$\"&$D33+32&\":$CM$\"&$D33+32),0),1,0,0,0,0,2,0,0,0,0,3,0,0,0,0,4,0,0,0,0,5,0,0,0,0,6,0,0,0,0,7,0,0,0,0,8,0,0,0,0,9,0,0,0,0,10)),\"\")","v":""},{"$f":"IFERROR(INDEX((Data!$AT$33:$AX$82,Data!$AY$33:$BC$82,Data!$BD$33:$BH$82,Data!$BI$33:$BM$82,Data!$BN$33:$BR$82,Data!$BS$33:$BW$82,Data!$BX$33:$CB$82,Data!$CC$33:$CG$82,Data!$CH$33:$CL$82,Data!$CM$33:$CQ$82),$D33,4,CHOOSE(MATCH($Z$14,INDIRECT(\"Data!$AT$\"&$D33+32&\":$CM$\"&$D33+32),0),1,0,0,0,0,2,0,0,0,0,3,0,0,0,0,4,0,0,0,0,5,0,0,0,0,6,0,0,0,0,7,0,0,0,0,8,0,0,0,0,9,0,0,0,0,10)),\"\")","v":""},{"$f":"IFERROR(INDEX((Data!$AT$33:$AX$82,Data!$AY$33:$BC$82,Data!$BD$33:$BH$82,Data!$BI$33:$BM$82,Data!$BN$33:$BR$82,Data!$BS$33:$BW$82,Data!$BX$33:$CB$82,Data!$CC$33:$CG$82,Data!$CH$33:$CL$82,Data!$CM$33:$CQ$82),$D33,5,CHOOSE(MATCH($Z$14,INDIRECT(\"Data!$AT$\"&$D33+32&\":$CM$\"&$D33+32),0),1,0,0,0,0,2,0,0,0,0,3,0,0,0,0,4,0,0,0,0,5,0,0,0,0,6,0,0,0,0,7,0,0,0,0,8,0,0,0,0,9,0,0,0,0,10)),\"\")","v":""},0]
[null,{"$f":"'Report A'!$B36","v":"2014-07-05"},{"$f":"'Report A'!$C36","v":"Saturday"},{"$f":"'Report A'!$D36","v":5},"K-Lunch","K-Dinner","4BP",0,0,0,0,0,0,0,{"$f":"IFERROR(IFERROR(INDEX(($E$30:$E$60), MATCH(0, COUNTIF($O$29:O33, ($E$30:$E$60)), 0)), INDEX(($F$30:$F$60), MATCH(0, COUNTIF($O$29:O33, ($F$30:$F$60)), 0))), \"\")","v":""},{"$f":"IFERROR(IFERROR(INDEX(($G$30:$G$60), MATCH(0, COUNTIF($P$29:P33, ($G$30:$G$60)), 0)), INDEX(($H$30:$H$60), MATCH(0, COUNTIF($P$29:P33, ($H$30:$H$60)), 0))), \"\")","v":""},{"$f":"IFERROR(IFERROR(INDEX(($I$30:$I$60), MATCH(0, COUNTIF($Q$29:Q33, ($I$30:$I$60)), 0)), INDEX(($J$30:$J$60), MATCH(0, COUNTIF($Q$29:Q33, ($J$30:$J$60)), 0))), \"\")","v":""},{"$f":"IFERROR(IFERROR(INDEX(($K$30:$K$60), MATCH(0, COUNTIF($R$29:R33, ($K$30:$K$60)), 0)), INDEX(($L$30:$L$60), MATCH(0, COUNTIF($R$29:R33, ($L$30:$L$60)), 0))), \"\")","v":"Opening Promo 60%"},{"$f":"IFERROR(IFERROR(INDEX(($M$30:$M$60), MATCH(0, COUNTIF($S$29:S33, ($M$30:$M$60)), 0)), INDEX(($N$30:$N$60), MATCH(0, COUNTIF($S$29:S33, ($N$30:$N$60)), 0))), \"\")","v":""},{"$f":"IFERROR(IFERROR(INDEX(($O$30:$O$60), MATCH(0, COUNTIF($T$29:T33, ($O$30:$O$60)), 0)), INDEX(($P$30:$P$60), MATCH(0, COUNTIF($T$29:T33, ($P$30:$P$60)), 0))), \"\")","v":0},{"$f":"IFERROR(IFERROR(INDEX(($Q$30:$Q$60), MATCH(0, COUNTIF($U$29:U33, ($Q$30:$Q$60)), 0)), INDEX(($R$30:$R$60), MATCH(0, COUNTIF($U$29:U33, ($R$30:$R$60)), 0))), \"\")","v":"5PM-8PM Rm 4"},{"$f":"IFERROR(IFERROR(INDEX(($S$30:$S$60), MATCH(0, COUNTIF($V$29:V33, ($S$30:$S$60)), 0)), INDEX(($T$30:$T$60), MATCH(0, COUNTIF($V$29:V33, ($T$30:$T$60)), 0))), \"\")","v":"K-Lunch"},{"$f":"IFERROR(IFERROR(INDEX(($U$30:$U$60), MATCH(0, COUNTIF($W$29:W33, ($U$30:$U$60)), 0)), INDEX(($V$30:$V$60), MATCH(0, COUNTIF($W$29:W33, ($V$30:$V$60)), 0))), \"\")","v":"5PM-8PM Rm 4"},{"$f":"IFERROR(INDEX((Data!$AT$33:$AX$82,Data!$AY$33:$BC$82,Data!$BD$33:$BH$82,Data!$BI$33:$BM$82,Data!$BN$33:$BR$82,Data!$BS$33:$BW$82,Data!$BX$33:$CB$82,Data!$CC$33:$CG$82,Data!$CH$33:$CL$82,Data!$CM$33:$CQ$82),$D34,2,CHOOSE(MATCH($Z$14,INDIRECT(\"Data!$AT$\"&$D34+32&\":$CM$\"&$D34+32),0),1,0,0,0,0,2,0,0,0,0,3,0,0,0,0,4,0,0,0,0,5,0,0,0,0,6,0,0,0,0,7,0,0,0,0,8,0,0,0,0,9,0,0,0,0,10)),\"\")","v":""},{"$f":"IFERROR(INDEX((Data!$AT$33:$AX$82,Data!$AY$33:$BC$82,Data!$BD$33:$BH$82,Data!$BI$33:$BM$82,Data!$BN$33:$BR$82,Data!$BS$33:$BW$82,Data!$BX$33:$CB$82,Data!$CC$33:$CG$82,Data!$CH$33:$CL$82,Data!$CM$33:$CQ$82),$D34,3,CHOOSE(MATCH($Z$14,INDIRECT(\"Data!$AT$\"&$D34+32&\":$CM$\"&$D34+32),0),1,0,0,0,0,2,0,0,0,0,3,0,0,0,0,4,0,0,0,0,5,0,0,0,0,6,0,0,0,0,7,0,0,0,0,8,0,0,0,0,9,0,0,0,0,10)),\"\")","v":""},{"$f":"IFERROR(INDEX((Data!$AT$33:$AX$82,Data!$AY$33:$BC$82,Data!$BD$33:$BH$82,Data!$BI$33:$BM$82,Data!$BN$33:$BR$82,Data!$BS$33:$BW$82,Data!$BX$33:$CB$82,Data!$CC$33:$CG$82,Data!$CH$33:$CL$82,Data!$CM$33:$CQ$82),$D34,4,CHOOSE(MATCH($Z$14,INDIRECT(\"Data!$AT$\"&$D34+32&\":$CM$\"&$D34+32),0),1,0,0,0,0,2,0,0,0,0,3,0,0,0,0,4,0,0,0,0,5,0,0,0,0,6,0,0,0,0,7,0,0,0,0,8,0,0,0,0,9,0,0,0,0,10)),\"\")","v":""},{"$f":"IFERROR(INDEX((Data!$AT$33:$AX$82,Data!$AY$33:$BC$82,Data!$BD$33:$BH$82,Data!$BI$33:$BM$82,Data!$BN$33:$BR$82,Data!$BS$33:$BW$82,Data!$BX$33:$CB$82,Data!$CC$33:$CG$82,Data!$CH$33:$CL$82,Data!$CM$33:$CQ$82),$D34,5,CHOOSE(MATCH($Z$14,INDIRECT(\"Data!$AT$\"&$D34+32&\":$CM$\"&$D34+32),0),1,0,0,0,0,2,0,0,0,0,3,0,0,0,0,4,0,0,0,0,5,0,0,0,0,6,0,0,0,0,7,0,0,0,0,8,0,0,0,0,9,0,0,0,0,10)),\"\")","v":""},0]
[null,{"$f":"'Report A'!$B37","v":"2014-07-06"},{"$f":"'Report A'!$C37","v":"Sunday"},{"$f":"'Report A'!$D37","v":6},"K-Lunch","K-Dinner","4BP",0,0,0,0,0,0,0,{"$f":"IFERROR(IFERROR(INDEX(($E$30:$E$60), MATCH(0, COUNTIF($O$29:O34, ($E$30:$E$60)), 0)), INDEX(($F$30:$F$60), MATCH(0, COUNTIF($O$29:O34, ($F$30:$F$60)), 0))), \"\")","v":""},{"$f":"IFERROR(IFERROR(INDEX(($G$30:$G$60), MATCH(0, COUNTIF($P$29:P34, ($G$30:$G$60)), 0)), INDEX(($H$30:$H$60), MATCH(0, COUNTIF($P$29:P34, ($H$30:$H$60)), 0))), \"\")","v":""},{"$f":"IFERROR(IFERROR(INDEX(($I$30:$I$60), MATCH(0, COUNTIF($Q$29:Q34, ($I$30:$I$60)), 0)), INDEX(($J$30:$J$60), MATCH(0, COUNTIF($Q$29:Q34, ($J$30:$J$60)), 0))), \"\")","v":""},{"$f":"IFERROR(IFERROR(INDEX(($K$30:$K$60), MATCH(0, COUNTIF($R$29:R34, ($K$30:$K$60)), 0)), INDEX(($L$30:$L$60), MATCH(0, COUNTIF($R$29:R34, ($L$30:$L$60)), 0))), \"\")","v":"2 Bkt Tiger Rm 88"},{"$f":"IFERROR(IFERROR(INDEX(($M$30:$M$60), MATCH(0, COUNTIF($S$29:S34, ($M$30:$M$60)), 0)), INDEX(($N$30:$N$60), MATCH(0, COUNTIF($S$29:S34, ($N$30:$N$60)), 0))), \"\")","v":""},{"$f":"IFERROR(IFERROR(INDEX(($O$30:$O$60), MATCH(0, COUNTIF($T$29:T34, ($O$30:$O$60)), 0)), INDEX(($P$30:$P$60), MATCH(0, COUNTIF($T$29:T34, ($P$30:$P$60)), 0))), \"\")","v":""},{"$f":"IFERROR(IFERROR(INDEX(($Q$30:$Q$60), MATCH(0, COUNTIF($U$29:U34, ($Q$30:$Q$60)), 0)), INDEX(($R$30:$R$60), MATCH(0, COUNTIF($U$29:U34, ($R$30:$R$60)), 0))), \"\")","v":"RM4 PROMO"},{"$f":"IFERROR(IFERROR(INDEX(($S$30:$S$60), MATCH(0, COUNTIF($V$29:V34, ($S$30:$S$60)), 0)), INDEX(($T$30:$T$60), MATCH(0, COUNTIF($V$29:V34, ($T$30:$T$60)), 0))), \"\")","v":"K-Dinner"},{"$f":"IFERROR(IFERROR(INDEX(($U$30:$U$60), MATCH(0, COUNTIF($W$29:W34, ($U$30:$U$60)), 0)), INDEX(($V$30:$V$60), MATCH(0, COUNTIF($W$29:W34, ($V$30:$V$60)), 0))), \"\")","v":"RM4 PROMO"},{"$f":"IFERROR(INDEX((Data!$AT$33:$AX$82,Data!$AY$33:$BC$82,Data!$BD$33:$BH$82,Data!$BI$33:$BM$82,Data!$BN$33:$BR$82,Data!$BS$33:$BW$82,Data!$BX$33:$CB$82,Data!$CC$33:$CG$82,Data!$CH$33:$CL$82,Data!$CM$33:$CQ$82),$D35,2,CHOOSE(MATCH($Z$14,INDIRECT(\"Data!$AT$\"&$D35+32&\":$CM$\"&$D35+32),0),1,0,0,0,0,2,0,0,0,0,3,0,0,0,0,4,0,0,0,0,5,0,0,0,0,6,0,0,0,0,7,0,0,0,0,8,0,0,0,0,9,0,0,0,0,10)),\"\")","v":""},{"$f":"IFERROR(INDEX((Data!$AT$33:$AX$82,Data!$AY$33:$BC$82,Data!$BD$33:$BH$82,Data!$BI$33:$BM$82,Data!$BN$33:$BR$82,Data!$BS$33:$BW$82,Data!$BX$33:$CB$82,Data!$CC$33:$CG$82,Data!$CH$33:$CL$82,Data!$CM$33:$CQ$82),$D35,3,CHOOSE(MATCH($Z$14,INDIRECT(\"Data!$AT$\"&$D35+32&\":$CM$\"&$D35+32),0),1,0,0,0,0,2,0,0,0,0,3,0,0,0,0,4,0,0,0,0,5,0,0,0,0,6,0,0,0,0,7,0,0,0,0,8,0,0,0,0,9,0,0,0,0,10)),\"\")","v":""},{"$f":"IFERROR(INDEX((Data!$AT$33:$AX$82,Data!$AY$33:$BC$82,Data!$BD$33:$BH$82,Data!$BI$33:$BM$82,Data!$BN$33:$BR$82,Data!$BS$33:$BW$82,Data!$BX$33:$CB$82,Data!$CC$33:$CG$82,Data!$CH$33:$CL$82,Data!$CM$33:$CQ$82),$D35,4,CHOOSE(MATCH($Z$14,INDIRECT(\"Data!$AT$\"&$D35+32&\":$CM$\"&$D35+32),0),1,0,0,0,0,2,0,0,0,0,3,0,0,0,0,4,0,0,0,0,5,0,0,0,0,6,0,0,0,0,7,0,0,0,0,8,0,0,0,0,9,0,0,0,0,10)),\"\")","v":""},{"$f":"IFERROR(INDEX((Data!$AT$33:$AX$82,Data!$AY$33:$BC$82,Data!$BD$33:$BH$82,Data!$BI$33:$BM$82,Data!$BN$33:$BR$82,Data!$BS$33:$BW$82,Data!$BX$33:$CB$82,Data!$CC$33:$CG$82,Data!$CH$33:$CL$82,Data!$CM$33:$CQ$82),$D35,5,CHOOSE(MATCH($Z$14,INDIRECT(\"Data!$AT$\"&$D35+32&\":$CM$\"&$D35+32),0),1,0,0,0,0,2,0,0,0,0,3,0,0,0,0,4,0,0,0,0,5,0,0,0,0,6,0,0,0,0,7,0,0,0,0,8,0,0,0,0,9,0,0,0,0,10)),\"\")","v":""},0]
[null,{"$f":"'Report A'!$B38","v":"2014-07-07"},{"$f":"'Report A'!$C38","v":"Monday"},{"$f":"'Report A'!$D38","v":7},"K-Lunch","K-Dinner","4BP","Member 30%","Tiger 2+1","WC Ladies 30%","5PM-8PM Rm 4","2 Bkt Tiger Rm 88",0,0,{"$f":"IFERROR(IFERROR(INDEX(($E$30:$E$60), MATCH(0, COUNTIF($O$29:O35, ($E$30:$E$60)), 0)), INDEX(($F$30:$F$60), MATCH(0, COUNTIF($O$29:O35, ($F$30:$F$60)), 0))), \"\")","v":""},{"$f":"IFERROR(IFERROR(INDEX(($G$30:$G$60), MATCH(0, COUNTIF($P$29:P35, ($G$30:$G$60)), 0)), INDEX(($H$30:$H$60), MATCH(0, COUNTIF($P$29:P35, ($H$30:$H$60)), 0))), \"\")","v":""},{"$f":"IFERROR(IFERROR(INDEX(($I$30:$I$60), MATCH(0, COUNTIF($Q$29:Q35, ($I$30:$I$60)), 0)), INDEX(($J$30:$J$60), MATCH(0, COUNTIF($Q$29:Q35, ($J$30:$J$60)), 0))), \"\")","v":""},{"$f":"IFERROR(IFERROR(INDEX(($K$30:$K$60), MATCH(0, COUNTIF($R$29:R35, ($K$30:$K$60)), 0)), INDEX(($L$30:$L$60), MATCH(0, COUNTIF($R$29:R35, ($L$30:$L$60)), 0))), \"\")","v":""},{"$f":"IFERROR(IFERROR(INDEX(($M$30:$M$60), MATCH(0, COUNTIF($S$29:S35, ($M$30:$M$60)), 0)), INDEX(($N$30:$N$60), MATCH(0, COUNTIF($S$29:S35, ($N$30:$N$60)), 0))), \"\")","v":""},{"$f":"IFERROR(IFERROR(INDEX(($O$30:$O$60), MATCH(0, COUNTIF($T$29:T35, ($O$30:$O$60)), 0)), INDEX(($P$30:$P$60), MATCH(0, COUNTIF($T$29:T35, ($P$30:$P$60)), 0))), \"\")","v":""},{"$f":"IFERROR(IFERROR(INDEX(($Q$30:$Q$60), MATCH(0, COUNTIF($U$29:U35, ($Q$30:$Q$60)), 0)), INDEX(($R$30:$R$60), MATCH(0, COUNTIF($U$29:U35, ($R$30:$R$60)), 0))), \"\")","v":"Opening Promo 60%"},{"$f":"IFERROR(IFERROR(INDEX(($S$30:$S$60), MATCH(0, COUNTIF($V$29:V35, ($S$30:$S$60)), 0)), INDEX(($T$30:$T$60), MATCH(0, COUNTIF($V$29:V35, ($T$30:$T$60)), 0))), \"\")","v":"4BP"},{"$f":"IFERROR(IFERROR(INDEX(($U$30:$U$60), MATCH(0, COUNTIF($W$29:W35, ($U$30:$U$60)), 0)), INDEX(($V$30:$V$60), MATCH(0, COUNTIF($W$29:W35, ($V$30:$V$60)), 0))), \"\")","v":"Opening Promo 60%"},{"$f":"IFERROR(INDEX((Data!$AT$33:$AX$82,Data!$AY$33:$BC$82,Data!$BD$33:$BH$82,Data!$BI$33:$BM$82,Data!$BN$33:$BR$82,Data!$BS$33:$BW$82,Data!$BX$33:$CB$82,Data!$CC$33:$CG$82,Data!$CH$33:$CL$82,Data!$CM$33:$CQ$82),$D36,2,CHOOSE(MATCH($Z$14,INDIRECT(\"Data!$AT$\"&$D36+32&\":$CM$\"&$D36+32),0),1,0,0,0,0,2,0,0,0,0,3,0,0,0,0,4,0,0,0,0,5,0,0,0,0,6,0,0,0,0,7,0,0,0,0,8,0,0,0,0,9,0,0,0,0,10)),\"\")","v":""},{"$f":"IFERROR(INDEX((Data!$AT$33:$AX$82,Data!$AY$33:$BC$82,Data!$BD$33:$BH$82,Data!$BI$33:$BM$82,Data!$BN$33:$BR$82,Data!$BS$33:$BW$82,Data!$BX$33:$CB$82,Data!$CC$33:$CG$82,Data!$CH$33:$CL$82,Data!$CM$33:$CQ$82),$D36,3,CHOOSE(MATCH($Z$14,INDIRECT(\"Data!$AT$\"&$D36+32&\":$CM$\"&$D36+32),0),1,0,0,0,0,2,0,0,0,0,3,0,0,0,0,4,0,0,0,0,5,0,0,0,0,6,0,0,0,0,7,0,0,0,0,8,0,0,0,0,9,0,0,0,0,10)),\"\")","v":""},{"$f":"IFERROR(INDEX((Data!$AT$33:$AX$82,Data!$AY$33:$BC$82,Data!$BD$33:$BH$82,Data!$BI$33:$BM$82,Data!$BN$33:$BR$82,Data!$BS$33:$BW$82,Data!$BX$33:$CB$82,Data!$CC$33:$CG$82,Data!$CH$33:$CL$82,Data!$CM$33:$CQ$82),$D36,4,CHOOSE(MATCH($Z$14,INDIRECT(\"Data!$AT$\"&$D36+32&\":$CM$\"&$D36+32),0),1,0,0,0,0,2,0,0,0,0,3,0,0,0,0,4,0,0,0,0,5,0,0,0,0,6,0,0,0,0,7,0,0,0,0,8,0,0,0,0,9,0,0,0,0,10)),\"\")","v":""},{"$f":"IFERROR(INDEX((Data!$AT$33:$AX$82,Data!$AY$33:$BC$82,Data!$BD$33:$BH$82,Data!$BI$33:$BM$82,Data!$BN$33:$BR$82,Data!$BS$33:$BW$82,Data!$BX$33:$CB$82,Data!$CC$33:$CG$82,Data!$CH$33:$CL$82,Data!$CM$33:$CQ$82),$D36,5,CHOOSE(MATCH($Z$14,INDIRECT(\"Data!$AT$\"&$D36+32&\":$CM$\"&$D36+32),0),1,0,0,0,0,2,0,0,0,0,3,0,0,0,0,4,0,0,0,0,5,0,0,0,0,6,0,0,0,0,7,0,0,0,0,8,0,0,0,0,9,0,0,0,0,10)),\"\")","v":""},0]
[null,{"$f":"'Report A'!$B39","v":"2014-07-08"},{"$f":"'Report A'!$C39","v":"Tuesday"},{"$f":"'Report A'!$D39","v":8},"K-Lunch","K-Dinner","4BP","Member 30%","Tiger 2+1","Heineken 3+1","RM4 PROMO","2 Bkt Tiger Rm 88","WC COMBO","WC 30%",{"$f":"IFERROR(IFERROR(INDEX(($E$30:$E$60), MATCH(0, COUNTIF($O$29:O36, ($E$30:$E$60)), 0)), INDEX(($F$30:$F$60), MATCH(0, COUNTIF($O$29:O36, ($F$30:$F$60)), 0))), \"\")","v":""},{"$f":"IFERROR(IFERROR(INDEX(($G$30:$G$60), MATCH(0, COUNTIF($P$29:P36, ($G$30:$G$60)), 0)), INDEX(($H$30:$H$60), MATCH(0, COUNTIF($P$29:P36, ($H$30:$H$60)), 0))), \"\")","v":""},{"$f":"IFERROR(IFERROR(INDEX(($I$30:$I$60), MATCH(0, COUNTIF($Q$29:Q36, ($I$30:$I$60)), 0)), INDEX(($J$30:$J$60), MATCH(0, COUNTIF($Q$29:Q36, ($J$30:$J$60)), 0))), \"\")","v":""},{"$f":"IFERROR(IFERROR(INDEX(($K$30:$K$60), MATCH(0, COUNTIF($R$29:R36, ($K$30:$K$60)), 0)), INDEX(($L$30:$L$60), MATCH(0, COUNTIF($R$29:R36, ($L$30:$L$60)), 0))), \"\")","v":""},{"$f":"IFERROR(IFERROR(INDEX(($M$30:$M$60), MATCH(0, COUNTIF($S$29:S36, ($M$30:$M$60)), 0)), INDEX(($N$30:$N$60), MATCH(0, COUNTIF($S$29:S36, ($N$30:$N$60)), 0))), \"\")","v":""},{"$f":"IFERROR(IFERROR(INDEX(($O$30:$O$60), MATCH(0, COUNTIF($T$29:T36, ($O$30:$O$60)), 0)), INDEX(($P$30:$P$60), MATCH(0, COUNTIF($T$29:T36, ($P$30:$P$60)), 0))), \"\")","v":""},{"$f":"IFERROR(IFERROR(INDEX(($Q$30:$Q$60), MATCH(0, COUNTIF($U$29:U36, ($Q$30:$Q$60)), 0)), INDEX(($R$30:$R$60), MATCH(0, COUNTIF($U$29:U36, ($R$30:$R$60)), 0))), \"\")","v":"2 Bkt Tiger Rm 88"},{"$f":"IFERROR(IFERROR(INDEX(($S$30:$S$60), MATCH(0, COUNTIF($V$29:V36, ($S$30:$S$60)), 0)), INDEX(($T$30:$T$60), MATCH(0, COUNTIF($V$29:V36, ($T$30:$T$60)), 0))), \"\")","v":"Member 30%"},{"$f":"IFERROR(IFERROR(INDEX(($U$30:$U$60), MATCH(0, COUNTIF($W$29:W36, ($U$30:$U$60)), 0)), INDEX(($V$30:$V$60), MATCH(0, COUNTIF($W$29:W36, ($V$30:$V$60)), 0))), \"\")","v":"2 Bkt Tiger Rm 88"},{"$f":"IFERROR(INDEX((Data!$AT$33:$AX$82,Data!$AY$33:$BC$82,Data!$BD$33:$BH$82,Data!$BI$33:$BM$82,Data!$BN$33:$BR$82,Data!$BS$33:$BW$82,Data!$BX$33:$CB$82,Data!$CC$33:$CG$82,Data!$CH$33:$CL$82,Data!$CM$33:$CQ$82),$D37,2,CHOOSE(MATCH($Z$14,INDIRECT(\"Data!$AT$\"&$D37+32&\":$CM$\"&$D37+32),0),1,0,0,0,0,2,0,0,0,0,3,0,0,0,0,4,0,0,0,0,5,0,0,0,0,6,0,0,0,0,7,0,0,0,0,8,0,0,0,0,9,0,0,0,0,10)),\"\")","v":""},{"$f":"IFERROR(INDEX((Data!$AT$33:$AX$82,Data!$AY$33:$BC$82,Data!$BD$33:$BH$82,Data!$BI$33:$BM$82,Data!$BN$33:$BR$82,Data!$BS$33:$BW$82,Data!$BX$33:$CB$82,Data!$CC$33:$CG$82,Data!$CH$33:$CL$82,Data!$CM$33:$CQ$82),$D37,3,CHOOSE(MATCH($Z$14,INDIRECT(\"Data!$AT$\"&$D37+32&\":$CM$\"&$D37+32),0),1,0,0,0,0,2,0,0,0,0,3,0,0,0,0,4,0,0,0,0,5,0,0,0,0,6,0,0,0,0,7,0,0,0,0,8,0,0,0,0,9,0,0,0,0,10)),\"\")","v":""},{"$f":"IFERROR(INDEX((Data!$AT$33:$AX$82,Data!$AY$33:$BC$82,Data!$BD$33:$BH$82,Data!$BI$33:$BM$82,Data!$BN$33:$BR$82,Data!$BS$33:$BW$82,Data!$BX$33:$CB$82,Data!$CC$33:$CG$82,Data!$CH$33:$CL$82,Data!$CM$33:$CQ$82),$D37,4,CHOOSE(MATCH($Z$14,INDIRECT(\"Data!$AT$\"&$D37+32&\":$CM$\"&$D37+32),0),1,0,0,0,0,2,0,0,0,0,3,0,0,0,0,4,0,0,0,0,5,0,0,0,0,6,0,0,0,0,7,0,0,0,0,8,0,0,0,0,9,0,0,0,0,10)),\"\")","v":""},{"$f":"IFERROR(INDEX((Data!$AT$33:$AX$82,Data!$AY$33:$BC$82,Data!$BD$33:$BH$82,Data!$BI$33:$BM$82,Data!$BN$33:$BR$82,Data!$BS$33:$BW$82,Data!$BX$33:$CB$82,Data!$CC$33:$CG$82,Data!$CH$33:$CL$82,Data!$CM$33:$CQ$82),$D37,5,CHOOSE(MATCH($Z$14,INDIRECT(\"Data!$AT$\"&$D37+32&\":$CM$\"&$D37+32),0),1,0,0,0,0,2,0,0,0,0,3,0,0,0,0,4,0,0,0,0,5,0,0,0,0,6,0,0,0,0,7,0,0,0,0,8,0,0,0,0,9,0,0,0,0,10)),\"\")","v":""},0]
[null,{"$f":"'Report A'!$B40","v":"2014-07-09"},{"$f":"'Report A'!$C40","v":"Wednesday"},{"$f":"'Report A'!$D40","v":9},"K-Lunch","K-Dinner","4BP","Member 30%","Tiger 2+1","Heineken 3+1","RM4 PROMO","2 Bkt Tiger Rm 88","WC COMBO","WC 30%",{"$f":"IFERROR(IFERROR(INDEX(($E$30:$E$60), MATCH(0, COUNTIF($O$29:O37, ($E$30:$E$60)), 0)), INDEX(($F$30:$F$60), MATCH(0, COUNTIF($O$29:O37, ($F$30:$F$60)), 0))), \"\")","v":""},{"$f":"IFERROR(IFERROR(INDEX(($G$30:$G$60), MATCH(0, COUNTIF($P$29:P37, ($G$30:$G$60)), 0)), INDEX(($H$30:$H$60), MATCH(0, COUNTIF($P$29:P37, ($H$30:$H$60)), 0))), \"\")","v":""},{"$f":"IFERROR(IFERROR(INDEX(($I$30:$I$60), MATCH(0, COUNTIF($Q$29:Q37, ($I$30:$I$60)), 0)), INDEX(($J$30:$J$60), MATCH(0, COUNTIF($Q$29:Q37, ($J$30:$J$60)), 0))), \"\")","v":""},{"$f":"IFERROR(IFERROR(INDEX(($K$30:$K$60), MATCH(0, COUNTIF($R$29:R37, ($K$30:$K$60)), 0)), INDEX(($L$30:$L$60), MATCH(0, COUNTIF($R$29:R37, ($L$30:$L$60)), 0))), \"\")","v":""},{"$f":"IFERROR(IFERROR(INDEX(($M$30:$M$60), MATCH(0, COUNTIF($S$29:S37, ($M$30:$M$60)), 0)), INDEX(($N$30:$N$60), MATCH(0, COUNTIF($S$29:S37, ($N$30:$N$60)), 0))), \"\")","v":""},{"$f":"IFERROR(IFERROR(INDEX(($O$30:$O$60), MATCH(0, COUNTIF($T$29:T37, ($O$30:$O$60)), 0)), INDEX(($P$30:$P$60), MATCH(0, COUNTIF($T$29:T37, ($P$30:$P$60)), 0))), \"\")","v":""},{"$f":"IFERROR(IFERROR(INDEX(($Q$30:$Q$60), MATCH(0, COUNTIF($U$29:U37, ($Q$30:$Q$60)), 0)), INDEX(($R$30:$R$60), MATCH(0, COUNTIF($U$29:U37, ($R$30:$R$60)), 0))), \"\")","v":""},{"$f":"IFERROR(IFERROR(INDEX(($S$30:$S$60), MATCH(0, COUNTIF($V$29:V37, ($S$30:$S$60)), 0)), INDEX(($T$30:$T$60), MATCH(0, COUNTIF($V$29:V37, ($T$30:$T$60)), 0))), \"\")","v":""},{"$f":"IFERROR(IFERROR(INDEX(($U$30:$U$60), MATCH(0, COUNTIF($W$29:W37, ($U$30:$U$60)), 0)), INDEX(($V$30:$V$60), MATCH(0, COUNTIF($W$29:W37, ($V$30:$V$60)), 0))), \"\")","v":"5pm-8pm RM 8"},{"$f":"IFERROR(INDEX((Data!$AT$33:$AX$82,Data!$AY$33:$BC$82,Data!$BD$33:$BH$82,Data!$BI$33:$BM$82,Data!$BN$33:$BR$82,Data!$BS$33:$BW$82,Data!$BX$33:$CB$82,Data!$CC$33:$CG$82,Data!$CH$33:$CL$82,Data!$CM$33:$CQ$82),$D38,2,CHOOSE(MATCH($Z$14,INDIRECT(\"Data!$AT$\"&$D38+32&\":$CM$\"&$D38+32),0),1,0,0,0,0,2,0,0,0,0,3,0,0,0,0,4,0,0,0,0,5,0,0,0,0,6,0,0,0,0,7,0,0,0,0,8,0,0,0,0,9,0,0,0,0,10)),\"\")","v":""},{"$f":"IFERROR(INDEX((Data!$AT$33:$AX$82,Data!$AY$33:$BC$82,Data!$BD$33:$BH$82,Data!$BI$33:$BM$82,Data!$BN$33:$BR$82,Data!$BS$33:$BW$82,Data!$BX$33:$CB$82,Data!$CC$33:$CG$82,Data!$CH$33:$CL$82,Data!$CM$33:$CQ$82),$D38,3,CHOOSE(MATCH($Z$14,INDIRECT(\"Data!$AT$\"&$D38+32&\":$CM$\"&$D38+32),0),1,0,0,0,0,2,0,0,0,0,3,0,0,0,0,4,0,0,0,0,5,0,0,0,0,6,0,0,0,0,7,0,0,0,0,8,0,0,0,0,9,0,0,0,0,10)),\"\")","v":""},{"$f":"IFERROR(INDEX((Data!$AT$33:$AX$82,Data!$AY$33:$BC$82,Data!$BD$33:$BH$82,Data!$BI$33:$BM$82,Data!$BN$33:$BR$82,Data!$BS$33:$BW$82,Data!$BX$33:$CB$82,Data!$CC$33:$CG$82,Data!$CH$33:$CL$82,Data!$CM$33:$CQ$82),$D38,4,CHOOSE(MATCH($Z$14,INDIRECT(\"Data!$AT$\"&$D38+32&\":$CM$\"&$D38+32),0),1,0,0,0,0,2,0,0,0,0,3,0,0,0,0,4,0,0,0,0,5,0,0,0,0,6,0,0,0,0,7,0,0,0,0,8,0,0,0,0,9,0,0,0,0,10)),\"\")","v":""},{"$f":"IFERROR(INDEX((Data!$AT$33:$AX$82,Data!$AY$33:$BC$82,Data!$BD$33:$BH$82,Data!$BI$33:$BM$82,Data!$BN$33:$BR$82,Data!$BS$33:$BW$82,Data!$BX$33:$CB$82,Data!$CC$33:$CG$82,Data!$CH$33:$CL$82,Data!$CM$33:$CQ$82),$D38,5,CHOOSE(MATCH($Z$14,INDIRECT(\"Data!$AT$\"&$D38+32&\":$CM$\"&$D38+32),0),1,0,0,0,0,2,0,0,0,0,3,0,0,0,0,4,0,0,0,0,5,0,0,0,0,6,0,0,0,0,7,0,0,0,0,8,0,0,0,0,9,0,0,0,0,10)),\"\")","v":""},0]
[null,{"$f":"'Report A'!$B41","v":"2014-07-10"},{"$f":"'Report A'!$C41","v":"Thursday"},{"$f":"'Report A'!$D41","v":10},"K-Lunch","K-Dinner","4BP","Member 30%","Tiger 2+1","Heineken 3+1","RM4 PROMO","2 Bkt Tiger Rm 88","WC COMBO","WC 30%",{"$f":"IFERROR(IFERROR(INDEX(($E$30:$E$60), MATCH(0, COUNTIF($O$29:O38, ($E$30:$E$60)), 0)), INDEX(($F$30:$F$60), MATCH(0, COUNTIF($O$29:O38, ($F$30:$F$60)), 0))), \"\")","v":""},{"$f":"IFERROR(IFERROR(INDEX(($G$30:$G$60), MATCH(0, COUNTIF($P$29:P38, ($G$30:$G$60)), 0)), INDEX(($H$30:$H$60), MATCH(0, COUNTIF($P$29:P38, ($H$30:$H$60)), 0))), \"\")","v":""},{"$f":"IFERROR(IFERROR(INDEX(($I$30:$I$60), MATCH(0, COUNTIF($Q$29:Q38, ($I$30:$I$60)), 0)), INDEX(($J$30:$J$60), MATCH(0, COUNTIF($Q$29:Q38, ($J$30:$J$60)), 0))), \"\")","v":""},{"$f":"IFERROR(IFERROR(INDEX(($K$30:$K$60), MATCH(0, COUNTIF($R$29:R38, ($K$30:$K$60)), 0)), INDEX(($L$30:$L$60), MATCH(0, COUNTIF($R$29:R38, ($L$30:$L$60)), 0))), \"\")","v":""},{"$f":"IFERROR(IFERROR(INDEX(($M$30:$M$60), MATCH(0, COUNTIF($S$29:S38, ($M$30:$M$60)), 0)), INDEX(($N$30:$N$60), MATCH(0, COUNTIF($S$29:S38, ($N$30:$N$60)), 0))), \"\")","v":""},{"$f":"IFERROR(IFERROR(INDEX(($O$30:$O$60), MATCH(0, COUNTIF($T$29:T38, ($O$30:$O$60)), 0)), INDEX(($P$30:$P$60), MATCH(0, COUNTIF($T$29:T38, ($P$30:$P$60)), 0))), \"\")","v":""},{"$f":"IFERROR(IFERROR(INDEX(($Q$30:$Q$60), MATCH(0, COUNTIF($U$29:U38, ($Q$30:$Q$60)), 0)), INDEX(($R$30:$R$60), MATCH(0, COUNTIF($U$29:U38, ($R$30:$R$60)), 0))), \"\")","v":""},{"$f":"IFERROR(IFERROR(INDEX(($S$30:$S$60), MATCH(0, COUNTIF($V$29:V38, ($S$30:$S$60)), 0)), INDEX(($T$30:$T$60), MATCH(0, COUNTIF($V$29:V38, ($T$30:$T$60)), 0))), \"\")","v":""},{"$f":"IFERROR(IFERROR(INDEX(($U$30:$U$60), MATCH(0, COUNTIF($W$29:W38, ($U$30:$U$60)), 0)), INDEX(($V$30:$V$60), MATCH(0, COUNTIF($W$29:W38, ($V$30:$V$60)), 0))), \"\")","v":"WC COMBO"},{"$f":"IFERROR(INDEX((Data!$AT$33:$AX$82,Data!$AY$33:$BC$82,Data!$BD$33:$BH$82,Data!$BI$33:$BM$82,Data!$BN$33:$BR$82,Data!$BS$33:$BW$82,Data!$BX$33:$CB$82,Data!$CC$33:$CG$82,Data!$CH$33:$CL$82,Data!$CM$33:$CQ$82),$D39,2,CHOOSE(MATCH($Z$14,INDIRECT(\"Data!$AT$\"&$D39+32&\":$CM$\"&$D39+32),0),1,0,0,0,0,2,0,0,0,0,3,0,0,0,0,4,0,0,0,0,5,0,0,0,0,6,0,0,0,0,7,0,0,0,0,8,0,0,0,0,9,0,0,0,0,10)),\"\")","v":""},{"$f":"IFERROR(INDEX((Data!$AT$33:$AX$82,Data!$AY$33:$BC$82,Data!$BD$33:$BH$82,Data!$BI$33:$BM$82,Data!$BN$33:$BR$82,Data!$BS$33:$BW$82,Data!$BX$33:$CB$82,Data!$CC$33:$CG$82,Data!$CH$33:$CL$82,Data!$CM$33:$CQ$82),$D39,3,CHOOSE(MATCH($Z$14,INDIRECT(\"Data!$AT$\"&$D39+32&\":$CM$\"&$D39+32),0),1,0,0,0,0,2,0,0,0,0,3,0,0,0,0,4,0,0,0,0,5,0,0,0,0,6,0,0,0,0,7,0,0,0,0,8,0,0,0,0,9,0,0,0,0,10)),\"\")","v":""},{"$f":"IFERROR(INDEX((Data!$AT$33:$AX$82,Data!$AY$33:$BC$82,Data!$BD$33:$BH$82,Data!$BI$33:$BM$82,Data!$BN$33:$BR$82,Data!$BS$33:$BW$82,Data!$BX$33:$CB$82,Data!$CC$33:$CG$82,Data!$CH$33:$CL$82,Data!$CM$33:$CQ$82),$D39,4,CHOOSE(MATCH($Z$14,INDIRECT(\"Data!$AT$\"&$D39+32&\":$CM$\"&$D39+32),0),1,0,0,0,0,2,0,0,0,0,3,0,0,0,0,4,0,0,0,0,5,0,0,0,0,6,0,0,0,0,7,0,0,0,0,8,0,0,0,0,9,0,0,0,0,10)),\"\")","v":""},{"$f":"IFERROR(INDEX((Data!$AT$33:$AX$82,Data!$AY$33:$BC$82,Data!$BD$33:$BH$82,Data!$BI$33:$BM$82,Data!$BN$33:$BR$82,Data!$BS$33:$BW$82,Data!$BX$33:$CB$82,Data!$CC$33:$CG$82,Data!$CH$33:$CL$82,Data!$CM$33:$CQ$82),$D39,5,CHOOSE(MATCH($Z$14,INDIRECT(\"Data!$AT$\"&$D39+32&\":$CM$\"&$D39+32),0),1,0,0,0,0,2,0,0,0,0,3,0,0,0,0,4,0,0,0,0,5,0,0,0,0,6,0,0,0,0,7,0,0,0,0,8,0,0,0,0,9,0,0,0,0,10)),\"\")","v":""},0]
[null,{"$f":"'Report A'!$B42","v":"2014-07-11"},{"$f":"'Report A'!$C42","v":"Friday"},{"$f":"'Report A'!$D42","v":11},{"$f":"IFERROR(INDIRECT(\"Data!\"&E$17&$D40+32),\"\")","v":"K-Lunch"},"K-Dinner","4BP","Member 30%","Tiger 2+1","Heineken 3+1","RM4 PROMO","2 Bkt Tiger Rm 88","WC COMBO","WC 30%",{"$f":"IFERROR(IFERROR(INDEX(($E$30:$E$60), MATCH(0, COUNTIF($O$29:O39, ($E$30:$E$60)), 0)), INDEX(($F$30:$F$60), MATCH(0, COUNTIF($O$29:O39, ($F$30:$F$60)), 0))), \"\")","v":""},{"$f":"IFERROR(IFERROR(INDEX(($G$30:$G$60), MATCH(0, COUNTIF($P$29:P39, ($G$30:$G$60)), 0)), INDEX(($H$30:$H$60), MATCH(0, COUNTIF($P$29:P39, ($H$30:$H$60)), 0))), \"\")","v":""},{"$f":"IFERROR(IFERROR(INDEX(($I$30:$I$60), MATCH(0, COUNTIF($Q$29:Q39, ($I$30:$I$60)), 0)), INDEX(($J$30:$J$60), MATCH(0, COUNTIF($Q$29:Q39, ($J$30:$J$60)), 0))), \"\")","v":""},{"$f":"IFERROR(IFERROR(INDEX(($K$30:$K$60), MATCH(0, COUNTIF($R$29:R39, ($K$30:$K$60)), 0)), INDEX(($L$30:$L$60), MATCH(0, COUNTIF($R$29:R39, ($L$30:$L$60)), 0))), \"\")","v":""},{"$f":"IFERROR(IFERROR(INDEX(($M$30:$M$60), MATCH(0, COUNTIF($S$29:S39, ($M$30:$M$60)), 0)), INDEX(($N$30:$N$60), MATCH(0, COUNTIF($S$29:S39, ($N$30:$N$60)), 0))), \"\")","v":""},{"$f":"IFERROR(IFERROR(INDEX(($O$30:$O$60), MATCH(0, COUNTIF($T$29:T39, ($O$30:$O$60)), 0)), INDEX(($P$30:$P$60), MATCH(0, COUNTIF($T$29:T39, ($P$30:$P$60)), 0))), \"\")","v":""},{"$f":"IFERROR(IFERROR(INDEX(($Q$30:$Q$60), MATCH(0, COUNTIF($U$29:U39, ($Q$30:$Q$60)), 0)), INDEX(($R$30:$R$60), MATCH(0, COUNTIF($U$29:U39, ($R$30:$R$60)), 0))), \"\")","v":""},{"$f":"IFERROR(IFERROR(INDEX(($S$30:$S$60), MATCH(0, COUNTIF($V$29:V39, ($S$30:$S$60)), 0)), INDEX(($T$30:$T$60), MATCH(0, COUNTIF($V$29:V39, ($T$30:$T$60)), 0))), \"\")","v":""},{"$f":"IFERROR(IFERROR(INDEX(($U$30:$U$60), MATCH(0, COUNTIF($W$29:W39, ($U$30:$U$60)), 0)), INDEX(($V$30:$V$60), MATCH(0, COUNTIF($W$29:W39, ($V$30:$V$60)), 0))), \"\")","v":"WC 30%"},{"$f":"IFERROR(INDEX((Data!$AT$33:$AX$82,Data!$AY$33:$BC$82,Data!$BD$33:$BH$82,Data!$BI$33:$BM$82,Data!$BN$33:$BR$82,Data!$BS$33:$BW$82,Data!$BX$33:$CB$82,Data!$CC$33:$CG$82,Data!$CH$33:$CL$82,Data!$CM$33:$CQ$82),$D40,2,CHOOSE(MATCH($Z$14,INDIRECT(\"Data!$AT$\"&$D40+32&\":$CM$\"&$D40+32),0),1,0,0,0,0,2,0,0,0,0,3,0,0,0,0,4,0,0,0,0,5,0,0,0,0,6,0,0,0,0,7,0,0,0,0,8,0,0,0,0,9,0,0,0,0,10)),\"\")","v":""},{"$f":"IFERROR(INDEX((Data!$AT$33:$AX$82,Data!$AY$33:$BC$82,Data!$BD$33:$BH$82,Data!$BI$33:$BM$82,Data!$BN$33:$BR$82,Data!$BS$33:$BW$82,Data!$BX$33:$CB$82,Data!$CC$33:$CG$82,Data!$CH$33:$CL$82,Data!$CM$33:$CQ$82),$D40,3,CHOOSE(MATCH($Z$14,INDIRECT(\"Data!$AT$\"&$D40+32&\":$CM$\"&$D40+32),0),1,0,0,0,0,2,0,0,0,0,3,0,0,0,0,4,0,0,0,0,5,0,0,0,0,6,0,0,0,0,7,0,0,0,0,8,0,0,0,0,9,0,0,0,0,10)),\"\")","v":""},{"$f":"IFERROR(INDEX((Data!$AT$33:$AX$82,Data!$AY$33:$BC$82,Data!$BD$33:$BH$82,Data!$BI$33:$BM$82,Data!$BN$33:$BR$82,Data!$BS$33:$BW$82,Data!$BX$33:$CB$82,Data!$CC$33:$CG$82,Data!$CH$33:$CL$82,Data!$CM$33:$CQ$82),$D40,4,CHOOSE(MATCH($Z$14,INDIRECT(\"Data!$AT$\"&$D40+32&\":$CM$\"&$D40+32),0),1,0,0,0,0,2,0,0,0,0,3,0,0,0,0,4,0,0,0,0,5,0,0,0,0,6,0,0,0,0,7,0,0,0,0,8,0,0,0,0,9,0,0,0,0,10)),\"\")","v":""},{"$f":"IFERROR(INDEX((Data!$AT$33:$AX$82,Data!$AY$33:$BC$82,Data!$BD$33:$BH$82,Data!$BI$33:$BM$82,Data!$BN$33:$BR$82,Data!$BS$33:$BW$82,Data!$BX$33:$CB$82,Data!$CC$33:$CG$82,Data!$CH$33:$CL$82,Data!$CM$33:$CQ$82),$D40,5,CHOOSE(MATCH($Z$14,INDIRECT(\"Data!$AT$\"&$D40+32&\":$CM$\"&$D40+32),0),1,0,0,0,0,2,0,0,0,0,3,0,0,0,0,4,0,0,0,0,5,0,0,0,0,6,0,0,0,0,7,0,0,0,0,8,0,0,0,0,9,0,0,0,0,10)),\"\")","v":""},0]
[null,{"$f":"'Report A'!$B43","v":"2014-07-12"},{"$f":"'Report A'!$C43","v":"Saturday"},{"$f":"'Report A'!$D43","v":12},"K-Lunch","K-Dinner","4BP","Member 30%","Tiger 2+1","Heineken 3+1","RM4 PROMO","2 Bkt Tiger Rm 88","WC COMBO","WC 30%",{"$f":"IFERROR(IFERROR(INDEX(($E$30:$E$60), MATCH(0, COUNTIF($O$29:O40, ($E$30:$E$60)), 0)), INDEX(($F$30:$F$60), MATCH(0, COUNTIF($O$29:O40, ($F$30:$F$60)), 0))), \"\")","v":""},{"$f":"IFERROR(IFERROR(INDEX(($G$30:$G$60), MATCH(0, COUNTIF($P$29:P40, ($G$30:$G$60)), 0)), INDEX(($H$30:$H$60), MATCH(0, COUNTIF($P$29:P40, ($H$30:$H$60)), 0))), \"\")","v":""},{"$f":"IFERROR(IFERROR(INDEX(($I$30:$I$60), MATCH(0, COUNTIF($Q$29:Q40, ($I$30:$I$60)), 0)), INDEX(($J$30:$J$60), MATCH(0, COUNTIF($Q$29:Q40, ($J$30:$J$60)), 0))), \"\")","v":""},{"$f":"IFERROR(IFERROR(INDEX(($K$30:$K$60), MATCH(0, COUNTIF($R$29:R40, ($K$30:$K$60)), 0)), INDEX(($L$30:$L$60), MATCH(0, COUNTIF($R$29:R40, ($L$30:$L$60)), 0))), \"\")","v":""},{"$f":"IFERROR(IFERROR(INDEX(($M$30:$M$60), MATCH(0, COUNTIF($S$29:S40, ($M$30:$M$60)), 0)), INDEX(($N$30:$N$60), MATCH(0, COUNTIF($S$29:S40, ($N$30:$N$60)), 0))), \"\")","v":""},{"$f":"IFERROR(IFERROR(INDEX(($O$30:$O$60), MATCH(0, COUNTIF($T$29:T40, ($O$30:$O$60)), 0)), INDEX(($P$30:$P$60), MATCH(0, COUNTIF($T$29:T40, ($P$30:$P$60)), 0))), \"\")","v":""},{"$f":"IFERROR(IFERROR(INDEX(($Q$30:$Q$60), MATCH(0, COUNTIF($U$29:U40, ($Q$30:$Q$60)), 0)), INDEX(($R$30:$R$60), MATCH(0, COUNTIF($U$29:U40, ($R$30:$R$60)), 0))), \"\")","v":""},{"$f":"IFERROR(IFERROR(INDEX(($S$30:$S$60), MATCH(0, COUNTIF($V$29:V40, ($S$30:$S$60)), 0)), INDEX(($T$30:$T$60), MATCH(0, COUNTIF($V$29:V40, ($T$30:$T$60)), 0))), \"\")","v":""},{"$f":"IFERROR(IFERROR(INDEX(($U$30:$U$60), MATCH(0, COUNTIF($W$29:W40, ($U$30:$U$60)), 0)), INDEX(($V$30:$V$60), MATCH(0, COUNTIF($W$29:W40, ($V$30:$V$60)), 0))), \"\")","v":"K-Lunch"},{"$f":"IFERROR(INDEX((Data!$AT$33:$AX$82,Data!$AY$33:$BC$82,Data!$BD$33:$BH$82,Data!$BI$33:$BM$82,Data!$BN$33:$BR$82,Data!$BS$33:$BW$82,Data!$BX$33:$CB$82,Data!$CC$33:$CG$82,Data!$CH$33:$CL$82,Data!$CM$33:$CQ$82),$D41,2,CHOOSE(MATCH($Z$14,INDIRECT(\"Data!$AT$\"&$D41+32&\":$CM$\"&$D41+32),0),1,0,0,0,0,2,0,0,0,0,3,0,0,0,0,4,0,0,0,0,5,0,0,0,0,6,0,0,0,0,7,0,0,0,0,8,0,0,0,0,9,0,0,0,0,10)),\"\")","v":""},{"$f":"IFERROR(INDEX((Data!$AT$33:$AX$82,Data!$AY$33:$BC$82,Data!$BD$33:$BH$82,Data!$BI$33:$BM$82,Data!$BN$33:$BR$82,Data!$BS$33:$BW$82,Data!$BX$33:$CB$82,Data!$CC$33:$CG$82,Data!$CH$33:$CL$82,Data!$CM$33:$CQ$82),$D41,3,CHOOSE(MATCH($Z$14,INDIRECT(\"Data!$AT$\"&$D41+32&\":$CM$\"&$D41+32),0),1,0,0,0,0,2,0,0,0,0,3,0,0,0,0,4,0,0,0,0,5,0,0,0,0,6,0,0,0,0,7,0,0,0,0,8,0,0,0,0,9,0,0,0,0,10)),\"\")","v":""},{"$f":"IFERROR(INDEX((Data!$AT$33:$AX$82,Data!$AY$33:$BC$82,Data!$BD$33:$BH$82,Data!$BI$33:$BM$82,Data!$BN$33:$BR$82,Data!$BS$33:$BW$82,Data!$BX$33:$CB$82,Data!$CC$33:$CG$82,Data!$CH$33:$CL$82,Data!$CM$33:$CQ$82),$D41,4,CHOOSE(MATCH($Z$14,INDIRECT(\"Data!$AT$\"&$D41+32&\":$CM$\"&$D41+32),0),1,0,0,0,0,2,0,0,0,0,3,0,0,0,0,4,0,0,0,0,5,0,0,0,0,6,0,0,0,0,7,0,0,0,0,8,0,0,0,0,9,0,0,0,0,10)),\"\")","v":""},{"$f":"IFERROR(INDEX((Data!$AT$33:$AX$82,Data!$AY$33:$BC$82,Data!$BD$33:$BH$82,Data!$BI$33:$BM$82,Data!$BN$33:$BR$82,Data!$BS$33:$BW$82,Data!$BX$33:$CB$82,Data!$CC$33:$CG$82,Data!$CH$33:$CL$82,Data!$CM$33:$CQ$82),$D41,5,CHOOSE(MATCH($Z$14,INDIRECT(\"Data!$AT$\"&$D41+32&\":$CM$\"&$D41+32),0),1,0,0,0,0,2,0,0,0,0,3,0,0,0,0,4,0,0,0,0,5,0,0,0,0,6,0,0,0,0,7,0,0,0,0,8,0,0,0,0,9,0,0,0,0,10)),\"\")","v":""},0]
[null,{"$f":"'Report A'!$B44","v":"2014-07-13"},{"$f":"'Report A'!$C44","v":"Sunday"},{"$f":"'Report A'!$D44","v":13},"K-Lunch","K-Dinner","4BP","Member 30%","Tiger 2+1","Heineken 3+1","RM4 PROMO","2 Bkt Tiger Rm 88","WC COMBO","WC 30%",{"$f":"IFERROR(IFERROR(INDEX(($E$30:$E$60), MATCH(0, COUNTIF($O$29:O41, ($E$30:$E$60)), 0)), INDEX(($F$30:$F$60), MATCH(0, COUNTIF($O$29:O41, ($F$30:$F$60)), 0))), \"\")","v":""},{"$f":"IFERROR(IFERROR(INDEX(($G$30:$G$60), MATCH(0, COUNTIF($P$29:P41, ($G$30:$G$60)), 0)), INDEX(($H$30:$H$60), MATCH(0, COUNTIF($P$29:P41, ($H$30:$H$60)), 0))), \"\")","v":""},{"$f":"IFERROR(IFERROR(INDEX(($I$30:$I$60), MATCH(0, COUNTIF($Q$29:Q41, ($I$30:$I$60)), 0)), INDEX(($J$30:$J$60), MATCH(0, COUNTIF($Q$29:Q41, ($J$30:$J$60)), 0))), \"\")","v":""},{"$f":"IFERROR(IFERROR(INDEX(($K$30:$K$60), MATCH(0, COUNTIF($R$29:R41, ($K$30:$K$60)), 0)), INDEX(($L$30:$L$60), MATCH(0, COUNTIF($R$29:R41, ($L$30:$L$60)), 0))), \"\")","v":""},{"$f":"IFERROR(IFERROR(INDEX(($M$30:$M$60), MATCH(0, COUNTIF($S$29:S41, ($M$30:$M$60)), 0)), INDEX(($N$30:$N$60), MATCH(0, COUNTIF($S$29:S41, ($N$30:$N$60)), 0))), \"\")","v":""},{"$f":"IFERROR(IFERROR(INDEX(($O$30:$O$60), MATCH(0, COUNTIF($T$29:T41, ($O$30:$O$60)), 0)), INDEX(($P$30:$P$60), MATCH(0, COUNTIF($T$29:T41, ($P$30:$P$60)), 0))), \"\")","v":""},{"$f":"IFERROR(IFERROR(INDEX(($Q$30:$Q$60), MATCH(0, COUNTIF($U$29:U41, ($Q$30:$Q$60)), 0)), INDEX(($R$30:$R$60), MATCH(0, COUNTIF($U$29:U41, ($R$30:$R$60)), 0))), \"\")","v":""},{"$f":"IFERROR(IFERROR(INDEX(($S$30:$S$60), MATCH(0, COUNTIF($V$29:V41, ($S$30:$S$60)), 0)), INDEX(($T$30:$T$60), MATCH(0, COUNTIF($V$29:V41, ($T$30:$T$60)), 0))), \"\")","v":""},{"$f":"IFERROR(IFERROR(INDEX(($U$30:$U$60), MATCH(0, COUNTIF($W$29:W41, ($U$30:$U$60)), 0)), INDEX(($V$30:$V$60), MATCH(0, COUNTIF($W$29:W41, ($V$30:$V$60)), 0))), \"\")","v":"K-Dinner"},{"$f":"IFERROR(INDEX((Data!$AT$33:$AX$82,Data!$AY$33:$BC$82,Data!$BD$33:$BH$82,Data!$BI$33:$BM$82,Data!$BN$33:$BR$82,Data!$BS$33:$BW$82,Data!$BX$33:$CB$82,Data!$CC$33:$CG$82,Data!$CH$33:$CL$82,Data!$CM$33:$CQ$82),$D42,2,CHOOSE(MATCH($Z$14,INDIRECT(\"Data!$AT$\"&$D42+32&\":$CM$\"&$D42+32),0),1,0,0,0,0,2,0,0,0,0,3,0,0,0,0,4,0,0,0,0,5,0,0,0,0,6,0,0,0,0,7,0,0,0,0,8,0,0,0,0,9,0,0,0,0,10)),\"\")","v":""},{"$f":"IFERROR(INDEX((Data!$AT$33:$AX$82,Data!$AY$33:$BC$82,Data!$BD$33:$BH$82,Data!$BI$33:$BM$82,Data!$BN$33:$BR$82,Data!$BS$33:$BW$82,Data!$BX$33:$CB$82,Data!$CC$33:$CG$82,Data!$CH$33:$CL$82,Data!$CM$33:$CQ$82),$D42,3,CHOOSE(MATCH($Z$14,INDIRECT(\"Data!$AT$\"&$D42+32&\":$CM$\"&$D42+32),0),1,0,0,0,0,2,0,0,0,0,3,0,0,0,0,4,0,0,0,0,5,0,0,0,0,6,0,0,0,0,7,0,0,0,0,8,0,0,0,0,9,0,0,0,0,10)),\"\")","v":""},{"$f":"IFERROR(INDEX((Data!$AT$33:$AX$82,Data!$AY$33:$BC$82,Data!$BD$33:$BH$82,Data!$BI$33:$BM$82,Data!$BN$33:$BR$82,Data!$BS$33:$BW$82,Data!$BX$33:$CB$82,Data!$CC$33:$CG$82,Data!$CH$33:$CL$82,Data!$CM$33:$CQ$82),$D42,4,CHOOSE(MATCH($Z$14,INDIRECT(\"Data!$AT$\"&$D42+32&\":$CM$\"&$D42+32),0),1,0,0,0,0,2,0,0,0,0,3,0,0,0,0,4,0,0,0,0,5,0,0,0,0,6,0,0,0,0,7,0,0,0,0,8,0,0,0,0,9,0,0,0,0,10)),\"\")","v":""},{"$f":"IFERROR(INDEX((Data!$AT$33:$AX$82,Data!$AY$33:$BC$82,Data!$BD$33:$BH$82,Data!$BI$33:$BM$82,Data!$BN$33:$BR$82,Data!$BS$33:$BW$82,Data!$BX$33:$CB$82,Data!$CC$33:$CG$82,Data!$CH$33:$CL$82,Data!$CM$33:$CQ$82),$D42,5,CHOOSE(MATCH($Z$14,INDIRECT(\"Data!$AT$\"&$D42+32&\":$CM$\"&$D42+32),0),1,0,0,0,0,2,0,0,0,0,3,0,0,0,0,4,0,0,0,0,5,0,0,0,0,6,0,0,0,0,7,0,0,0,0,8,0,0,0,0,9,0,0,0,0,10)),\"\")","v":""},0]
[null,{"$f":"'Report A'!$B45","v":"2014-07-14"},{"$f":"'Report A'!$C45","v":"Monday"},{"$f":"'Report A'!$D45","v":14},"K-Lunch","K-Dinner","4BP","Member 30%","Tiger 2+1","Heineken 3+1","RM4 PROMO","2 Bkt Tiger Rm 88","WC COMBO","WC 30%",{"$f":"IFERROR(IFERROR(INDEX(($E$30:$E$60), MATCH(0, COUNTIF($O$29:O42, ($E$30:$E$60)), 0)), INDEX(($F$30:$F$60), MATCH(0, COUNTIF($O$29:O42, ($F$30:$F$60)), 0))), \"\")","v":""},{"$f":"IFERROR(IFERROR(INDEX(($G$30:$G$60), MATCH(0, COUNTIF($P$29:P42, ($G$30:$G$60)), 0)), INDEX(($H$30:$H$60), MATCH(0, COUNTIF($P$29:P42, ($H$30:$H$60)), 0))), \"\")","v":""},{"$f":"IFERROR(IFERROR(INDEX(($I$30:$I$60), MATCH(0, COUNTIF($Q$29:Q42, ($I$30:$I$60)), 0)), INDEX(($J$30:$J$60), MATCH(0, COUNTIF($Q$29:Q42, ($J$30:$J$60)), 0))), \"\")","v":""},{"$f":"IFERROR(IFERROR(INDEX(($K$30:$K$60), MATCH(0, COUNTIF($R$29:R42, ($K$30:$K$60)), 0)), INDEX(($L$30:$L$60), MATCH(0, COUNTIF($R$29:R42, ($L$30:$L$60)), 0))), \"\")","v":""},{"$f":"IFERROR(IFERROR(INDEX(($M$30:$M$60), MATCH(0, COUNTIF($S$29:S42, ($M$30:$M$60)), 0)), INDEX(($N$30:$N$60), MATCH(0, COUNTIF($S$29:S42, ($N$30:$N$60)), 0))), \"\")","v":""},{"$f":"IFERROR(IFERROR(INDEX(($O$30:$O$60), MATCH(0, COUNTIF($T$29:T42, ($O$30:$O$60)), 0)), INDEX(($P$30:$P$60), MATCH(0, COUNTIF($T$29:T42, ($P$30:$P$60)), 0))), \"\")","v":""},{"$f":"IFERROR(IFERROR(INDEX(($Q$30:$Q$60), MATCH(0, COUNTIF($U$29:U42, ($Q$30:$Q$60)), 0)), INDEX(($R$30:$R$60), MATCH(0, COUNTIF($U$29:U42, ($R$30:$R$60)), 0))), \"\")","v":""},{"$f":"IFERROR(IFERROR(INDEX(($S$30:$S$60), MATCH(0, COUNTIF($V$29:V42, ($S$30:$S$60)), 0)), INDEX(($T$30:$T$60), MATCH(0, COUNTIF($V$29:V42, ($T$30:$T$60)), 0))), \"\")","v":""},{"$f":"IFERROR(IFERROR(INDEX(($U$30:$U$60), MATCH(0, COUNTIF($W$29:W42, ($U$30:$U$60)), 0)), INDEX(($V$30:$V$60), MATCH(0, COUNTIF($W$29:W42, ($V$30:$V$60)), 0))), \"\")","v":"4BP"},{"$f":"IFERROR(INDEX((Data!$AT$33:$AX$82,Data!$AY$33:$BC$82,Data!$BD$33:$BH$82,Data!$BI$33:$BM$82,Data!$BN$33:$BR$82,Data!$BS$33:$BW$82,Data!$BX$33:$CB$82,Data!$CC$33:$CG$82,Data!$CH$33:$CL$82,Data!$CM$33:$CQ$82),$D43,2,CHOOSE(MATCH($Z$14,INDIRECT(\"Data!$AT$\"&$D43+32&\":$CM$\"&$D43+32),0),1,0,0,0,0,2,0,0,0,0,3,0,0,0,0,4,0,0,0,0,5,0,0,0,0,6,0,0,0,0,7,0,0,0,0,8,0,0,0,0,9,0,0,0,0,10)),\"\")","v":""},{"$f":"IFERROR(INDEX((Data!$AT$33:$AX$82,Data!$AY$33:$BC$82,Data!$BD$33:$BH$82,Data!$BI$33:$BM$82,Data!$BN$33:$BR$82,Data!$BS$33:$BW$82,Data!$BX$33:$CB$82,Data!$CC$33:$CG$82,Data!$CH$33:$CL$82,Data!$CM$33:$CQ$82),$D43,3,CHOOSE(MATCH($Z$14,INDIRECT(\"Data!$AT$\"&$D43+32&\":$CM$\"&$D43+32),0),1,0,0,0,0,2,0,0,0,0,3,0,0,0,0,4,0,0,0,0,5,0,0,0,0,6,0,0,0,0,7,0,0,0,0,8,0,0,0,0,9,0,0,0,0,10)),\"\")","v":""},{"$f":"IFERROR(INDEX((Data!$AT$33:$AX$82,Data!$AY$33:$BC$82,Data!$BD$33:$BH$82,Data!$BI$33:$BM$82,Data!$BN$33:$BR$82,Data!$BS$33:$BW$82,Data!$BX$33:$CB$82,Data!$CC$33:$CG$82,Data!$CH$33:$CL$82,Data!$CM$33:$CQ$82),$D43,4,CHOOSE(MATCH($Z$14,INDIRECT(\"Data!$AT$\"&$D43+32&\":$CM$\"&$D43+32),0),1,0,0,0,0,2,0,0,0,0,3,0,0,0,0,4,0,0,0,0,5,0,0,0,0,6,0,0,0,0,7,0,0,0,0,8,0,0,0,0,9,0,0,0,0,10)),\"\")","v":""},{"$f":"IFERROR(INDEX((Data!$AT$33:$AX$82,Data!$AY$33:$BC$82,Data!$BD$33:$BH$82,Data!$BI$33:$BM$82,Data!$BN$33:$BR$82,Data!$BS$33:$BW$82,Data!$BX$33:$CB$82,Data!$CC$33:$CG$82,Data!$CH$33:$CL$82,Data!$CM$33:$CQ$82),$D43,5,CHOOSE(MATCH($Z$14,INDIRECT(\"Data!$AT$\"&$D43+32&\":$CM$\"&$D43+32),0),1,0,0,0,0,2,0,0,0,0,3,0,0,0,0,4,0,0,0,0,5,0,0,0,0,6,0,0,0,0,7,0,0,0,0,8,0,0,0,0,9,0,0,0,0,10)),\"\")","v":""},0]
[null,{"$f":"'Report A'!$B46","v":"2014-07-15"},{"$f":"'Report A'!$C46","v":"Tuesday"},{"$f":"'Report A'!$D46","v":15},"K-Lunch","K-Dinner","4BP","Member 30%","Tiger 2+1","Heineken 3+1","RM4 PROMO","2 Bkt Tiger Rm 88","WC COMBO","WC 30%",{"$f":"IFERROR(IFERROR(INDEX(($E$30:$E$60), MATCH(0, COUNTIF($O$29:O43, ($E$30:$E$60)), 0)), INDEX(($F$30:$F$60), MATCH(0, COUNTIF($O$29:O43, ($F$30:$F$60)), 0))), \"\")","v":""},{"$f":"IFERROR(IFERROR(INDEX(($G$30:$G$60), MATCH(0, COUNTIF($P$29:P43, ($G$30:$G$60)), 0)), INDEX(($H$30:$H$60), MATCH(0, COUNTIF($P$29:P43, ($H$30:$H$60)), 0))), \"\")","v":""},{"$f":"IFERROR(IFERROR(INDEX(($I$30:$I$60), MATCH(0, COUNTIF($Q$29:Q43, ($I$30:$I$60)), 0)), INDEX(($J$30:$J$60), MATCH(0, COUNTIF($Q$29:Q43, ($J$30:$J$60)), 0))), \"\")","v":""},{"$f":"IFERROR(IFERROR(INDEX(($K$30:$K$60), MATCH(0, COUNTIF($R$29:R43, ($K$30:$K$60)), 0)), INDEX(($L$30:$L$60), MATCH(0, COUNTIF($R$29:R43, ($L$30:$L$60)), 0))), \"\")","v":""},{"$f":"IFERROR(IFERROR(INDEX(($M$30:$M$60), MATCH(0, COUNTIF($S$29:S43, ($M$30:$M$60)), 0)), INDEX(($N$30:$N$60), MATCH(0, COUNTIF($S$29:S43, ($N$30:$N$60)), 0))), \"\")","v":""},{"$f":"IFERROR(IFERROR(INDEX(($O$30:$O$60), MATCH(0, COUNTIF($T$29:T43, ($O$30:$O$60)), 0)), INDEX(($P$30:$P$60), MATCH(0, COUNTIF($T$29:T43, ($P$30:$P$60)), 0))), \"\")","v":""},{"$f":"IFERROR(IFERROR(INDEX(($Q$30:$Q$60), MATCH(0, COUNTIF($U$29:U43, ($Q$30:$Q$60)), 0)), INDEX(($R$30:$R$60), MATCH(0, COUNTIF($U$29:U43, ($R$30:$R$60)), 0))), \"\")","v":""},{"$f":"IFERROR(IFERROR(INDEX(($S$30:$S$60), MATCH(0, COUNTIF($V$29:V43, ($S$30:$S$60)), 0)), INDEX(($T$30:$T$60), MATCH(0, COUNTIF($V$29:V43, ($T$30:$T$60)), 0))), \"\")","v":""},{"$f":"IFERROR(IFERROR(INDEX(($U$30:$U$60), MATCH(0, COUNTIF($W$29:W43, ($U$30:$U$60)), 0)), INDEX(($V$30:$V$60), MATCH(0, COUNTIF($W$29:W43, ($V$30:$V$60)), 0))), \"\")","v":"Member 30%"},{"$f":"IFERROR(INDEX((Data!$AT$33:$AX$82,Data!$AY$33:$BC$82,Data!$BD$33:$BH$82,Data!$BI$33:$BM$82,Data!$BN$33:$BR$82,Data!$BS$33:$BW$82,Data!$BX$33:$CB$82,Data!$CC$33:$CG$82,Data!$CH$33:$CL$82,Data!$CM$33:$CQ$82),$D44,2,CHOOSE(MATCH($Z$14,INDIRECT(\"Data!$AT$\"&$D44+32&\":$CM$\"&$D44+32),0),1,0,0,0,0,2,0,0,0,0,3,0,0,0,0,4,0,0,0,0,5,0,0,0,0,6,0,0,0,0,7,0,0,0,0,8,0,0,0,0,9,0,0,0,0,10)),\"\")","v":""},{"$f":"IFERROR(INDEX((Data!$AT$33:$AX$82,Data!$AY$33:$BC$82,Data!$BD$33:$BH$82,Data!$BI$33:$BM$82,Data!$BN$33:$BR$82,Data!$BS$33:$BW$82,Data!$BX$33:$CB$82,Data!$CC$33:$CG$82,Data!$CH$33:$CL$82,Data!$CM$33:$CQ$82),$D44,3,CHOOSE(MATCH($Z$14,INDIRECT(\"Data!$AT$\"&$D44+32&\":$CM$\"&$D44+32),0),1,0,0,0,0,2,0,0,0,0,3,0,0,0,0,4,0,0,0,0,5,0,0,0,0,6,0,0,0,0,7,0,0,0,0,8,0,0,0,0,9,0,0,0,0,10)),\"\")","v":""},{"$f":"IFERROR(INDEX((Data!$AT$33:$AX$82,Data!$AY$33:$BC$82,Data!$BD$33:$BH$82,Data!$BI$33:$BM$82,Data!$BN$33:$BR$82,Data!$BS$33:$BW$82,Data!$BX$33:$CB$82,Data!$CC$33:$CG$82,Data!$CH$33:$CL$82,Data!$CM$33:$CQ$82),$D44,4,CHOOSE(MATCH($Z$14,INDIRECT(\"Data!$AT$\"&$D44+32&\":$CM$\"&$D44+32),0),1,0,0,0,0,2,0,0,0,0,3,0,0,0,0,4,0,0,0,0,5,0,0,0,0,6,0,0,0,0,7,0,0,0,0,8,0,0,0,0,9,0,0,0,0,10)),\"\")","v":""},{"$f":"IFERROR(INDEX((Data!$AT$33:$AX$82,Data!$AY$33:$BC$82,Data!$BD$33:$BH$82,Data!$BI$33:$BM$82,Data!$BN$33:$BR$82,Data!$BS$33:$BW$82,Data!$BX$33:$CB$82,Data!$CC$33:$CG$82,Data!$CH$33:$CL$82,Data!$CM$33:$CQ$82),$D44,5,CHOOSE(MATCH($Z$14,INDIRECT(\"Data!$AT$\"&$D44+32&\":$CM$\"&$D44+32),0),1,0,0,0,0,2,0,0,0,0,3,0,0,0,0,4,0,0,0,0,5,0,0,0,0,6,0,0,0,0,7,0,0,0,0,8,0,0,0,0,9,0,0,0,0,10)),\"\")","v":""},0]
[null,{"$f":"'Report A'!$B47","v":"2014-07-16"},{"$f":"'Report A'!$C47","v":"Wednesday"},{"$f":"'Report A'!$D47","v":16},"K-Lunch","K-Dinner","4BP","Member 30%","Tiger 2+1","Heineken 3+1",0,0,0,0,{"$f":"IFERROR(IFERROR(INDEX(($E$30:$E$60), MATCH(0, COUNTIF($O$29:O44, ($E$30:$E$60)), 0)), INDEX(($F$30:$F$60), MATCH(0, COUNTIF($O$29:O44, ($F$30:$F$60)), 0))), \"\")","v":""},{"$f":"IFERROR(IFERROR(INDEX(($G$30:$G$60), MATCH(0, COUNTIF($P$29:P44, ($G$30:$G$60)), 0)), INDEX(($H$30:$H$60), MATCH(0, COUNTIF($P$29:P44, ($H$30:$H$60)), 0))), \"\")","v":""},{"$f":"IFERROR(IFERROR(INDEX(($I$30:$I$60), MATCH(0, COUNTIF($Q$29:Q44, ($I$30:$I$60)), 0)), INDEX(($J$30:$J$60), MATCH(0, COUNTIF($Q$29:Q44, ($J$30:$J$60)), 0))), \"\")","v":""},{"$f":"IFERROR(IFERROR(INDEX(($K$30:$K$60), MATCH(0, COUNTIF($R$29:R44, ($K$30:$K$60)), 0)), INDEX(($L$30:$L$60), MATCH(0, COUNTIF($R$29:R44, ($L$30:$L$60)), 0))), \"\")","v":""},{"$f":"IFERROR(IFERROR(INDEX(($M$30:$M$60), MATCH(0, COUNTIF($S$29:S44, ($M$30:$M$60)), 0)), INDEX(($N$30:$N$60), MATCH(0, COUNTIF($S$29:S44, ($N$30:$N$60)), 0))), \"\")","v":""},{"$f":"IFERROR(IFERROR(INDEX(($O$30:$O$60), MATCH(0, COUNTIF($T$29:T44, ($O$30:$O$60)), 0)), INDEX(($P$30:$P$60), MATCH(0, COUNTIF($T$29:T44, ($P$30:$P$60)), 0))), \"\")","v":""},{"$f":"IFERROR(IFERROR(INDEX(($Q$30:$Q$60), MATCH(0, COUNTIF($U$29:U44, ($Q$30:$Q$60)), 0)), INDEX(($R$30:$R$60), MATCH(0, COUNTIF($U$29:U44, ($R$30:$R$60)), 0))), \"\")","v":""},{"$f":"IFERROR(IFERROR(INDEX(($S$30:$S$60), MATCH(0, COUNTIF($V$29:V44, ($S$30:$S$60)), 0)), INDEX(($T$30:$T$60), MATCH(0, COUNTIF($V$29:V44, ($T$30:$T$60)), 0))), \"\")","v":""},{"$f":"IFERROR(IFERROR(INDEX(($U$30:$U$60), MATCH(0, COUNTIF($W$29:W44, ($U$30:$U$60)), 0)), INDEX(($V$30:$V$60), MATCH(0, COUNTIF($W$29:W44, ($V$30:$V$60)), 0))), \"\")","v":""},{"$f":"IFERROR(INDEX((Data!$AT$33:$AX$82,Data!$AY$33:$BC$82,Data!$BD$33:$BH$82,Data!$BI$33:$BM$82,Data!$BN$33:$BR$82,Data!$BS$33:$BW$82,Data!$BX$33:$CB$82,Data!$CC$33:$CG$82,Data!$CH$33:$CL$82,Data!$CM$33:$CQ$82),$D45,2,CHOOSE(MATCH($Z$14,INDIRECT(\"Data!$AT$\"&$D45+32&\":$CM$\"&$D45+32),0),1,0,0,0,0,2,0,0,0,0,3,0,0,0,0,4,0,0,0,0,5,0,0,0,0,6,0,0,0,0,7,0,0,0,0,8,0,0,0,0,9,0,0,0,0,10)),\"\")","v":""},{"$f":"IFERROR(INDEX((Data!$AT$33:$AX$82,Data!$AY$33:$BC$82,Data!$BD$33:$BH$82,Data!$BI$33:$BM$82,Data!$BN$33:$BR$82,Data!$BS$33:$BW$82,Data!$BX$33:$CB$82,Data!$CC$33:$CG$82,Data!$CH$33:$CL$82,Data!$CM$33:$CQ$82),$D45,3,CHOOSE(MATCH($Z$14,INDIRECT(\"Data!$AT$\"&$D45+32&\":$CM$\"&$D45+32),0),1,0,0,0,0,2,0,0,0,0,3,0,0,0,0,4,0,0,0,0,5,0,0,0,0,6,0,0,0,0,7,0,0,0,0,8,0,0,0,0,9,0,0,0,0,10)),\"\")","v":""},{"$f":"IFERROR(INDEX((Data!$AT$33:$AX$82,Data!$AY$33:$BC$82,Data!$BD$33:$BH$82,Data!$BI$33:$BM$82,Data!$BN$33:$BR$82,Data!$BS$33:$BW$82,Data!$BX$33:$CB$82,Data!$CC$33:$CG$82,Data!$CH$33:$CL$82,Data!$CM$33:$CQ$82),$D45,4,CHOOSE(MATCH($Z$14,INDIRECT(\"Data!$AT$\"&$D45+32&\":$CM$\"&$D45+32),0),1,0,0,0,0,2,0,0,0,0,3,0,0,0,0,4,0,0,0,0,5,0,0,0,0,6,0,0,0,0,7,0,0,0,0,8,0,0,0,0,9,0,0,0,0,10)),\"\")","v":""},{"$f":"IFERROR(INDEX((Data!$AT$33:$AX$82,Data!$AY$33:$BC$82,Data!$BD$33:$BH$82,Data!$BI$33:$BM$82,Data!$BN$33:$BR$82,Data!$BS$33:$BW$82,Data!$BX$33:$CB$82,Data!$CC$33:$CG$82,Data!$CH$33:$CL$82,Data!$CM$33:$CQ$82),$D45,5,CHOOSE(MATCH($Z$14,INDIRECT(\"Data!$AT$\"&$D45+32&\":$CM$\"&$D45+32),0),1,0,0,0,0,2,0,0,0,0,3,0,0,0,0,4,0,0,0,0,5,0,0,0,0,6,0,0,0,0,7,0,0,0,0,8,0,0,0,0,9,0,0,0,0,10)),\"\")","v":""},0]
[null,{"$f":"'Report A'!$B48","v":"2014-07-17"},{"$f":"'Report A'!$C48","v":"Thursday"},{"$f":"'Report A'!$D48","v":17},"K-Lunch","K-Dinner","4BP","Member 30%","Tiger 2+1","Heineken 3+1",0,0,0,0,{"$f":"IFERROR(IFERROR(INDEX(($E$30:$E$60), MATCH(0, COUNTIF($O$29:O45, ($E$30:$E$60)), 0)), INDEX(($F$30:$F$60), MATCH(0, COUNTIF($O$29:O45, ($F$30:$F$60)), 0))), \"\")","v":""},{"$f":"IFERROR(IFERROR(INDEX(($G$30:$G$60), MATCH(0, COUNTIF($P$29:P45, ($G$30:$G$60)), 0)), INDEX(($H$30:$H$60), MATCH(0, COUNTIF($P$29:P45, ($H$30:$H$60)), 0))), \"\")","v":""},{"$f":"IFERROR(IFERROR(INDEX(($I$30:$I$60), MATCH(0, COUNTIF($Q$29:Q45, ($I$30:$I$60)), 0)), INDEX(($J$30:$J$60), MATCH(0, COUNTIF($Q$29:Q45, ($J$30:$J$60)), 0))), \"\")","v":""},{"$f":"IFERROR(IFERROR(INDEX(($K$30:$K$60), MATCH(0, COUNTIF($R$29:R45, ($K$30:$K$60)), 0)), INDEX(($L$30:$L$60), MATCH(0, COUNTIF($R$29:R45, ($L$30:$L$60)), 0))), \"\")","v":""},{"$f":"IFERROR(IFERROR(INDEX(($M$30:$M$60), MATCH(0, COUNTIF($S$29:S45, ($M$30:$M$60)), 0)), INDEX(($N$30:$N$60), MATCH(0, COUNTIF($S$29:S45, ($N$30:$N$60)), 0))), \"\")","v":""},{"$f":"IFERROR(IFERROR(INDEX(($O$30:$O$60), MATCH(0, COUNTIF($T$29:T45, ($O$30:$O$60)), 0)), INDEX(($P$30:$P$60), MATCH(0, COUNTIF($T$29:T45, ($P$30:$P$60)), 0))), \"\")","v":""},{"$f":"IFERROR(IFERROR(INDEX(($Q$30:$Q$60), MATCH(0, COUNTIF($U$29:U45, ($Q$30:$Q$60)), 0)), INDEX(($R$30:$R$60), MATCH(0, COUNTIF($U$29:U45, ($R$30:$R$60)), 0))), \"\")","v":""},{"$f":"IFERROR(IFERROR(INDEX(($S$30:$S$60), MATCH(0, COUNTIF($V$29:V45, ($S$30:$S$60)), 0)), INDEX(($T$30:$T$60), MATCH(0, COUNTIF($V$29:V45, ($T$30:$T$60)), 0))), \"\")","v":""},{"$f":"IFERROR(IFERROR(INDEX(($U$30:$U$60), MATCH(0, COUNTIF($W$29:W45, ($U$30:$U$60)), 0)), INDEX(($V$30:$V$60), MATCH(0, COUNTIF($W$29:W45, ($V$30:$V$60)), 0))), \"\")","v":""},{"$f":"IFERROR(INDEX((Data!$AT$33:$AX$82,Data!$AY$33:$BC$82,Data!$BD$33:$BH$82,Data!$BI$33:$BM$82,Data!$BN$33:$BR$82,Data!$BS$33:$BW$82,Data!$BX$33:$CB$82,Data!$CC$33:$CG$82,Data!$CH$33:$CL$82,Data!$CM$33:$CQ$82),$D46,2,CHOOSE(MATCH($Z$14,INDIRECT(\"Data!$AT$\"&$D46+32&\":$CM$\"&$D46+32),0),1,0,0,0,0,2,0,0,0,0,3,0,0,0,0,4,0,0,0,0,5,0,0,0,0,6,0,0,0,0,7,0,0,0,0,8,0,0,0,0,9,0,0,0,0,10)),\"\")","v":""},{"$f":"IFERROR(INDEX((Data!$AT$33:$AX$82,Data!$AY$33:$BC$82,Data!$BD$33:$BH$82,Data!$BI$33:$BM$82,Data!$BN$33:$BR$82,Data!$BS$33:$BW$82,Data!$BX$33:$CB$82,Data!$CC$33:$CG$82,Data!$CH$33:$CL$82,Data!$CM$33:$CQ$82),$D46,3,CHOOSE(MATCH($Z$14,INDIRECT(\"Data!$AT$\"&$D46+32&\":$CM$\"&$D46+32),0),1,0,0,0,0,2,0,0,0,0,3,0,0,0,0,4,0,0,0,0,5,0,0,0,0,6,0,0,0,0,7,0,0,0,0,8,0,0,0,0,9,0,0,0,0,10)),\"\")","v":""},{"$f":"IFERROR(INDEX((Data!$AT$33:$AX$82,Data!$AY$33:$BC$82,Data!$BD$33:$BH$82,Data!$BI$33:$BM$82,Data!$BN$33:$BR$82,Data!$BS$33:$BW$82,Data!$BX$33:$CB$82,Data!$CC$33:$CG$82,Data!$CH$33:$CL$82,Data!$CM$33:$CQ$82),$D46,4,CHOOSE(MATCH($Z$14,INDIRECT(\"Data!$AT$\"&$D46+32&\":$CM$\"&$D46+32),0),1,0,0,0,0,2,0,0,0,0,3,0,0,0,0,4,0,0,0,0,5,0,0,0,0,6,0,0,0,0,7,0,0,0,0,8,0,0,0,0,9,0,0,0,0,10)),\"\")","v":""},{"$f":"IFERROR(INDEX((Data!$AT$33:$AX$82,Data!$AY$33:$BC$82,Data!$BD$33:$BH$82,Data!$BI$33:$BM$82,Data!$BN$33:$BR$82,Data!$BS$33:$BW$82,Data!$BX$33:$CB$82,Data!$CC$33:$CG$82,Data!$CH$33:$CL$82,Data!$CM$33:$CQ$82),$D46,5,CHOOSE(MATCH($Z$14,INDIRECT(\"Data!$AT$\"&$D46+32&\":$CM$\"&$D46+32),0),1,0,0,0,0,2,0,0,0,0,3,0,0,0,0,4,0,0,0,0,5,0,0,0,0,6,0,0,0,0,7,0,0,0,0,8,0,0,0,0,9,0,0,0,0,10)),\"\")","v":""},0]
[null,{"$f":"'Report A'!$B49","v":"2014-07-18"},{"$f":"'Report A'!$C49","v":"Friday"},{"$f":"'Report A'!$D49","v":18},"K-Lunch","K-Dinner","4BP","Member 30%","Tiger 2+1","Heineken 3+1",0,0,0,0,{"$f":"IFERROR(IFERROR(INDEX(($E$30:$E$60), MATCH(0, COUNTIF($O$29:O46, ($E$30:$E$60)), 0)), INDEX(($F$30:$F$60), MATCH(0, COUNTIF($O$29:O46, ($F$30:$F$60)), 0))), \"\")","v":""},{"$f":"IFERROR(IFERROR(INDEX(($G$30:$G$60), MATCH(0, COUNTIF($P$29:P46, ($G$30:$G$60)), 0)), INDEX(($H$30:$H$60), MATCH(0, COUNTIF($P$29:P46, ($H$30:$H$60)), 0))), \"\")","v":""},{"$f":"IFERROR(IFERROR(INDEX(($I$30:$I$60), MATCH(0, COUNTIF($Q$29:Q46, ($I$30:$I$60)), 0)), INDEX(($J$30:$J$60), MATCH(0, COUNTIF($Q$29:Q46, ($J$30:$J$60)), 0))), \"\")","v":""},{"$f":"IFERROR(IFERROR(INDEX(($K$30:$K$60), MATCH(0, COUNTIF($R$29:R46, ($K$30:$K$60)), 0)), INDEX(($L$30:$L$60), MATCH(0, COUNTIF($R$29:R46, ($L$30:$L$60)), 0))), \"\")","v":""},{"$f":"IFERROR(IFERROR(INDEX(($M$30:$M$60), MATCH(0, COUNTIF($S$29:S46, ($M$30:$M$60)), 0)), INDEX(($N$30:$N$60), MATCH(0, COUNTIF($S$29:S46, ($N$30:$N$60)), 0))), \"\")","v":""},{"$f":"IFERROR(IFERROR(INDEX(($O$30:$O$60), MATCH(0, COUNTIF($T$29:T46, ($O$30:$O$60)), 0)), INDEX(($P$30:$P$60), MATCH(0, COUNTIF($T$29:T46, ($P$30:$P$60)), 0))), \"\")","v":""},{"$f":"IFERROR(IFERROR(INDEX(($Q$30:$Q$60), MATCH(0, COUNTIF($U$29:U46, ($Q$30:$Q$60)), 0)), INDEX(($R$30:$R$60), MATCH(0, COUNTIF($U$29:U46, ($R$30:$R$60)), 0))), \"\")","v":""},{"$f":"IFERROR(IFERROR(INDEX(($S$30:$S$60), MATCH(0, COUNTIF($V$29:V46, ($S$30:$S$60)), 0)), INDEX(($T$30:$T$60), MATCH(0, COUNTIF($V$29:V46, ($T$30:$T$60)), 0))), \"\")","v":""},{"$f":"IFERROR(IFERROR(INDEX(($U$30:$U$60), MATCH(0, COUNTIF($W$29:W46, ($U$30:$U$60)), 0)), INDEX(($V$30:$V$60), MATCH(0, COUNTIF($W$29:W46, ($V$30:$V$60)), 0))), \"\")","v":""},{"$f":"IFERROR(INDEX((Data!$AT$33:$AX$82,Data!$AY$33:$BC$82,Data!$BD$33:$BH$82,Data!$BI$33:$BM$82,Data!$BN$33:$BR$82,Data!$BS$33:$BW$82,Data!$BX$33:$CB$82,Data!$CC$33:$CG$82,Data!$CH$33:$CL$82,Data!$CM$33:$CQ$82),$D47,2,CHOOSE(MATCH($Z$14,INDIRECT(\"Data!$AT$\"&$D47+32&\":$CM$\"&$D47+32),0),1,0,0,0,0,2,0,0,0,0,3,0,0,0,0,4,0,0,0,0,5,0,0,0,0,6,0,0,0,0,7,0,0,0,0,8,0,0,0,0,9,0,0,0,0,10)),\"\")","v":""},{"$f":"IFERROR(INDEX((Data!$AT$33:$AX$82,Data!$AY$33:$BC$82,Data!$BD$33:$BH$82,Data!$BI$33:$BM$82,Data!$BN$33:$BR$82,Data!$BS$33:$BW$82,Data!$BX$33:$CB$82,Data!$CC$33:$CG$82,Data!$CH$33:$CL$82,Data!$CM$33:$CQ$82),$D47,3,CHOOSE(MATCH($Z$14,INDIRECT(\"Data!$AT$\"&$D47+32&\":$CM$\"&$D47+32),0),1,0,0,0,0,2,0,0,0,0,3,0,0,0,0,4,0,0,0,0,5,0,0,0,0,6,0,0,0,0,7,0,0,0,0,8,0,0,0,0,9,0,0,0,0,10)),\"\")","v":""},{"$f":"IFERROR(INDEX((Data!$AT$33:$AX$82,Data!$AY$33:$BC$82,Data!$BD$33:$BH$82,Data!$BI$33:$BM$82,Data!$BN$33:$BR$82,Data!$BS$33:$BW$82,Data!$BX$33:$CB$82,Data!$CC$33:$CG$82,Data!$CH$33:$CL$82,Data!$CM$33:$CQ$82),$D47,4,CHOOSE(MATCH($Z$14,INDIRECT(\"Data!$AT$\"&$D47+32&\":$CM$\"&$D47+32),0),1,0,0,0,0,2,0,0,0,0,3,0,0,0,0,4,0,0,0,0,5,0,0,0,0,6,0,0,0,0,7,0,0,0,0,8,0,0,0,0,9,0,0,0,0,10)),\"\")","v":""},{"$f":"IFERROR(INDEX((Data!$AT$33:$AX$82,Data!$AY$33:$BC$82,Data!$BD$33:$BH$82,Data!$BI$33:$BM$82,Data!$BN$33:$BR$82,Data!$BS$33:$BW$82,Data!$BX$33:$CB$82,Data!$CC$33:$CG$82,Data!$CH$33:$CL$82,Data!$CM$33:$CQ$82),$D47,5,CHOOSE(MATCH($Z$14,INDIRECT(\"Data!$AT$\"&$D47+32&\":$CM$\"&$D47+32),0),1,0,0,0,0,2,0,0,0,0,3,0,0,0,0,4,0,0,0,0,5,0,0,0,0,6,0,0,0,0,7,0,0,0,0,8,0,0,0,0,9,0,0,0,0,10)),\"\")","v":""},0]
[null,{"$f":"'Report A'!$B50","v":"2014-07-19"},{"$f":"'Report A'!$C50","v":"Saturday"},{"$f":"'Report A'!$D50","v":19},"K-Lunch","K-Dinner","4BP","Member 30%","Tiger 2+1","Heineken 3+1","Opening Promo 60%","2 Bkt Tiger Rm 88",0,0,{"$f":"IFERROR(IFERROR(INDEX(($E$30:$E$60), MATCH(0, COUNTIF($O$29:O47, ($E$30:$E$60)), 0)), INDEX(($F$30:$F$60), MATCH(0, COUNTIF($O$29:O47, ($F$30:$F$60)), 0))), \"\")","v":""},{"$f":"IFERROR(IFERROR(INDEX(($G$30:$G$60), MATCH(0, COUNTIF($P$29:P47, ($G$30:$G$60)), 0)), INDEX(($H$30:$H$60), MATCH(0, COUNTIF($P$29:P47, ($H$30:$H$60)), 0))), \"\")","v":""},{"$f":"IFERROR(IFERROR(INDEX(($I$30:$I$60), MATCH(0, COUNTIF($Q$29:Q47, ($I$30:$I$60)), 0)), INDEX(($J$30:$J$60), MATCH(0, COUNTIF($Q$29:Q47, ($J$30:$J$60)), 0))), \"\")","v":""},{"$f":"IFERROR(IFERROR(INDEX(($K$30:$K$60), MATCH(0, COUNTIF($R$29:R47, ($K$30:$K$60)), 0)), INDEX(($L$30:$L$60), MATCH(0, COUNTIF($R$29:R47, ($L$30:$L$60)), 0))), \"\")","v":""},{"$f":"IFERROR(IFERROR(INDEX(($M$30:$M$60), MATCH(0, COUNTIF($S$29:S47, ($M$30:$M$60)), 0)), INDEX(($N$30:$N$60), MATCH(0, COUNTIF($S$29:S47, ($N$30:$N$60)), 0))), \"\")","v":""},{"$f":"IFERROR(IFERROR(INDEX(($O$30:$O$60), MATCH(0, COUNTIF($T$29:T47, ($O$30:$O$60)), 0)), INDEX(($P$30:$P$60), MATCH(0, COUNTIF($T$29:T47, ($P$30:$P$60)), 0))), \"\")","v":""},{"$f":"IFERROR(IFERROR(INDEX(($Q$30:$Q$60), MATCH(0, COUNTIF($U$29:U47, ($Q$30:$Q$60)), 0)), INDEX(($R$30:$R$60), MATCH(0, COUNTIF($U$29:U47, ($R$30:$R$60)), 0))), \"\")","v":""},{"$f":"IFERROR(IFERROR(INDEX(($S$30:$S$60), MATCH(0, COUNTIF($V$29:V47, ($S$30:$S$60)), 0)), INDEX(($T$30:$T$60), MATCH(0, COUNTIF($V$29:V47, ($T$30:$T$60)), 0))), \"\")","v":""},{"$f":"IFERROR(IFERROR(INDEX(($U$30:$U$60), MATCH(0, COUNTIF($W$29:W47, ($U$30:$U$60)), 0)), INDEX(($V$30:$V$60), MATCH(0, COUNTIF($W$29:W47, ($V$30:$V$60)), 0))), \"\")","v":""},{"$f":"IFERROR(INDEX((Data!$AT$33:$AX$82,Data!$AY$33:$BC$82,Data!$BD$33:$BH$82,Data!$BI$33:$BM$82,Data!$BN$33:$BR$82,Data!$BS$33:$BW$82,Data!$BX$33:$CB$82,Data!$CC$33:$CG$82,Data!$CH$33:$CL$82,Data!$CM$33:$CQ$82),$D48,2,CHOOSE(MATCH($Z$14,INDIRECT(\"Data!$AT$\"&$D48+32&\":$CM$\"&$D48+32),0),1,0,0,0,0,2,0,0,0,0,3,0,0,0,0,4,0,0,0,0,5,0,0,0,0,6,0,0,0,0,7,0,0,0,0,8,0,0,0,0,9,0,0,0,0,10)),\"\")","v":""},{"$f":"IFERROR(INDEX((Data!$AT$33:$AX$82,Data!$AY$33:$BC$82,Data!$BD$33:$BH$82,Data!$BI$33:$BM$82,Data!$BN$33:$BR$82,Data!$BS$33:$BW$82,Data!$BX$33:$CB$82,Data!$CC$33:$CG$82,Data!$CH$33:$CL$82,Data!$CM$33:$CQ$82),$D48,3,CHOOSE(MATCH($Z$14,INDIRECT(\"Data!$AT$\"&$D48+32&\":$CM$\"&$D48+32),0),1,0,0,0,0,2,0,0,0,0,3,0,0,0,0,4,0,0,0,0,5,0,0,0,0,6,0,0,0,0,7,0,0,0,0,8,0,0,0,0,9,0,0,0,0,10)),\"\")","v":""},{"$f":"IFERROR(INDEX((Data!$AT$33:$AX$82,Data!$AY$33:$BC$82,Data!$BD$33:$BH$82,Data!$BI$33:$BM$82,Data!$BN$33:$BR$82,Data!$BS$33:$BW$82,Data!$BX$33:$CB$82,Data!$CC$33:$CG$82,Data!$CH$33:$CL$82,Data!$CM$33:$CQ$82),$D48,4,CHOOSE(MATCH($Z$14,INDIRECT(\"Data!$AT$\"&$D48+32&\":$CM$\"&$D48+32),0),1,0,0,0,0,2,0,0,0,0,3,0,0,0,0,4,0,0,0,0,5,0,0,0,0,6,0,0,0,0,7,0,0,0,0,8,0,0,0,0,9,0,0,0,0,10)),\"\")","v":""},{"$f":"IFERROR(INDEX((Data!$AT$33:$AX$82,Data!$AY$33:$BC$82,Data!$BD$33:$BH$82,Data!$BI$33:$BM$82,Data!$BN$33:$BR$82,Data!$BS$33:$BW$82,Data!$BX$33:$CB$82,Data!$CC$33:$CG$82,Data!$CH$33:$CL$82,Data!$CM$33:$CQ$82),$D48,5,CHOOSE(MATCH($Z$14,INDIRECT(\"Data!$AT$\"&$D48+32&\":$CM$\"&$D48+32),0),1,0,0,0,0,2,0,0,0,0,3,0,0,0,0,4,0,0,0,0,5,0,0,0,0,6,0,0,0,0,7,0,0,0,0,8,0,0,0,0,9,0,0,0,0,10)),\"\")","v":""},0]
[null,{"$f":"'Report A'!$B51","v":"2014-07-20"},{"$f":"'Report A'!$C51","v":"Sunday"},{"$f":"'Report A'!$D51","v":20},"K-Lunch","K-Dinner","4BP","Member 30%","Tiger 2+1","Heineken 3+1","Opening Promo 60%","2 Bkt Tiger Rm 88",0,0,{"$f":"IFERROR(IFERROR(INDEX(($E$30:$E$60), MATCH(0, COUNTIF($O$29:O48, ($E$30:$E$60)), 0)), INDEX(($F$30:$F$60), MATCH(0, COUNTIF($O$29:O48, ($F$30:$F$60)), 0))), \"\")","v":""},{"$f":"IFERROR(IFERROR(INDEX(($G$30:$G$60), MATCH(0, COUNTIF($P$29:P48, ($G$30:$G$60)), 0)), INDEX(($H$30:$H$60), MATCH(0, COUNTIF($P$29:P48, ($H$30:$H$60)), 0))), \"\")","v":""},{"$f":"IFERROR(IFERROR(INDEX(($I$30:$I$60), MATCH(0, COUNTIF($Q$29:Q48, ($I$30:$I$60)), 0)), INDEX(($J$30:$J$60), MATCH(0, COUNTIF($Q$29:Q48, ($J$30:$J$60)), 0))), \"\")","v":""},{"$f":"IFERROR(IFERROR(INDEX(($K$30:$K$60), MATCH(0, COUNTIF($R$29:R48, ($K$30:$K$60)), 0)), INDEX(($L$30:$L$60), MATCH(0, COUNTIF($R$29:R48, ($L$30:$L$60)), 0))), \"\")","v":""},{"$f":"IFERROR(IFERROR(INDEX(($M$30:$M$60), MATCH(0, COUNTIF($S$29:S48, ($M$30:$M$60)), 0)), INDEX(($N$30:$N$60), MATCH(0, COUNTIF($S$29:S48, ($N$30:$N$60)), 0))), \"\")","v":""},{"$f":"IFERROR(IFERROR(INDEX(($O$30:$O$60), MATCH(0, COUNTIF($T$29:T48, ($O$30:$O$60)), 0)), INDEX(($P$30:$P$60), MATCH(0, COUNTIF($T$29:T48, ($P$30:$P$60)), 0))), \"\")","v":""},{"$f":"IFERROR(IFERROR(INDEX(($Q$30:$Q$60), MATCH(0, COUNTIF($U$29:U48, ($Q$30:$Q$60)), 0)), INDEX(($R$30:$R$60), MATCH(0, COUNTIF($U$29:U48, ($R$30:$R$60)), 0))), \"\")","v":""},{"$f":"IFERROR(IFERROR(INDEX(($S$30:$S$60), MATCH(0, COUNTIF($V$29:V48, ($S$30:$S$60)), 0)), INDEX(($T$30:$T$60), MATCH(0, COUNTIF($V$29:V48, ($T$30:$T$60)), 0))), \"\")","v":""},{"$f":"IFERROR(IFERROR(INDEX(($U$30:$U$60), MATCH(0, COUNTIF($W$29:W48, ($U$30:$U$60)), 0)), INDEX(($V$30:$V$60), MATCH(0, COUNTIF($W$29:W48, ($V$30:$V$60)), 0))), \"\")","v":""},{"$f":"IFERROR(INDEX((Data!$AT$33:$AX$82,Data!$AY$33:$BC$82,Data!$BD$33:$BH$82,Data!$BI$33:$BM$82,Data!$BN$33:$BR$82,Data!$BS$33:$BW$82,Data!$BX$33:$CB$82,Data!$CC$33:$CG$82,Data!$CH$33:$CL$82,Data!$CM$33:$CQ$82),$D49,2,CHOOSE(MATCH($Z$14,INDIRECT(\"Data!$AT$\"&$D49+32&\":$CM$\"&$D49+32),0),1,0,0,0,0,2,0,0,0,0,3,0,0,0,0,4,0,0,0,0,5,0,0,0,0,6,0,0,0,0,7,0,0,0,0,8,0,0,0,0,9,0,0,0,0,10)),\"\")","v":""},{"$f":"IFERROR(INDEX((Data!$AT$33:$AX$82,Data!$AY$33:$BC$82,Data!$BD$33:$BH$82,Data!$BI$33:$BM$82,Data!$BN$33:$BR$82,Data!$BS$33:$BW$82,Data!$BX$33:$CB$82,Data!$CC$33:$CG$82,Data!$CH$33:$CL$82,Data!$CM$33:$CQ$82),$D49,3,CHOOSE(MATCH($Z$14,INDIRECT(\"Data!$AT$\"&$D49+32&\":$CM$\"&$D49+32),0),1,0,0,0,0,2,0,0,0,0,3,0,0,0,0,4,0,0,0,0,5,0,0,0,0,6,0,0,0,0,7,0,0,0,0,8,0,0,0,0,9,0,0,0,0,10)),\"\")","v":""},{"$f":"IFERROR(INDEX((Data!$AT$33:$AX$82,Data!$AY$33:$BC$82,Data!$BD$33:$BH$82,Data!$BI$33:$BM$82,Data!$BN$33:$BR$82,Data!$BS$33:$BW$82,Data!$BX$33:$CB$82,Data!$CC$33:$CG$82,Data!$CH$33:$CL$82,Data!$CM$33:$CQ$82),$D49,4,CHOOSE(MATCH($Z$14,INDIRECT(\"Data!$AT$\"&$D49+32&\":$CM$\"&$D49+32),0),1,0,0,0,0,2,0,0,0,0,3,0,0,0,0,4,0,0,0,0,5,0,0,0,0,6,0,0,0,0,7,0,0,0,0,8,0,0,0,0,9,0,0,0,0,10)),\"\")","v":""},{"$f":"IFERROR(INDEX((Data!$AT$33:$AX$82,Data!$AY$33:$BC$82,Data!$BD$33:$BH$82,Data!$BI$33:$BM$82,Data!$BN$33:$BR$82,Data!$BS$33:$BW$82,Data!$BX$33:$CB$82,Data!$CC$33:$CG$82,Data!$CH$33:$CL$82,Data!$CM$33:$CQ$82),$D49,5,CHOOSE(MATCH($Z$14,INDIRECT(\"Data!$AT$\"&$D49+32&\":$CM$\"&$D49+32),0),1,0,0,0,0,2,0,0,0,0,3,0,0,0,0,4,0,0,0,0,5,0,0,0,0,6,0,0,0,0,7,0,0,0,0,8,0,0,0,0,9,0,0,0,0,10)),\"\")","v":""},0]
[null,{"$f":"'Report A'!$B52","v":"2014-07-21"},{"$f":"'Report A'!$C52","v":"Monday"},{"$f":"'Report A'!$D52","v":21},{"$f":"IFERROR(INDIRECT(\"Data!\"&E$17&$D50+32),\"\")","v":"K-Lunch"},"K-Dinner","4BP","Member 30%","Tiger 2+1","Heineken 3+1",0,0,0,0,{"$f":"IFERROR(IFERROR(INDEX(($E$30:$E$60), MATCH(0, COUNTIF($O$29:O49, ($E$30:$E$60)), 0)), INDEX(($F$30:$F$60), MATCH(0, COUNTIF($O$29:O49, ($F$30:$F$60)), 0))), \"\")","v":""},{"$f":"IFERROR(IFERROR(INDEX(($G$30:$G$60), MATCH(0, COUNTIF($P$29:P49, ($G$30:$G$60)), 0)), INDEX(($H$30:$H$60), MATCH(0, COUNTIF($P$29:P49, ($H$30:$H$60)), 0))), \"\")","v":""},{"$f":"IFERROR(IFERROR(INDEX(($I$30:$I$60), MATCH(0, COUNTIF($Q$29:Q49, ($I$30:$I$60)), 0)), INDEX(($J$30:$J$60), MATCH(0, COUNTIF($Q$29:Q49, ($J$30:$J$60)), 0))), \"\")","v":""},{"$f":"IFERROR(IFERROR(INDEX(($K$30:$K$60), MATCH(0, COUNTIF($R$29:R49, ($K$30:$K$60)), 0)), INDEX(($L$30:$L$60), MATCH(0, COUNTIF($R$29:R49, ($L$30:$L$60)), 0))), \"\")","v":""},{"$f":"IFERROR(IFERROR(INDEX(($M$30:$M$60), MATCH(0, COUNTIF($S$29:S49, ($M$30:$M$60)), 0)), INDEX(($N$30:$N$60), MATCH(0, COUNTIF($S$29:S49, ($N$30:$N$60)), 0))), \"\")","v":""},{"$f":"IFERROR(IFERROR(INDEX(($O$30:$O$60), MATCH(0, COUNTIF($T$29:T49, ($O$30:$O$60)), 0)), INDEX(($P$30:$P$60), MATCH(0, COUNTIF($T$29:T49, ($P$30:$P$60)), 0))), \"\")","v":""},{"$f":"IFERROR(IFERROR(INDEX(($Q$30:$Q$60), MATCH(0, COUNTIF($U$29:U49, ($Q$30:$Q$60)), 0)), INDEX(($R$30:$R$60), MATCH(0, COUNTIF($U$29:U49, ($R$30:$R$60)), 0))), \"\")","v":""},{"$f":"IFERROR(IFERROR(INDEX(($S$30:$S$60), MATCH(0, COUNTIF($V$29:V49, ($S$30:$S$60)), 0)), INDEX(($T$30:$T$60), MATCH(0, COUNTIF($V$29:V49, ($T$30:$T$60)), 0))), \"\")","v":""},{"$f":"IFERROR(IFERROR(INDEX(($U$30:$U$60), MATCH(0, COUNTIF($W$29:W49, ($U$30:$U$60)), 0)), INDEX(($V$30:$V$60), MATCH(0, COUNTIF($W$29:W49, ($V$30:$V$60)), 0))), \"\")","v":""},{"$f":"IFERROR(INDEX((Data!$AT$33:$AX$82,Data!$AY$33:$BC$82,Data!$BD$33:$BH$82,Data!$BI$33:$BM$82,Data!$BN$33:$BR$82,Data!$BS$33:$BW$82,Data!$BX$33:$CB$82,Data!$CC$33:$CG$82,Data!$CH$33:$CL$82,Data!$CM$33:$CQ$82),$D50,2,CHOOSE(MATCH($Z$14,INDIRECT(\"Data!$AT$\"&$D50+32&\":$CM$\"&$D50+32),0),1,0,0,0,0,2,0,0,0,0,3,0,0,0,0,4,0,0,0,0,5,0,0,0,0,6,0,0,0,0,7,0,0,0,0,8,0,0,0,0,9,0,0,0,0,10)),\"\")","v":""},{"$f":"IFERROR(INDEX((Data!$AT$33:$AX$82,Data!$AY$33:$BC$82,Data!$BD$33:$BH$82,Data!$BI$33:$BM$82,Data!$BN$33:$BR$82,Data!$BS$33:$BW$82,Data!$BX$33:$CB$82,Data!$CC$33:$CG$82,Data!$CH$33:$CL$82,Data!$CM$33:$CQ$82),$D50,3,CHOOSE(MATCH($Z$14,INDIRECT(\"Data!$AT$\"&$D50+32&\":$CM$\"&$D50+32),0),1,0,0,0,0,2,0,0,0,0,3,0,0,0,0,4,0,0,0,0,5,0,0,0,0,6,0,0,0,0,7,0,0,0,0,8,0,0,0,0,9,0,0,0,0,10)),\"\")","v":""},{"$f":"IFERROR(INDEX((Data!$AT$33:$AX$82,Data!$AY$33:$BC$82,Data!$BD$33:$BH$82,Data!$BI$33:$BM$82,Data!$BN$33:$BR$82,Data!$BS$33:$BW$82,Data!$BX$33:$CB$82,Data!$CC$33:$CG$82,Data!$CH$33:$CL$82,Data!$CM$33:$CQ$82),$D50,4,CHOOSE(MATCH($Z$14,INDIRECT(\"Data!$AT$\"&$D50+32&\":$CM$\"&$D50+32),0),1,0,0,0,0,2,0,0,0,0,3,0,0,0,0,4,0,0,0,0,5,0,0,0,0,6,0,0,0,0,7,0,0,0,0,8,0,0,0,0,9,0,0,0,0,10)),\"\")","v":""},{"$f":"IFERROR(INDEX((Data!$AT$33:$AX$82,Data!$AY$33:$BC$82,Data!$BD$33:$BH$82,Data!$BI$33:$BM$82,Data!$BN$33:$BR$82,Data!$BS$33:$BW$82,Data!$BX$33:$CB$82,Data!$CC$33:$CG$82,Data!$CH$33:$CL$82,Data!$CM$33:$CQ$82),$D50,5,CHOOSE(MATCH($Z$14,INDIRECT(\"Data!$AT$\"&$D50+32&\":$CM$\"&$D50+32),0),1,0,0,0,0,2,0,0,0,0,3,0,0,0,0,4,0,0,0,0,5,0,0,0,0,6,0,0,0,0,7,0,0,0,0,8,0,0,0,0,9,0,0,0,0,10)),\"\")","v":""},0]
[null,{"$f":"'Report A'!$B53","v":"2014-07-22"},{"$f":"'Report A'!$C53","v":"Tuesday"},{"$f":"'Report A'!$D53","v":22},"K-Lunch","K-Dinner","4BP","Member 30%","Tiger 2+1","Heineken 3+1",0,0,0,0,{"$f":"IFERROR(IFERROR(INDEX(($E$30:$E$60), MATCH(0, COUNTIF($O$29:O50, ($E$30:$E$60)), 0)), INDEX(($F$30:$F$60), MATCH(0, COUNTIF($O$29:O50, ($F$30:$F$60)), 0))), \"\")","v":""},{"$f":"IFERROR(IFERROR(INDEX(($G$30:$G$60), MATCH(0, COUNTIF($P$29:P50, ($G$30:$G$60)), 0)), INDEX(($H$30:$H$60), MATCH(0, COUNTIF($P$29:P50, ($H$30:$H$60)), 0))), \"\")","v":""},{"$f":"IFERROR(IFERROR(INDEX(($I$30:$I$60), MATCH(0, COUNTIF($Q$29:Q50, ($I$30:$I$60)), 0)), INDEX(($J$30:$J$60), MATCH(0, COUNTIF($Q$29:Q50, ($J$30:$J$60)), 0))), \"\")","v":""},{"$f":"IFERROR(IFERROR(INDEX(($K$30:$K$60), MATCH(0, COUNTIF($R$29:R50, ($K$30:$K$60)), 0)), INDEX(($L$30:$L$60), MATCH(0, COUNTIF($R$29:R50, ($L$30:$L$60)), 0))), \"\")","v":""},{"$f":"IFERROR(IFERROR(INDEX(($M$30:$M$60), MATCH(0, COUNTIF($S$29:S50, ($M$30:$M$60)), 0)), INDEX(($N$30:$N$60), MATCH(0, COUNTIF($S$29:S50, ($N$30:$N$60)), 0))), \"\")","v":""},{"$f":"IFERROR(IFERROR(INDEX(($O$30:$O$60), MATCH(0, COUNTIF($T$29:T50, ($O$30:$O$60)), 0)), INDEX(($P$30:$P$60), MATCH(0, COUNTIF($T$29:T50, ($P$30:$P$60)), 0))), \"\")","v":""},{"$f":"IFERROR(IFERROR(INDEX(($Q$30:$Q$60), MATCH(0, COUNTIF($U$29:U50, ($Q$30:$Q$60)), 0)), INDEX(($R$30:$R$60), MATCH(0, COUNTIF($U$29:U50, ($R$30:$R$60)), 0))), \"\")","v":""},{"$f":"IFERROR(IFERROR(INDEX(($S$30:$S$60), MATCH(0, COUNTIF($V$29:V50, ($S$30:$S$60)), 0)), INDEX(($T$30:$T$60), MATCH(0, COUNTIF($V$29:V50, ($T$30:$T$60)), 0))), \"\")","v":""},{"$f":"IFERROR(IFERROR(INDEX(($U$30:$U$60), MATCH(0, COUNTIF($W$29:W50, ($U$30:$U$60)), 0)), INDEX(($V$30:$V$60), MATCH(0, COUNTIF($W$29:W50, ($V$30:$V$60)), 0))), \"\")","v":""},{"$f":"IFERROR(INDEX((Data!$AT$33:$AX$82,Data!$AY$33:$BC$82,Data!$BD$33:$BH$82,Data!$BI$33:$BM$82,Data!$BN$33:$BR$82,Data!$BS$33:$BW$82,Data!$BX$33:$CB$82,Data!$CC$33:$CG$82,Data!$CH$33:$CL$82,Data!$CM$33:$CQ$82),$D51,2,CHOOSE(MATCH($Z$14,INDIRECT(\"Data!$AT$\"&$D51+32&\":$CM$\"&$D51+32),0),1,0,0,0,0,2,0,0,0,0,3,0,0,0,0,4,0,0,0,0,5,0,0,0,0,6,0,0,0,0,7,0,0,0,0,8,0,0,0,0,9,0,0,0,0,10)),\"\")","v":""},{"$f":"IFERROR(INDEX((Data!$AT$33:$AX$82,Data!$AY$33:$BC$82,Data!$BD$33:$BH$82,Data!$BI$33:$BM$82,Data!$BN$33:$BR$82,Data!$BS$33:$BW$82,Data!$BX$33:$CB$82,Data!$CC$33:$CG$82,Data!$CH$33:$CL$82,Data!$CM$33:$CQ$82),$D51,3,CHOOSE(MATCH($Z$14,INDIRECT(\"Data!$AT$\"&$D51+32&\":$CM$\"&$D51+32),0),1,0,0,0,0,2,0,0,0,0,3,0,0,0,0,4,0,0,0,0,5,0,0,0,0,6,0,0,0,0,7,0,0,0,0,8,0,0,0,0,9,0,0,0,0,10)),\"\")","v":""},{"$f":"IFERROR(INDEX((Data!$AT$33:$AX$82,Data!$AY$33:$BC$82,Data!$BD$33:$BH$82,Data!$BI$33:$BM$82,Data!$BN$33:$BR$82,Data!$BS$33:$BW$82,Data!$BX$33:$CB$82,Data!$CC$33:$CG$82,Data!$CH$33:$CL$82,Data!$CM$33:$CQ$82),$D51,4,CHOOSE(MATCH($Z$14,INDIRECT(\"Data!$AT$\"&$D51+32&\":$CM$\"&$D51+32),0),1,0,0,0,0,2,0,0,0,0,3,0,0,0,0,4,0,0,0,0,5,0,0,0,0,6,0,0,0,0,7,0,0,0,0,8,0,0,0,0,9,0,0,0,0,10)),\"\")","v":""},{"$f":"IFERROR(INDEX((Data!$AT$33:$AX$82,Data!$AY$33:$BC$82,Data!$BD$33:$BH$82,Data!$BI$33:$BM$82,Data!$BN$33:$BR$82,Data!$BS$33:$BW$82,Data!$BX$33:$CB$82,Data!$CC$33:$CG$82,Data!$CH$33:$CL$82,Data!$CM$33:$CQ$82),$D51,5,CHOOSE(MATCH($Z$14,INDIRECT(\"Data!$AT$\"&$D51+32&\":$CM$\"&$D51+32),0),1,0,0,0,0,2,0,0,0,0,3,0,0,0,0,4,0,0,0,0,5,0,0,0,0,6,0,0,0,0,7,0,0,0,0,8,0,0,0,0,9,0,0,0,0,10)),\"\")","v":""},0]
[null,{"$f":"'Report A'!$B54","v":"2014-07-23"},{"$f":"'Report A'!$C54","v":"Wednesday"},{"$f":"'Report A'!$D54","v":23},"K-Lunch","K-Dinner","4BP","Member 30%","Tiger 2+1","Heineken 3+1",0,0,0,0,{"$f":"IFERROR(IFERROR(INDEX(($E$30:$E$60), MATCH(0, COUNTIF($O$29:O51, ($E$30:$E$60)), 0)), INDEX(($F$30:$F$60), MATCH(0, COUNTIF($O$29:O51, ($F$30:$F$60)), 0))), \"\")","v":""},{"$f":"IFERROR(IFERROR(INDEX(($G$30:$G$60), MATCH(0, COUNTIF($P$29:P51, ($G$30:$G$60)), 0)), INDEX(($H$30:$H$60), MATCH(0, COUNTIF($P$29:P51, ($H$30:$H$60)), 0))), \"\")","v":""},{"$f":"IFERROR(IFERROR(INDEX(($I$30:$I$60), MATCH(0, COUNTIF($Q$29:Q51, ($I$30:$I$60)), 0)), INDEX(($J$30:$J$60), MATCH(0, COUNTIF($Q$29:Q51, ($J$30:$J$60)), 0))), \"\")","v":""},{"$f":"IFERROR(IFERROR(INDEX(($K$30:$K$60), MATCH(0, COUNTIF($R$29:R51, ($K$30:$K$60)), 0)), INDEX(($L$30:$L$60), MATCH(0, COUNTIF($R$29:R51, ($L$30:$L$60)), 0))), \"\")","v":""},{"$f":"IFERROR(IFERROR(INDEX(($M$30:$M$60), MATCH(0, COUNTIF($S$29:S51, ($M$30:$M$60)), 0)), INDEX(($N$30:$N$60), MATCH(0, COUNTIF($S$29:S51, ($N$30:$N$60)), 0))), \"\")","v":""},{"$f":"IFERROR(IFERROR(INDEX(($O$30:$O$60), MATCH(0, COUNTIF($T$29:T51, ($O$30:$O$60)), 0)), INDEX(($P$30:$P$60), MATCH(0, COUNTIF($T$29:T51, ($P$30:$P$60)), 0))), \"\")","v":""},{"$f":"IFERROR(IFERROR(INDEX(($Q$30:$Q$60), MATCH(0, COUNTIF($U$29:U51, ($Q$30:$Q$60)), 0)), INDEX(($R$30:$R$60), MATCH(0, COUNTIF($U$29:U51, ($R$30:$R$60)), 0))), \"\")","v":""},{"$f":"IFERROR(IFERROR(INDEX(($S$30:$S$60), MATCH(0, COUNTIF($V$29:V51, ($S$30:$S$60)), 0)), INDEX(($T$30:$T$60), MATCH(0, COUNTIF($V$29:V51, ($T$30:$T$60)), 0))), \"\")","v":""},{"$f":"IFERROR(IFERROR(INDEX(($U$30:$U$60), MATCH(0, COUNTIF($W$29:W51, ($U$30:$U$60)), 0)), INDEX(($V$30:$V$60), MATCH(0, COUNTIF($W$29:W51, ($V$30:$V$60)), 0))), \"\")","v":""},{"$f":"IFERROR(INDEX((Data!$AT$33:$AX$82,Data!$AY$33:$BC$82,Data!$BD$33:$BH$82,Data!$BI$33:$BM$82,Data!$BN$33:$BR$82,Data!$BS$33:$BW$82,Data!$BX$33:$CB$82,Data!$CC$33:$CG$82,Data!$CH$33:$CL$82,Data!$CM$33:$CQ$82),$D52,2,CHOOSE(MATCH($Z$14,INDIRECT(\"Data!$AT$\"&$D52+32&\":$CM$\"&$D52+32),0),1,0,0,0,0,2,0,0,0,0,3,0,0,0,0,4,0,0,0,0,5,0,0,0,0,6,0,0,0,0,7,0,0,0,0,8,0,0,0,0,9,0,0,0,0,10)),\"\")","v":""},{"$f":"IFERROR(INDEX((Data!$AT$33:$AX$82,Data!$AY$33:$BC$82,Data!$BD$33:$BH$82,Data!$BI$33:$BM$82,Data!$BN$33:$BR$82,Data!$BS$33:$BW$82,Data!$BX$33:$CB$82,Data!$CC$33:$CG$82,Data!$CH$33:$CL$82,Data!$CM$33:$CQ$82),$D52,3,CHOOSE(MATCH($Z$14,INDIRECT(\"Data!$AT$\"&$D52+32&\":$CM$\"&$D52+32),0),1,0,0,0,0,2,0,0,0,0,3,0,0,0,0,4,0,0,0,0,5,0,0,0,0,6,0,0,0,0,7,0,0,0,0,8,0,0,0,0,9,0,0,0,0,10)),\"\")","v":""},{"$f":"IFERROR(INDEX((Data!$AT$33:$AX$82,Data!$AY$33:$BC$82,Data!$BD$33:$BH$82,Data!$BI$33:$BM$82,Data!$BN$33:$BR$82,Data!$BS$33:$BW$82,Data!$BX$33:$CB$82,Data!$CC$33:$CG$82,Data!$CH$33:$CL$82,Data!$CM$33:$CQ$82),$D52,4,CHOOSE(MATCH($Z$14,INDIRECT(\"Data!$AT$\"&$D52+32&\":$CM$\"&$D52+32),0),1,0,0,0,0,2,0,0,0,0,3,0,0,0,0,4,0,0,0,0,5,0,0,0,0,6,0,0,0,0,7,0,0,0,0,8,0,0,0,0,9,0,0,0,0,10)),\"\")","v":""},{"$f":"IFERROR(INDEX((Data!$AT$33:$AX$82,Data!$AY$33:$BC$82,Data!$BD$33:$BH$82,Data!$BI$33:$BM$82,Data!$BN$33:$BR$82,Data!$BS$33:$BW$82,Data!$BX$33:$CB$82,Data!$CC$33:$CG$82,Data!$CH$33:$CL$82,Data!$CM$33:$CQ$82),$D52,5,CHOOSE(MATCH($Z$14,INDIRECT(\"Data!$AT$\"&$D52+32&\":$CM$\"&$D52+32),0),1,0,0,0,0,2,0,0,0,0,3,0,0,0,0,4,0,0,0,0,5,0,0,0,0,6,0,0,0,0,7,0,0,0,0,8,0,0,0,0,9,0,0,0,0,10)),\"\")","v":""},0]
[null,{"$f":"'Report A'!$B55","v":"2014-07-24"},{"$f":"'Report A'!$C55","v":"Thursday"},{"$f":"'Report A'!$D55","v":24},"K-Lunch","K-Dinner","4BP","Member 30%","Tiger 2+1","Heineken 3+1",0,0,0,0,{"$f":"IFERROR(IFERROR(INDEX(($E$30:$E$60), MATCH(0, COUNTIF($O$29:O52, ($E$30:$E$60)), 0)), INDEX(($F$30:$F$60), MATCH(0, COUNTIF($O$29:O52, ($F$30:$F$60)), 0))), \"\")","v":""},{"$f":"IFERROR(IFERROR(INDEX(($G$30:$G$60), MATCH(0, COUNTIF($P$29:P52, ($G$30:$G$60)), 0)), INDEX(($H$30:$H$60), MATCH(0, COUNTIF($P$29:P52, ($H$30:$H$60)), 0))), \"\")","v":""},{"$f":"IFERROR(IFERROR(INDEX(($I$30:$I$60), MATCH(0, COUNTIF($Q$29:Q52, ($I$30:$I$60)), 0)), INDEX(($J$30:$J$60), MATCH(0, COUNTIF($Q$29:Q52, ($J$30:$J$60)), 0))), \"\")","v":""},{"$f":"IFERROR(IFERROR(INDEX(($K$30:$K$60), MATCH(0, COUNTIF($R$29:R52, ($K$30:$K$60)), 0)), INDEX(($L$30:$L$60), MATCH(0, COUNTIF($R$29:R52, ($L$30:$L$60)), 0))), \"\")","v":""},{"$f":"IFERROR(IFERROR(INDEX(($M$30:$M$60), MATCH(0, COUNTIF($S$29:S52, ($M$30:$M$60)), 0)), INDEX(($N$30:$N$60), MATCH(0, COUNTIF($S$29:S52, ($N$30:$N$60)), 0))), \"\")","v":""},{"$f":"IFERROR(IFERROR(INDEX(($O$30:$O$60), MATCH(0, COUNTIF($T$29:T52, ($O$30:$O$60)), 0)), INDEX(($P$30:$P$60), MATCH(0, COUNTIF($T$29:T52, ($P$30:$P$60)), 0))), \"\")","v":""},{"$f":"IFERROR(IFERROR(INDEX(($Q$30:$Q$60), MATCH(0, COUNTIF($U$29:U52, ($Q$30:$Q$60)), 0)), INDEX(($R$30:$R$60), MATCH(0, COUNTIF($U$29:U52, ($R$30:$R$60)), 0))), \"\")","v":""},{"$f":"IFERROR(IFERROR(INDEX(($S$30:$S$60), MATCH(0, COUNTIF($V$29:V52, ($S$30:$S$60)), 0)), INDEX(($T$30:$T$60), MATCH(0, COUNTIF($V$29:V52, ($T$30:$T$60)), 0))), \"\")","v":""},{"$f":"IFERROR(IFERROR(INDEX(($U$30:$U$60), MATCH(0, COUNTIF($W$29:W52, ($U$30:$U$60)), 0)), INDEX(($V$30:$V$60), MATCH(0, COUNTIF($W$29:W52, ($V$30:$V$60)), 0))), \"\")","v":""},{"$f":"IFERROR(INDEX((Data!$AT$33:$AX$82,Data!$AY$33:$BC$82,Data!$BD$33:$BH$82,Data!$BI$33:$BM$82,Data!$BN$33:$BR$82,Data!$BS$33:$BW$82,Data!$BX$33:$CB$82,Data!$CC$33:$CG$82,Data!$CH$33:$CL$82,Data!$CM$33:$CQ$82),$D53,2,CHOOSE(MATCH($Z$14,INDIRECT(\"Data!$AT$\"&$D53+32&\":$CM$\"&$D53+32),0),1,0,0,0,0,2,0,0,0,0,3,0,0,0,0,4,0,0,0,0,5,0,0,0,0,6,0,0,0,0,7,0,0,0,0,8,0,0,0,0,9,0,0,0,0,10)),\"\")","v":""},{"$f":"IFERROR(INDEX((Data!$AT$33:$AX$82,Data!$AY$33:$BC$82,Data!$BD$33:$BH$82,Data!$BI$33:$BM$82,Data!$BN$33:$BR$82,Data!$BS$33:$BW$82,Data!$BX$33:$CB$82,Data!$CC$33:$CG$82,Data!$CH$33:$CL$82,Data!$CM$33:$CQ$82),$D53,3,CHOOSE(MATCH($Z$14,INDIRECT(\"Data!$AT$\"&$D53+32&\":$CM$\"&$D53+32),0),1,0,0,0,0,2,0,0,0,0,3,0,0,0,0,4,0,0,0,0,5,0,0,0,0,6,0,0,0,0,7,0,0,0,0,8,0,0,0,0,9,0,0,0,0,10)),\"\")","v":""},{"$f":"IFERROR(INDEX((Data!$AT$33:$AX$82,Data!$AY$33:$BC$82,Data!$BD$33:$BH$82,Data!$BI$33:$BM$82,Data!$BN$33:$BR$82,Data!$BS$33:$BW$82,Data!$BX$33:$CB$82,Data!$CC$33:$CG$82,Data!$CH$33:$CL$82,Data!$CM$33:$CQ$82),$D53,4,CHOOSE(MATCH($Z$14,INDIRECT(\"Data!$AT$\"&$D53+32&\":$CM$\"&$D53+32),0),1,0,0,0,0,2,0,0,0,0,3,0,0,0,0,4,0,0,0,0,5,0,0,0,0,6,0,0,0,0,7,0,0,0,0,8,0,0,0,0,9,0,0,0,0,10)),\"\")","v":""},{"$f":"IFERROR(INDEX((Data!$AT$33:$AX$82,Data!$AY$33:$BC$82,Data!$BD$33:$BH$82,Data!$BI$33:$BM$82,Data!$BN$33:$BR$82,Data!$BS$33:$BW$82,Data!$BX$33:$CB$82,Data!$CC$33:$CG$82,Data!$CH$33:$CL$82,Data!$CM$33:$CQ$82),$D53,5,CHOOSE(MATCH($Z$14,INDIRECT(\"Data!$AT$\"&$D53+32&\":$CM$\"&$D53+32),0),1,0,0,0,0,2,0,0,0,0,3,0,0,0,0,4,0,0,0,0,5,0,0,0,0,6,0,0,0,0,7,0,0,0,0,8,0,0,0,0,9,0,0,0,0,10)),\"\")","v":""},0]
[null,{"$f":"'Report A'!$B56","v":"2014-07-25"},{"$f":"'Report A'!$C56","v":"Friday"},{"$f":"'Report A'!$D56","v":25},"K-Lunch","K-Dinner","4BP","Member 30%","Tiger 2+1","Heineken 3+1",0,0,0,0,{"$f":"IFERROR(IFERROR(INDEX(($E$30:$E$60), MATCH(0, COUNTIF($O$29:O53, ($E$30:$E$60)), 0)), INDEX(($F$30:$F$60), MATCH(0, COUNTIF($O$29:O53, ($F$30:$F$60)), 0))), \"\")","v":""},{"$f":"IFERROR(IFERROR(INDEX(($G$30:$G$60), MATCH(0, COUNTIF($P$29:P53, ($G$30:$G$60)), 0)), INDEX(($H$30:$H$60), MATCH(0, COUNTIF($P$29:P53, ($H$30:$H$60)), 0))), \"\")","v":""},{"$f":"IFERROR(IFERROR(INDEX(($I$30:$I$60), MATCH(0, COUNTIF($Q$29:Q53, ($I$30:$I$60)), 0)), INDEX(($J$30:$J$60), MATCH(0, COUNTIF($Q$29:Q53, ($J$30:$J$60)), 0))), \"\")","v":""},{"$f":"IFERROR(IFERROR(INDEX(($K$30:$K$60), MATCH(0, COUNTIF($R$29:R53, ($K$30:$K$60)), 0)), INDEX(($L$30:$L$60), MATCH(0, COUNTIF($R$29:R53, ($L$30:$L$60)), 0))), \"\")","v":""},{"$f":"IFERROR(IFERROR(INDEX(($M$30:$M$60), MATCH(0, COUNTIF($S$29:S53, ($M$30:$M$60)), 0)), INDEX(($N$30:$N$60), MATCH(0, COUNTIF($S$29:S53, ($N$30:$N$60)), 0))), \"\")","v":""},{"$f":"IFERROR(IFERROR(INDEX(($O$30:$O$60), MATCH(0, COUNTIF($T$29:T53, ($O$30:$O$60)), 0)), INDEX(($P$30:$P$60), MATCH(0, COUNTIF($T$29:T53, ($P$30:$P$60)), 0))), \"\")","v":""},{"$f":"IFERROR(IFERROR(INDEX(($Q$30:$Q$60), MATCH(0, COUNTIF($U$29:U53, ($Q$30:$Q$60)), 0)), INDEX(($R$30:$R$60), MATCH(0, COUNTIF($U$29:U53, ($R$30:$R$60)), 0))), \"\")","v":""},{"$f":"IFERROR(IFERROR(INDEX(($S$30:$S$60), MATCH(0, COUNTIF($V$29:V53, ($S$30:$S$60)), 0)), INDEX(($T$30:$T$60), MATCH(0, COUNTIF($V$29:V53, ($T$30:$T$60)), 0))), \"\")","v":""},{"$f":"IFERROR(IFERROR(INDEX(($U$30:$U$60), MATCH(0, COUNTIF($W$29:W53, ($U$30:$U$60)), 0)), INDEX(($V$30:$V$60), MATCH(0, COUNTIF($W$29:W53, ($V$30:$V$60)), 0))), \"\")","v":""},{"$f":"IFERROR(INDEX((Data!$AT$33:$AX$82,Data!$AY$33:$BC$82,Data!$BD$33:$BH$82,Data!$BI$33:$BM$82,Data!$BN$33:$BR$82,Data!$BS$33:$BW$82,Data!$BX$33:$CB$82,Data!$CC$33:$CG$82,Data!$CH$33:$CL$82,Data!$CM$33:$CQ$82),$D54,2,CHOOSE(MATCH($Z$14,INDIRECT(\"Data!$AT$\"&$D54+32&\":$CM$\"&$D54+32),0),1,0,0,0,0,2,0,0,0,0,3,0,0,0,0,4,0,0,0,0,5,0,0,0,0,6,0,0,0,0,7,0,0,0,0,8,0,0,0,0,9,0,0,0,0,10)),\"\")","v":""},{"$f":"IFERROR(INDEX((Data!$AT$33:$AX$82,Data!$AY$33:$BC$82,Data!$BD$33:$BH$82,Data!$BI$33:$BM$82,Data!$BN$33:$BR$82,Data!$BS$33:$BW$82,Data!$BX$33:$CB$82,Data!$CC$33:$CG$82,Data!$CH$33:$CL$82,Data!$CM$33:$CQ$82),$D54,3,CHOOSE(MATCH($Z$14,INDIRECT(\"Data!$AT$\"&$D54+32&\":$CM$\"&$D54+32),0),1,0,0,0,0,2,0,0,0,0,3,0,0,0,0,4,0,0,0,0,5,0,0,0,0,6,0,0,0,0,7,0,0,0,0,8,0,0,0,0,9,0,0,0,0,10)),\"\")","v":""},{"$f":"IFERROR(INDEX((Data!$AT$33:$AX$82,Data!$AY$33:$BC$82,Data!$BD$33:$BH$82,Data!$BI$33:$BM$82,Data!$BN$33:$BR$82,Data!$BS$33:$BW$82,Data!$BX$33:$CB$82,Data!$CC$33:$CG$82,Data!$CH$33:$CL$82,Data!$CM$33:$CQ$82),$D54,4,CHOOSE(MATCH($Z$14,INDIRECT(\"Data!$AT$\"&$D54+32&\":$CM$\"&$D54+32),0),1,0,0,0,0,2,0,0,0,0,3,0,0,0,0,4,0,0,0,0,5,0,0,0,0,6,0,0,0,0,7,0,0,0,0,8,0,0,0,0,9,0,0,0,0,10)),\"\")","v":""},{"$f":"IFERROR(INDEX((Data!$AT$33:$AX$82,Data!$AY$33:$BC$82,Data!$BD$33:$BH$82,Data!$BI$33:$BM$82,Data!$BN$33:$BR$82,Data!$BS$33:$BW$82,Data!$BX$33:$CB$82,Data!$CC$33:$CG$82,Data!$CH$33:$CL$82,Data!$CM$33:$CQ$82),$D54,5,CHOOSE(MATCH($Z$14,INDIRECT(\"Data!$AT$\"&$D54+32&\":$CM$\"&$D54+32),0),1,0,0,0,0,2,0,0,0,0,3,0,0,0,0,4,0,0,0,0,5,0,0,0,0,6,0,0,0,0,7,0,0,0,0,8,0,0,0,0,9,0,0,0,0,10)),\"\")","v":""},0]
[null,{"$f":"'Report A'!$B57","v":"2014-07-26"},{"$f":"'Report A'!$C57","v":"Saturday"},{"$f":"'Report A'!$D57","v":26},"K-Lunch","K-Dinner","4BP","Member 30%","Tiger 2+1","Heineken 3+1",0,0,0,0,{"$f":"IFERROR(IFERROR(INDEX(($E$30:$E$60), MATCH(0, COUNTIF($O$29:O54, ($E$30:$E$60)), 0)), INDEX(($F$30:$F$60), MATCH(0, COUNTIF($O$29:O54, ($F$30:$F$60)), 0))), \"\")","v":""},{"$f":"IFERROR(IFERROR(INDEX(($G$30:$G$60), MATCH(0, COUNTIF($P$29:P54, ($G$30:$G$60)), 0)), INDEX(($H$30:$H$60), MATCH(0, COUNTIF($P$29:P54, ($H$30:$H$60)), 0))), \"\")","v":""},{"$f":"IFERROR(IFERROR(INDEX(($I$30:$I$60), MATCH(0, COUNTIF($Q$29:Q54, ($I$30:$I$60)), 0)), INDEX(($J$30:$J$60), MATCH(0, COUNTIF($Q$29:Q54, ($J$30:$J$60)), 0))), \"\")","v":""},{"$f":"IFERROR(IFERROR(INDEX(($K$30:$K$60), MATCH(0, COUNTIF($R$29:R54, ($K$30:$K$60)), 0)), INDEX(($L$30:$L$60), MATCH(0, COUNTIF($R$29:R54, ($L$30:$L$60)), 0))), \"\")","v":""},{"$f":"IFERROR(IFERROR(INDEX(($M$30:$M$60), MATCH(0, COUNTIF($S$29:S54, ($M$30:$M$60)), 0)), INDEX(($N$30:$N$60), MATCH(0, COUNTIF($S$29:S54, ($N$30:$N$60)), 0))), \"\")","v":""},{"$f":"IFERROR(IFERROR(INDEX(($O$30:$O$60), MATCH(0, COUNTIF($T$29:T54, ($O$30:$O$60)), 0)), INDEX(($P$30:$P$60), MATCH(0, COUNTIF($T$29:T54, ($P$30:$P$60)), 0))), \"\")","v":""},{"$f":"IFERROR(IFERROR(INDEX(($Q$30:$Q$60), MATCH(0, COUNTIF($U$29:U54, ($Q$30:$Q$60)), 0)), INDEX(($R$30:$R$60), MATCH(0, COUNTIF($U$29:U54, ($R$30:$R$60)), 0))), \"\")","v":""},{"$f":"IFERROR(IFERROR(INDEX(($S$30:$S$60), MATCH(0, COUNTIF($V$29:V54, ($S$30:$S$60)), 0)), INDEX(($T$30:$T$60), MATCH(0, COUNTIF($V$29:V54, ($T$30:$T$60)), 0))), \"\")","v":""},{"$f":"IFERROR(IFERROR(INDEX(($U$30:$U$60), MATCH(0, COUNTIF($W$29:W54, ($U$30:$U$60)), 0)), INDEX(($V$30:$V$60), MATCH(0, COUNTIF($W$29:W54, ($V$30:$V$60)), 0))), \"\")","v":""},{"$f":"IFERROR(INDEX((Data!$AT$33:$AX$82,Data!$AY$33:$BC$82,Data!$BD$33:$BH$82,Data!$BI$33:$BM$82,Data!$BN$33:$BR$82,Data!$BS$33:$BW$82,Data!$BX$33:$CB$82,Data!$CC$33:$CG$82,Data!$CH$33:$CL$82,Data!$CM$33:$CQ$82),$D55,2,CHOOSE(MATCH($Z$14,INDIRECT(\"Data!$AT$\"&$D55+32&\":$CM$\"&$D55+32),0),1,0,0,0,0,2,0,0,0,0,3,0,0,0,0,4,0,0,0,0,5,0,0,0,0,6,0,0,0,0,7,0,0,0,0,8,0,0,0,0,9,0,0,0,0,10)),\"\")","v":""},{"$f":"IFERROR(INDEX((Data!$AT$33:$AX$82,Data!$AY$33:$BC$82,Data!$BD$33:$BH$82,Data!$BI$33:$BM$82,Data!$BN$33:$BR$82,Data!$BS$33:$BW$82,Data!$BX$33:$CB$82,Data!$CC$33:$CG$82,Data!$CH$33:$CL$82,Data!$CM$33:$CQ$82),$D55,3,CHOOSE(MATCH($Z$14,INDIRECT(\"Data!$AT$\"&$D55+32&\":$CM$\"&$D55+32),0),1,0,0,0,0,2,0,0,0,0,3,0,0,0,0,4,0,0,0,0,5,0,0,0,0,6,0,0,0,0,7,0,0,0,0,8,0,0,0,0,9,0,0,0,0,10)),\"\")","v":""},{"$f":"IFERROR(INDEX((Data!$AT$33:$AX$82,Data!$AY$33:$BC$82,Data!$BD$33:$BH$82,Data!$BI$33:$BM$82,Data!$BN$33:$BR$82,Data!$BS$33:$BW$82,Data!$BX$33:$CB$82,Data!$CC$33:$CG$82,Data!$CH$33:$CL$82,Data!$CM$33:$CQ$82),$D55,4,CHOOSE(MATCH($Z$14,INDIRECT(\"Data!$AT$\"&$D55+32&\":$CM$\"&$D55+32),0),1,0,0,0,0,2,0,0,0,0,3,0,0,0,0,4,0,0,0,0,5,0,0,0,0,6,0,0,0,0,7,0,0,0,0,8,0,0,0,0,9,0,0,0,0,10)),\"\")","v":""},{"$f":"IFERROR(INDEX((Data!$AT$33:$AX$82,Data!$AY$33:$BC$82,Data!$BD$33:$BH$82,Data!$BI$33:$BM$82,Data!$BN$33:$BR$82,Data!$BS$33:$BW$82,Data!$BX$33:$CB$82,Data!$CC$33:$CG$82,Data!$CH$33:$CL$82,Data!$CM$33:$CQ$82),$D55,5,CHOOSE(MATCH($Z$14,INDIRECT(\"Data!$AT$\"&$D55+32&\":$CM$\"&$D55+32),0),1,0,0,0,0,2,0,0,0,0,3,0,0,0,0,4,0,0,0,0,5,0,0,0,0,6,0,0,0,0,7,0,0,0,0,8,0,0,0,0,9,0,0,0,0,10)),\"\")","v":""},0]
[null,{"$f":"'Report A'!$B58","v":"2014-07-27"},{"$f":"'Report A'!$C58","v":"Sunday"},{"$f":"'Report A'!$D58","v":27},"K-Lunch","K-Dinner","4BP","Member 30%","Tiger 2+1","Heineken 3+1","Opening Promo 60%","2 Bkt Tiger Rm 88",0,0,{"$f":"IFERROR(IFERROR(INDEX(($E$30:$E$60), MATCH(0, COUNTIF($O$29:O55, ($E$30:$E$60)), 0)), INDEX(($F$30:$F$60), MATCH(0, COUNTIF($O$29:O55, ($F$30:$F$60)), 0))), \"\")","v":""},{"$f":"IFERROR(IFERROR(INDEX(($G$30:$G$60), MATCH(0, COUNTIF($P$29:P55, ($G$30:$G$60)), 0)), INDEX(($H$30:$H$60), MATCH(0, COUNTIF($P$29:P55, ($H$30:$H$60)), 0))), \"\")","v":""},{"$f":"IFERROR(IFERROR(INDEX(($I$30:$I$60), MATCH(0, COUNTIF($Q$29:Q55, ($I$30:$I$60)), 0)), INDEX(($J$30:$J$60), MATCH(0, COUNTIF($Q$29:Q55, ($J$30:$J$60)), 0))), \"\")","v":""},{"$f":"IFERROR(IFERROR(INDEX(($K$30:$K$60), MATCH(0, COUNTIF($R$29:R55, ($K$30:$K$60)), 0)), INDEX(($L$30:$L$60), MATCH(0, COUNTIF($R$29:R55, ($L$30:$L$60)), 0))), \"\")","v":""},{"$f":"IFERROR(IFERROR(INDEX(($M$30:$M$60), MATCH(0, COUNTIF($S$29:S55, ($M$30:$M$60)), 0)), INDEX(($N$30:$N$60), MATCH(0, COUNTIF($S$29:S55, ($N$30:$N$60)), 0))), \"\")","v":""},{"$f":"IFERROR(IFERROR(INDEX(($O$30:$O$60), MATCH(0, COUNTIF($T$29:T55, ($O$30:$O$60)), 0)), INDEX(($P$30:$P$60), MATCH(0, COUNTIF($T$29:T55, ($P$30:$P$60)), 0))), \"\")","v":""},{"$f":"IFERROR(IFERROR(INDEX(($Q$30:$Q$60), MATCH(0, COUNTIF($U$29:U55, ($Q$30:$Q$60)), 0)), INDEX(($R$30:$R$60), MATCH(0, COUNTIF($U$29:U55, ($R$30:$R$60)), 0))), \"\")","v":""},{"$f":"IFERROR(IFERROR(INDEX(($S$30:$S$60), MATCH(0, COUNTIF($V$29:V55, ($S$30:$S$60)), 0)), INDEX(($T$30:$T$60), MATCH(0, COUNTIF($V$29:V55, ($T$30:$T$60)), 0))), \"\")","v":""},{"$f":"IFERROR(IFERROR(INDEX(($U$30:$U$60), MATCH(0, COUNTIF($W$29:W55, ($U$30:$U$60)), 0)), INDEX(($V$30:$V$60), MATCH(0, COUNTIF($W$29:W55, ($V$30:$V$60)), 0))), \"\")","v":""},{"$f":"IFERROR(INDEX((Data!$AT$33:$AX$82,Data!$AY$33:$BC$82,Data!$BD$33:$BH$82,Data!$BI$33:$BM$82,Data!$BN$33:$BR$82,Data!$BS$33:$BW$82,Data!$BX$33:$CB$82,Data!$CC$33:$CG$82,Data!$CH$33:$CL$82,Data!$CM$33:$CQ$82),$D56,2,CHOOSE(MATCH($Z$14,INDIRECT(\"Data!$AT$\"&$D56+32&\":$CM$\"&$D56+32),0),1,0,0,0,0,2,0,0,0,0,3,0,0,0,0,4,0,0,0,0,5,0,0,0,0,6,0,0,0,0,7,0,0,0,0,8,0,0,0,0,9,0,0,0,0,10)),\"\")","v":""},{"$f":"IFERROR(INDEX((Data!$AT$33:$AX$82,Data!$AY$33:$BC$82,Data!$BD$33:$BH$82,Data!$BI$33:$BM$82,Data!$BN$33:$BR$82,Data!$BS$33:$BW$82,Data!$BX$33:$CB$82,Data!$CC$33:$CG$82,Data!$CH$33:$CL$82,Data!$CM$33:$CQ$82),$D56,3,CHOOSE(MATCH($Z$14,INDIRECT(\"Data!$AT$\"&$D56+32&\":$CM$\"&$D56+32),0),1,0,0,0,0,2,0,0,0,0,3,0,0,0,0,4,0,0,0,0,5,0,0,0,0,6,0,0,0,0,7,0,0,0,0,8,0,0,0,0,9,0,0,0,0,10)),\"\")","v":""},{"$f":"IFERROR(INDEX((Data!$AT$33:$AX$82,Data!$AY$33:$BC$82,Data!$BD$33:$BH$82,Data!$BI$33:$BM$82,Data!$BN$33:$BR$82,Data!$BS$33:$BW$82,Data!$BX$33:$CB$82,Data!$CC$33:$CG$82,Data!$CH$33:$CL$82,Data!$CM$33:$CQ$82),$D56,4,CHOOSE(MATCH($Z$14,INDIRECT(\"Data!$AT$\"&$D56+32&\":$CM$\"&$D56+32),0),1,0,0,0,0,2,0,0,0,0,3,0,0,0,0,4,0,0,0,0,5,0,0,0,0,6,0,0,0,0,7,0,0,0,0,8,0,0,0,0,9,0,0,0,0,10)),\"\")","v":""},{"$f":"IFERROR(INDEX((Data!$AT$33:$AX$82,Data!$AY$33:$BC$82,Data!$BD$33:$BH$82,Data!$BI$33:$BM$82,Data!$BN$33:$BR$82,Data!$BS$33:$BW$82,Data!$BX$33:$CB$82,Data!$CC$33:$CG$82,Data!$CH$33:$CL$82,Data!$CM$33:$CQ$82),$D56,5,CHOOSE(MATCH($Z$14,INDIRECT(\"Data!$AT$\"&$D56+32&\":$CM$\"&$D56+32),0),1,0,0,0,0,2,0,0,0,0,3,0,0,0,0,4,0,0,0,0,5,0,0,0,0,6,0,0,0,0,7,0,0,0,0,8,0,0,0,0,9,0,0,0,0,10)),\"\")","v":""},0]
[null,{"$f":"'Report A'!$B59","v":"2014-07-28"},{"$f":"'Report A'!$C59","v":"Monday"},{"$f":"'Report A'!$D59","v":28},"K-Lunch","K-Dinner","4BP","Member 30%","Tiger 2+1","Heineken 3+1",0,0,0,0,{"$f":"IFERROR(IFERROR(INDEX(($E$30:$E$60), MATCH(0, COUNTIF($O$29:O56, ($E$30:$E$60)), 0)), INDEX(($F$30:$F$60), MATCH(0, COUNTIF($O$29:O56, ($F$30:$F$60)), 0))), \"\")","v":""},{"$f":"IFERROR(IFERROR(INDEX(($G$30:$G$60), MATCH(0, COUNTIF($P$29:P56, ($G$30:$G$60)), 0)), INDEX(($H$30:$H$60), MATCH(0, COUNTIF($P$29:P56, ($H$30:$H$60)), 0))), \"\")","v":""},{"$f":"IFERROR(IFERROR(INDEX(($I$30:$I$60), MATCH(0, COUNTIF($Q$29:Q56, ($I$30:$I$60)), 0)), INDEX(($J$30:$J$60), MATCH(0, COUNTIF($Q$29:Q56, ($J$30:$J$60)), 0))), \"\")","v":""},{"$f":"IFERROR(IFERROR(INDEX(($K$30:$K$60), MATCH(0, COUNTIF($R$29:R56, ($K$30:$K$60)), 0)), INDEX(($L$30:$L$60), MATCH(0, COUNTIF($R$29:R56, ($L$30:$L$60)), 0))), \"\")","v":""},{"$f":"IFERROR(IFERROR(INDEX(($M$30:$M$60), MATCH(0, COUNTIF($S$29:S56, ($M$30:$M$60)), 0)), INDEX(($N$30:$N$60), MATCH(0, COUNTIF($S$29:S56, ($N$30:$N$60)), 0))), \"\")","v":""},{"$f":"IFERROR(IFERROR(INDEX(($O$30:$O$60), MATCH(0, COUNTIF($T$29:T56, ($O$30:$O$60)), 0)), INDEX(($P$30:$P$60), MATCH(0, COUNTIF($T$29:T56, ($P$30:$P$60)), 0))), \"\")","v":""},{"$f":"IFERROR(IFERROR(INDEX(($Q$30:$Q$60), MATCH(0, COUNTIF($U$29:U56, ($Q$30:$Q$60)), 0)), INDEX(($R$30:$R$60), MATCH(0, COUNTIF($U$29:U56, ($R$30:$R$60)), 0))), \"\")","v":""},{"$f":"IFERROR(IFERROR(INDEX(($S$30:$S$60), MATCH(0, COUNTIF($V$29:V56, ($S$30:$S$60)), 0)), INDEX(($T$30:$T$60), MATCH(0, COUNTIF($V$29:V56, ($T$30:$T$60)), 0))), \"\")","v":""},{"$f":"IFERROR(IFERROR(INDEX(($U$30:$U$60), MATCH(0, COUNTIF($W$29:W56, ($U$30:$U$60)), 0)), INDEX(($V$30:$V$60), MATCH(0, COUNTIF($W$29:W56, ($V$30:$V$60)), 0))), \"\")","v":""},{"$f":"IFERROR(INDEX((Data!$AT$33:$AX$82,Data!$AY$33:$BC$82,Data!$BD$33:$BH$82,Data!$BI$33:$BM$82,Data!$BN$33:$BR$82,Data!$BS$33:$BW$82,Data!$BX$33:$CB$82,Data!$CC$33:$CG$82,Data!$CH$33:$CL$82,Data!$CM$33:$CQ$82),$D57,2,CHOOSE(MATCH($Z$14,INDIRECT(\"Data!$AT$\"&$D57+32&\":$CM$\"&$D57+32),0),1,0,0,0,0,2,0,0,0,0,3,0,0,0,0,4,0,0,0,0,5,0,0,0,0,6,0,0,0,0,7,0,0,0,0,8,0,0,0,0,9,0,0,0,0,10)),\"\")","v":""},{"$f":"IFERROR(INDEX((Data!$AT$33:$AX$82,Data!$AY$33:$BC$82,Data!$BD$33:$BH$82,Data!$BI$33:$BM$82,Data!$BN$33:$BR$82,Data!$BS$33:$BW$82,Data!$BX$33:$CB$82,Data!$CC$33:$CG$82,Data!$CH$33:$CL$82,Data!$CM$33:$CQ$82),$D57,3,CHOOSE(MATCH($Z$14,INDIRECT(\"Data!$AT$\"&$D57+32&\":$CM$\"&$D57+32),0),1,0,0,0,0,2,0,0,0,0,3,0,0,0,0,4,0,0,0,0,5,0,0,0,0,6,0,0,0,0,7,0,0,0,0,8,0,0,0,0,9,0,0,0,0,10)),\"\")","v":""},{"$f":"IFERROR(INDEX((Data!$AT$33:$AX$82,Data!$AY$33:$BC$82,Data!$BD$33:$BH$82,Data!$BI$33:$BM$82,Data!$BN$33:$BR$82,Data!$BS$33:$BW$82,Data!$BX$33:$CB$82,Data!$CC$33:$CG$82,Data!$CH$33:$CL$82,Data!$CM$33:$CQ$82),$D57,4,CHOOSE(MATCH($Z$14,INDIRECT(\"Data!$AT$\"&$D57+32&\":$CM$\"&$D57+32),0),1,0,0,0,0,2,0,0,0,0,3,0,0,0,0,4,0,0,0,0,5,0,0,0,0,6,0,0,0,0,7,0,0,0,0,8,0,0,0,0,9,0,0,0,0,10)),\"\")","v":""},{"$f":"IFERROR(INDEX((Data!$AT$33:$AX$82,Data!$AY$33:$BC$82,Data!$BD$33:$BH$82,Data!$BI$33:$BM$82,Data!$BN$33:$BR$82,Data!$BS$33:$BW$82,Data!$BX$33:$CB$82,Data!$CC$33:$CG$82,Data!$CH$33:$CL$82,Data!$CM$33:$CQ$82),$D57,5,CHOOSE(MATCH($Z$14,INDIRECT(\"Data!$AT$\"&$D57+32&\":$CM$\"&$D57+32),0),1,0,0,0,0,2,0,0,0,0,3,0,0,0,0,4,0,0,0,0,5,0,0,0,0,6,0,0,0,0,7,0,0,0,0,8,0,0,0,0,9,0,0,0,0,10)),\"\")","v":""},0]
[null,{"$f":"'Report A'!$B60","v":"2014-07-29"},{"$f":"'Report A'!$C60","v":"Tuesday"},{"$f":"'Report A'!$D60","v":29},"K-Lunch","K-Dinner","4BP","Member 30%","Tiger 2+1","Heineken 3+1",0,0,0,0,{"$f":"IFERROR(IFERROR(INDEX(($E$30:$E$60), MATCH(0, COUNTIF($O$29:O57, ($E$30:$E$60)), 0)), INDEX(($F$30:$F$60), MATCH(0, COUNTIF($O$29:O57, ($F$30:$F$60)), 0))), \"\")","v":""},{"$f":"IFERROR(IFERROR(INDEX(($G$30:$G$60), MATCH(0, COUNTIF($P$29:P57, ($G$30:$G$60)), 0)), INDEX(($H$30:$H$60), MATCH(0, COUNTIF($P$29:P57, ($H$30:$H$60)), 0))), \"\")","v":""},{"$f":"IFERROR(IFERROR(INDEX(($I$30:$I$60), MATCH(0, COUNTIF($Q$29:Q57, ($I$30:$I$60)), 0)), INDEX(($J$30:$J$60), MATCH(0, COUNTIF($Q$29:Q57, ($J$30:$J$60)), 0))), \"\")","v":""},{"$f":"IFERROR(IFERROR(INDEX(($K$30:$K$60), MATCH(0, COUNTIF($R$29:R57, ($K$30:$K$60)), 0)), INDEX(($L$30:$L$60), MATCH(0, COUNTIF($R$29:R57, ($L$30:$L$60)), 0))), \"\")","v":""},{"$f":"IFERROR(IFERROR(INDEX(($M$30:$M$60), MATCH(0, COUNTIF($S$29:S57, ($M$30:$M$60)), 0)), INDEX(($N$30:$N$60), MATCH(0, COUNTIF($S$29:S57, ($N$30:$N$60)), 0))), \"\")","v":""},{"$f":"IFERROR(IFERROR(INDEX(($O$30:$O$60), MATCH(0, COUNTIF($T$29:T57, ($O$30:$O$60)), 0)), INDEX(($P$30:$P$60), MATCH(0, COUNTIF($T$29:T57, ($P$30:$P$60)), 0))), \"\")","v":""},{"$f":"IFERROR(IFERROR(INDEX(($Q$30:$Q$60), MATCH(0, COUNTIF($U$29:U57, ($Q$30:$Q$60)), 0)), INDEX(($R$30:$R$60), MATCH(0, COUNTIF($U$29:U57, ($R$30:$R$60)), 0))), \"\")","v":""},{"$f":"IFERROR(IFERROR(INDEX(($S$30:$S$60), MATCH(0, COUNTIF($V$29:V57, ($S$30:$S$60)), 0)), INDEX(($T$30:$T$60), MATCH(0, COUNTIF($V$29:V57, ($T$30:$T$60)), 0))), \"\")","v":""},{"$f":"IFERROR(IFERROR(INDEX(($U$30:$U$60), MATCH(0, COUNTIF($W$29:W57, ($U$30:$U$60)), 0)), INDEX(($V$30:$V$60), MATCH(0, COUNTIF($W$29:W57, ($V$30:$V$60)), 0))), \"\")","v":""},{"$f":"IFERROR(INDEX((Data!$AT$33:$AX$82,Data!$AY$33:$BC$82,Data!$BD$33:$BH$82,Data!$BI$33:$BM$82,Data!$BN$33:$BR$82,Data!$BS$33:$BW$82,Data!$BX$33:$CB$82,Data!$CC$33:$CG$82,Data!$CH$33:$CL$82,Data!$CM$33:$CQ$82),$D58,2,CHOOSE(MATCH($Z$14,INDIRECT(\"Data!$AT$\"&$D58+32&\":$CM$\"&$D58+32),0),1,0,0,0,0,2,0,0,0,0,3,0,0,0,0,4,0,0,0,0,5,0,0,0,0,6,0,0,0,0,7,0,0,0,0,8,0,0,0,0,9,0,0,0,0,10)),\"\")","v":""},{"$f":"IFERROR(INDEX((Data!$AT$33:$AX$82,Data!$AY$33:$BC$82,Data!$BD$33:$BH$82,Data!$BI$33:$BM$82,Data!$BN$33:$BR$82,Data!$BS$33:$BW$82,Data!$BX$33:$CB$82,Data!$CC$33:$CG$82,Data!$CH$33:$CL$82,Data!$CM$33:$CQ$82),$D58,3,CHOOSE(MATCH($Z$14,INDIRECT(\"Data!$AT$\"&$D58+32&\":$CM$\"&$D58+32),0),1,0,0,0,0,2,0,0,0,0,3,0,0,0,0,4,0,0,0,0,5,0,0,0,0,6,0,0,0,0,7,0,0,0,0,8,0,0,0,0,9,0,0,0,0,10)),\"\")","v":""},{"$f":"IFERROR(INDEX((Data!$AT$33:$AX$82,Data!$AY$33:$BC$82,Data!$BD$33:$BH$82,Data!$BI$33:$BM$82,Data!$BN$33:$BR$82,Data!$BS$33:$BW$82,Data!$BX$33:$CB$82,Data!$CC$33:$CG$82,Data!$CH$33:$CL$82,Data!$CM$33:$CQ$82),$D58,4,CHOOSE(MATCH($Z$14,INDIRECT(\"Data!$AT$\"&$D58+32&\":$CM$\"&$D58+32),0),1,0,0,0,0,2,0,0,0,0,3,0,0,0,0,4,0,0,0,0,5,0,0,0,0,6,0,0,0,0,7,0,0,0,0,8,0,0,0,0,9,0,0,0,0,10)),\"\")","v":""},{"$f":"IFERROR(INDEX((Data!$AT$33:$AX$82,Data!$AY$33:$BC$82,Data!$BD$33:$BH$82,Data!$BI$33:$BM$82,Data!$BN$33:$BR$82,Data!$BS$33:$BW$82,Data!$BX$33:$CB$82,Data!$CC$33:$CG$82,Data!$CH$33:$CL$82,Data!$CM$33:$CQ$82),$D58,5,CHOOSE(MATCH($Z$14,INDIRECT(\"Data!$AT$\"&$D58+32&\":$CM$\"&$D58+32),0),1,0,0,0,0,2,0,0,0,0,3,0,0,0,0,4,0,0,0,0,5,0,0,0,0,6,0,0,0,0,7,0,0,0,0,8,0,0,0,0,9,0,0,0,0,10)),\"\")","v":""},0]
[null,{"$f":"'Report A'!$B61","v":"2014-07-30"},{"$f":"'Report A'!$C61","v":"Wednesday"},{"$f":"'Report A'!$D61","v":30},"K-Lunch","K-Dinner","4BP","Member 30%","Tiger 2+1","Heineken 3+1",0,0,0,0,{"$f":"IFERROR(IFERROR(INDEX(($E$30:$E$60), MATCH(0, COUNTIF($O$29:O58, ($E$30:$E$60)), 0)), INDEX(($F$30:$F$60), MATCH(0, COUNTIF($O$29:O58, ($F$30:$F$60)), 0))), \"\")","v":""},{"$f":"IFERROR(IFERROR(INDEX(($G$30:$G$60), MATCH(0, COUNTIF($P$29:P58, ($G$30:$G$60)), 0)), INDEX(($H$30:$H$60), MATCH(0, COUNTIF($P$29:P58, ($H$30:$H$60)), 0))), \"\")","v":""},{"$f":"IFERROR(IFERROR(INDEX(($I$30:$I$60), MATCH(0, COUNTIF($Q$29:Q58, ($I$30:$I$60)), 0)), INDEX(($J$30:$J$60), MATCH(0, COUNTIF($Q$29:Q58, ($J$30:$J$60)), 0))), \"\")","v":""},{"$f":"IFERROR(IFERROR(INDEX(($K$30:$K$60), MATCH(0, COUNTIF($R$29:R58, ($K$30:$K$60)), 0)), INDEX(($L$30:$L$60), MATCH(0, COUNTIF($R$29:R58, ($L$30:$L$60)), 0))), \"\")","v":""},{"$f":"IFERROR(IFERROR(INDEX(($M$30:$M$60), MATCH(0, COUNTIF($S$29:S58, ($M$30:$M$60)), 0)), INDEX(($N$30:$N$60), MATCH(0, COUNTIF($S$29:S58, ($N$30:$N$60)), 0))), \"\")","v":""},{"$f":"IFERROR(IFERROR(INDEX(($O$30:$O$60), MATCH(0, COUNTIF($T$29:T58, ($O$30:$O$60)), 0)), INDEX(($P$30:$P$60), MATCH(0, COUNTIF($T$29:T58, ($P$30:$P$60)), 0))), \"\")","v":""},{"$f":"IFERROR(IFERROR(INDEX(($Q$30:$Q$60), MATCH(0, COUNTIF($U$29:U58, ($Q$30:$Q$60)), 0)), INDEX(($R$30:$R$60), MATCH(0, COUNTIF($U$29:U58, ($R$30:$R$60)), 0))), \"\")","v":""},{"$f":"IFERROR(IFERROR(INDEX(($S$30:$S$60), MATCH(0, COUNTIF($V$29:V58, ($S$30:$S$60)), 0)), INDEX(($T$30:$T$60), MATCH(0, COUNTIF($V$29:V58, ($T$30:$T$60)), 0))), \"\")","v":""},{"$f":"IFERROR(IFERROR(INDEX(($U$30:$U$60), MATCH(0, COUNTIF($W$29:W58, ($U$30:$U$60)), 0)), INDEX(($V$30:$V$60), MATCH(0, COUNTIF($W$29:W58, ($V$30:$V$60)), 0))), \"\")","v":""},{"$f":"IFERROR(INDEX((Data!$AT$33:$AX$82,Data!$AY$33:$BC$82,Data!$BD$33:$BH$82,Data!$BI$33:$BM$82,Data!$BN$33:$BR$82,Data!$BS$33:$BW$82,Data!$BX$33:$CB$82,Data!$CC$33:$CG$82,Data!$CH$33:$CL$82,Data!$CM$33:$CQ$82),$D59,2,CHOOSE(MATCH($Z$14,INDIRECT(\"Data!$AT$\"&$D59+32&\":$CM$\"&$D59+32),0),1,0,0,0,0,2,0,0,0,0,3,0,0,0,0,4,0,0,0,0,5,0,0,0,0,6,0,0,0,0,7,0,0,0,0,8,0,0,0,0,9,0,0,0,0,10)),\"\")","v":""},{"$f":"IFERROR(INDEX((Data!$AT$33:$AX$82,Data!$AY$33:$BC$82,Data!$BD$33:$BH$82,Data!$BI$33:$BM$82,Data!$BN$33:$BR$82,Data!$BS$33:$BW$82,Data!$BX$33:$CB$82,Data!$CC$33:$CG$82,Data!$CH$33:$CL$82,Data!$CM$33:$CQ$82),$D59,3,CHOOSE(MATCH($Z$14,INDIRECT(\"Data!$AT$\"&$D59+32&\":$CM$\"&$D59+32),0),1,0,0,0,0,2,0,0,0,0,3,0,0,0,0,4,0,0,0,0,5,0,0,0,0,6,0,0,0,0,7,0,0,0,0,8,0,0,0,0,9,0,0,0,0,10)),\"\")","v":""},{"$f":"IFERROR(INDEX((Data!$AT$33:$AX$82,Data!$AY$33:$BC$82,Data!$BD$33:$BH$82,Data!$BI$33:$BM$82,Data!$BN$33:$BR$82,Data!$BS$33:$BW$82,Data!$BX$33:$CB$82,Data!$CC$33:$CG$82,Data!$CH$33:$CL$82,Data!$CM$33:$CQ$82),$D59,4,CHOOSE(MATCH($Z$14,INDIRECT(\"Data!$AT$\"&$D59+32&\":$CM$\"&$D59+32),0),1,0,0,0,0,2,0,0,0,0,3,0,0,0,0,4,0,0,0,0,5,0,0,0,0,6,0,0,0,0,7,0,0,0,0,8,0,0,0,0,9,0,0,0,0,10)),\"\")","v":""},{"$f":"IFERROR(INDEX((Data!$AT$33:$AX$82,Data!$AY$33:$BC$82,Data!$BD$33:$BH$82,Data!$BI$33:$BM$82,Data!$BN$33:$BR$82,Data!$BS$33:$BW$82,Data!$BX$33:$CB$82,Data!$CC$33:$CG$82,Data!$CH$33:$CL$82,Data!$CM$33:$CQ$82),$D59,5,CHOOSE(MATCH($Z$14,INDIRECT(\"Data!$AT$\"&$D59+32&\":$CM$\"&$D59+32),0),1,0,0,0,0,2,0,0,0,0,3,0,0,0,0,4,0,0,0,0,5,0,0,0,0,6,0,0,0,0,7,0,0,0,0,8,0,0,0,0,9,0,0,0,0,10)),\"\")","v":""},0]
[null,{"$f":"'Report A'!$B62","v":"2014-07-31"},{"$f":"'Report A'!$C62","v":"Thursday"},{"$f":"'Report A'!$D62","v":31},"K-Lunch","K-Dinner","4BP","Member 30%","Tiger 2+1","Heineken 3+1","Opening Promo 60%","2 Bkt Tiger Rm 88",0,0,{"$f":"IFERROR(IFERROR(INDEX(($E$30:$E$60), MATCH(0, COUNTIF($O$29:O59, ($E$30:$E$60)), 0)), INDEX(($F$30:$F$60), MATCH(0, COUNTIF($O$29:O59, ($F$30:$F$60)), 0))), \"\")","v":""},{"$f":"IFERROR(IFERROR(INDEX(($G$30:$G$60), MATCH(0, COUNTIF($P$29:P59, ($G$30:$G$60)), 0)), INDEX(($H$30:$H$60), MATCH(0, COUNTIF($P$29:P59, ($H$30:$H$60)), 0))), \"\")","v":""},{"$f":"IFERROR(IFERROR(INDEX(($I$30:$I$60), MATCH(0, COUNTIF($Q$29:Q59, ($I$30:$I$60)), 0)), INDEX(($J$30:$J$60), MATCH(0, COUNTIF($Q$29:Q59, ($J$30:$J$60)), 0))), \"\")","v":""},{"$f":"IFERROR(IFERROR(INDEX(($K$30:$K$60), MATCH(0, COUNTIF($R$29:R59, ($K$30:$K$60)), 0)), INDEX(($L$30:$L$60), MATCH(0, COUNTIF($R$29:R59, ($L$30:$L$60)), 0))), \"\")","v":""},{"$f":"IFERROR(IFERROR(INDEX(($M$30:$M$60), MATCH(0, COUNTIF($S$29:S59, ($M$30:$M$60)), 0)), INDEX(($N$30:$N$60), MATCH(0, COUNTIF($S$29:S59, ($N$30:$N$60)), 0))), \"\")","v":""},{"$f":"IFERROR(IFERROR(INDEX(($O$30:$O$60), MATCH(0, COUNTIF($T$29:T59, ($O$30:$O$60)), 0)), INDEX(($P$30:$P$60), MATCH(0, COUNTIF($T$29:T59, ($P$30:$P$60)), 0))), \"\")","v":""},{"$f":"IFERROR(IFERROR(INDEX(($Q$30:$Q$60), MATCH(0, COUNTIF($U$29:U59, ($Q$30:$Q$60)), 0)), INDEX(($R$30:$R$60), MATCH(0, COUNTIF($U$29:U59, ($R$30:$R$60)), 0))), \"\")","v":""},{"$f":"IFERROR(IFERROR(INDEX(($S$30:$S$60), MATCH(0, COUNTIF($V$29:V59, ($S$30:$S$60)), 0)), INDEX(($T$30:$T$60), MATCH(0, COUNTIF($V$29:V59, ($T$30:$T$60)), 0))), \"\")","v":""},{"$f":"IFERROR(IFERROR(INDEX(($U$30:$U$60), MATCH(0, COUNTIF($W$29:W59, ($U$30:$U$60)), 0)), INDEX(($V$30:$V$60), MATCH(0, COUNTIF($W$29:W59, ($V$30:$V$60)), 0))), \"\")","v":""},{"$f":"IFERROR(INDEX((Data!$AT$33:$AX$82,Data!$AY$33:$BC$82,Data!$BD$33:$BH$82,Data!$BI$33:$BM$82,Data!$BN$33:$BR$82,Data!$BS$33:$BW$82,Data!$BX$33:$CB$82,Data!$CC$33:$CG$82,Data!$CH$33:$CL$82,Data!$CM$33:$CQ$82),$D60,2,CHOOSE(MATCH($Z$14,INDIRECT(\"Data!$AT$\"&$D60+32&\":$CM$\"&$D60+32),0),1,0,0,0,0,2,0,0,0,0,3,0,0,0,0,4,0,0,0,0,5,0,0,0,0,6,0,0,0,0,7,0,0,0,0,8,0,0,0,0,9,0,0,0,0,10)),\"\")","v":""},{"$f":"IFERROR(INDEX((Data!$AT$33:$AX$82,Data!$AY$33:$BC$82,Data!$BD$33:$BH$82,Data!$BI$33:$BM$82,Data!$BN$33:$BR$82,Data!$BS$33:$BW$82,Data!$BX$33:$CB$82,Data!$CC$33:$CG$82,Data!$CH$33:$CL$82,Data!$CM$33:$CQ$82),$D60,3,CHOOSE(MATCH($Z$14,INDIRECT(\"Data!$AT$\"&$D60+32&\":$CM$\"&$D60+32),0),1,0,0,0,0,2,0,0,0,0,3,0,0,0,0,4,0,0,0,0,5,0,0,0,0,6,0,0,0,0,7,0,0,0,0,8,0,0,0,0,9,0,0,0,0,10)),\"\")","v":""},{"$f":"IFERROR(INDEX((Data!$AT$33:$AX$82,Data!$AY$33:$BC$82,Data!$BD$33:$BH$82,Data!$BI$33:$BM$82,Data!$BN$33:$BR$82,Data!$BS$33:$BW$82,Data!$BX$33:$CB$82,Data!$CC$33:$CG$82,Data!$CH$33:$CL$82,Data!$CM$33:$CQ$82),$D60,4,CHOOSE(MATCH($Z$14,INDIRECT(\"Data!$AT$\"&$D60+32&\":$CM$\"&$D60+32),0),1,0,0,0,0,2,0,0,0,0,3,0,0,0,0,4,0,0,0,0,5,0,0,0,0,6,0,0,0,0,7,0,0,0,0,8,0,0,0,0,9,0,0,0,0,10)),\"\")","v":""},{"$f":"IFERROR(INDEX((Data!$AT$33:$AX$82,Data!$AY$33:$BC$82,Data!$BD$33:$BH$82,Data!$BI$33:$BM$82,Data!$BN$33:$BR$82,Data!$BS$33:$BW$82,Data!$BX$33:$CB$82,Data!$CC$33:$CG$82,Data!$CH$33:$CL$82,Data!$CM$33:$CQ$82),$D60,5,CHOOSE(MATCH($Z$14,INDIRECT(\"Data!$AT$\"&$D60+32&\":$CM$\"&$D60+32),0),1,0,0,0,0,2,0,0,0,0,3,0,0,0,0,4,0,0,0,0,5,0,0,0,0,6,0,0,0,0,7,0,0,0,0,8,0,0,0,0,9,0,0,0,0,10)),\"\")","v":""},0]

{"sheet":"Report F","index":7,"n_rows":60,"n_cols":10,"rows_kept":60,"cut":false,"hidden":false,"merged":[]}
[]
[]
[null,null,"MONTHLY SALES REPORTING BY OUTLET"]
[]
[]
[null,"SUBJECT","REPORT F : PERFORMANCE OF F&B SALES AND MEMBERSHIP SUBSCRIPTIONS"]
[]
[null,"OUTLET",{"$f":"Data!$C$8","v":"SBA"}]
[]
[null,"MONTH / YEAR",{"$f":"Data!$C$10","v":"July 2014"}]
[]
[null,"MENU"]
[]
[null,"DATE","DAY","ROW","CHOOSE CATEGORY",null,"BEER EXCHANGE",null,null,{"$f":"\"CHART : SALES PERFORMANCE OF \"&$G$14","v":"CHART : SALES PERFORMANCE OF BEER EXCHANGE"}]
[]
[null,null,null,null,"NOON K","HAPPY","NORMAL","MIDNIGHT","ALL"]
[null,null,null,null,{"$f":"IF(OR($G$14=\"BEER EXCHANGE\",$G$14=\"BEER PACKAGE\",$G$14=\"BEER SIDE ORDER\",$G$14=\"LIQUOR PACKAGE\",$G$14=\"LIQUOR SIDE ORDER\",$G$14=\"WINE\"),\"( bottle )\",IF($G$14=\"MEAL\",\"( set )\",\"( subsription )\"))","v":"( bottle )"},{"$f":"$E$17","v":"( bottle )"},{"$f":"$E$17","v":"( bottle )"},"( bottle )","( bottle )"]
[null,"SUMMARY FOR MONTH",null,null,null,null,null,null,null,"LEGEND"]
[null,{"$f":"\"TOTAL \"&IF($G$14=\"MEMBERSHIP\",\"SUBSCRIPTIONS\",\"SALES\")","v":"TOTAL SALES"},null,null,{"$f":"SUM(E$30:E$60)","v":0},{"$f":"SUM(F$30:F$60)","v":0},0,0,0]
[null,{"$f":"\"AVERAGE \"&IF($G$14=\"MEMBERSHIP\",\"SUBSCRIPTIONS\",\"SALES\")","v":"AVERAGE SALES"},null,null,{"$f":"IFERROR(SUM(E$30:E$60)/COUNTIF($D$30:$D$60,\">0\"),\"\")","v":0},{"$f":"IFERROR(SUM(F$30:F$60)/COUNTIF($D$30:$D$60,\">0\"),\"\")","v":0},0,0,0]
[null,{"$f":"\"HIGHEST \"&IF($G$14=\"MEMBERSHIP\",\"SUBSCRIPTIONS\",\"SALES\")","v":"HIGHEST SALES"},null,null,{"$f":"IFERROR(IF(LARGE(E$30:E$60,1)>0,LARGE(E$30:E$60,1),\"NIL\"),\"NIL\")","v":"NIL"},{"$f":"IFERROR(IF(LARGE(F$30:F$60,1)>0,LARGE(F$30:F$60,1),\"NIL\"),\"NIL\")","v":"NIL"},"NIL","NIL","NIL"]
[null,{"$f":"\"LOWEST \"&IF($G$14=\"MEMBERSHIP\",\"SUBSCRIPTIONS\",\"SALES\")","v":"LOWEST SALES"},null,null,{"$f":"IFERROR(IF(LARGE(E$30:E$60,COUNTIF(E$30:E$60,\">0\"))<>E$21,LARGE(E$30:E$60,COUNTIF(E$30:E$60,\">0\")),\"NIL\"),\"NIL\")","v":"NIL"},{"$f":"IFERROR(IF(LARGE(F$30:F$60,COUNTIF(F$30:F$60,\">0\"))<>F$21,LARGE(F$30:F$60,COUNTIF(F$30:F$60,\">0\")),\"NIL\"),\"NIL\")","v":"NIL"},{"$f":"IFERROR(IF(LARGE(G$30:G$60,COUNTIF(G$30:G$60,\">0\"))<>G$21,LARGE(G$30:G$60,COUNTIF(G$30:G$60,\">0\")),\"NIL\"),\"NIL\")","v":"NIL"},{"$f":"IFERROR(IF(LARGE(H$30:H$60,COUNTIF(H$30:H$60,\">0\"))<>H$21,LARGE(H$30:H$60,COUNTIF(H$30:H$60,\">0\")),\"NIL\"),\"NIL\")","v":"NIL"},{"$f":"IFERROR(IF(LARGE(I$30:I$60,COUNTIF(I$30:I$60,\">0\"))<>I$21,LARGE(I$30:I$60,COUNTIF(I$30:I$60,\">0\")),\"NIL\"),\"NIL\")","v":"NIL"}]
[null,"AVERAGE FOR ","MONDAY",null,{"$f":"IFERROR(SUMIF($C$30:$C$60,\"Monday*\",E$30:E$60)/COUNTIF($C$30:$C$60,\"Monday*\"),\"\")","v":0},{"$f":"IFERROR(SUMIF($C$30:$C$60,\"Monday*\",F$30:F$60)/COUNTIF($C$30:$C$60,\"Monday*\"),\"\")","v":0},0,0,0]
[null,null,"TUESDAY",null,{"$f":"IFERROR(SUMIF($C$30:$C$60,\"Tuesday*\",E$30:E$60)/COUNTIF($C$30:$C$60,\"Tuesday*\"),\"\")","v":0},{"$f":"IFERROR(SUMIF($C$30:$C$60,\"Tuesday*\",F$30:F$60)/COUNTIF($C$30:$C$60,\"Tuesday*\"),\"\")","v":0},0,0,0]
[null,null,"WEDNESDAY",null,{"$f":"IFERROR(SUMIF($C$30:$C$60,\"Wednesday*\",E$30:E$60)/COUNTIF($C$30:$C$60,\"Wednesday*\"),\"\")","v":0},{"$f":"IFERROR(SUMIF($C$30:$C$60,\"Wednesday*\",F$30:F$60)/COUNTIF($C$30:$C$60,\"Wednesday*\"),\"\")","v":0},0,0,0]
[null,null,"THURSDAY",null,{"$f":"IFERROR(SUMIF($C$30:$C$60,\"Thursday*\",E$30:E$60)/COUNTIF($C$30:$C$60,\"Thursday*\"),\"\")","v":0},{"$f":"IFERROR(SUMIF($C$30:$C$60,\"Thursday*\",F$30:F$60)/COUNTIF($C$30:$C$60,\"Thursday*\"),\"\")","v":0},0,0,0]
[null,null,"FRIDAY",null,{"$f":"IFERROR(SUMIF($C$30:$C$60,\"Friday*\",E$30:E$60)/COUNTIF($C$30:$C$60,\"Friday*\"),\"\")","v":0},{"$f":"IFERROR(SUMIF($C$30:$C$60,\"Friday*\",F$30:F$60)/COUNTIF($C$30:$C$60,\"Friday*\"),\"\")","v":0},0,0,0]
[null,null,"SATURDAY",null,{"$f":"IFERROR(SUMIF($C$30:$C$60,\"Saturday*\",E$30:E$60)/COUNTIF($C$30:$C$60,\"Saturday*\"),\"\")","v":0},{"$f":"IFERROR(SUMIF($C$30:$C$60,\"Saturday*\",F$30:F$60)/COUNTIF($C$30:$C$60,\"Saturday*\"),\"\")","v":0},0,0,0]
[null,null,"SUNDAY",null,{"$f":"IFERROR(SUMIF($C$30:$C$60,\"Sunday*\",E$30:E$60)/COUNTIF($C$30:$C$60,\"Sunday*\"),\"\")","v":0},{"$f":"IFERROR(SUMIF($C$30:$C$60,\"Sunday*\",F$30:F$60)/COUNTIF($C$30:$C$60,\"Sunday*\"),\"\")","v":0},0,0,0]
[null,{"$f":"'Report A'!$B32","v":"2014-07-01"},{"$f":"'Report A'!$C32","v":"Tuesday"},{"$f":"'Report A'!$D32","v":1},{"$f":"IFERROR(IF($G$14=\"BEER EXCHANGE\",INDEX(Data!$DD$33:$DG$82,$D30,1),IF($G$14=\"BEER PACKAGE\",INDEX(Data!$CZ$33:$DC$82,$D30,1),IF($G$14=\"BEER SIDE ORDER\",(INDEX(Data!$DH$33:$DK$82,$D30,1)+INDEX(Data!$DL$33:$DO$82,$D30,1)+INDEX(Data!$DP$33:$DS$82,$D30,1)),IF($G$14=\"LIQUOR PACKAGE\",INDEX(Data!$DT$33:$DW$82,$D30,1),IF($G$14=\"LIQUOR SIDE ORDER\",INDEX(Data!$DX$33:$EA$82,$D30,1),IF($G$14=\"MEAL\",INDEX(Data!$CR$33:$CU$82,$D30,1),IF($G$14=\"MEMBERSHIP\",INDEX(Data!$CV$33:$CY$82,$D30,1),IF($G$14=\"WINE\",INDEX(Data!$EB$33:$EE$82,$D30,1),\"\")))))))),\"\")","v":0},{"$f":"IFERROR(IF($G$14=\"BEER EXCHANGE\",INDEX(Data!$DD$33:$DG$82,$D30,2),IF($G$14=\"BEER PACKAGE\",INDEX(Data!$CZ$33:$DC$82,$D30,2),IF($G$14=\"BEER SIDE ORDER\",(INDEX(Data!$DH$33:$DK$82,$D30,2)+INDEX(Data!$DL$33:$DO$82,$D30,2)+INDEX(Data!$DP$33:$DS$82,$D30,2)),IF($G$14=\"LIQUOR PACKAGE\",INDEX(Data!$DT$33:$DW$82,$D30,2),IF($G$14=\"LIQUOR SIDE ORDER\",INDEX(Data!$DX$33:$EA$82,$D30,2),IF($G$14=\"MEAL\",INDEX(Data!$CR$33:$CU$82,$D30,2),IF($G$14=\"MEMBERSHIP\",INDEX(Data!$CV$33:$CY$82,$D30,2),IF($G$14=\"WINE\",INDEX(Data!$EB$33:$EE$82,$D30,2),\"\")))))))),\"\")","v":0},{"$f":"IFERROR(IF($G$14=\"BEER EXCHANGE\",INDEX(Data!$DD$33:$DG$82,$D30,3),IF($G$14=\"BEER PACKAGE\",INDEX(Data!$CZ$33:$DC$82,$D30,3),IF($G$14=\"BEER SIDE ORDER\",(INDEX(Data!$DH$33:$DK$82,$D30,3)+INDEX(Data!$DL$33:$DO$82,$D30,3)+INDEX(Data!$DP$33:$DS$82,$D30,3)),IF($G$14=\"LIQUOR PACKAGE\",INDEX(Data!$DT$33:$DW$82,$D30,3),IF($G$14=\"LIQUOR SIDE ORDER\",INDEX(Data!$DX$33:$EA$82,$D30,3),IF($G$14=\"MEAL\",INDEX(Data!$CR$33:$CU$82,$D30,3),IF($G$14=\"MEMBERSHIP\",INDEX(Data!$CV$33:$CY$82,$D30,3),IF($G$14=\"WINE\",INDEX(Data!$EB$33:$EE$82,$D30,3),\"\")))))))),\"\")","v":0},{"$f":"IFERROR(IF($G$14=\"BEER EXCHANGE\",INDEX(Data!$DD$33:$DG$82,$D30,4),IF($G$14=\"BEER PACKAGE\",INDEX(Data!$CZ$33:$DC$82,$D30,4),IF($G$14=\"BEER SIDE ORDER\",(INDEX(Data!$DH$33:$DK$82,$D30,4)+INDEX(Data!$DL$33:$DO$82,$D30,4)+INDEX(Data!$DP$33:$DS$82,$D30,4)),IF($G$14=\"LIQUOR PACKAGE\",INDEX(Data!$DT$33:$DW$82,$D30,4),IF($G$14=\"LIQUOR SIDE ORDER\",INDEX(Data!$DX$33:$EA$82,$D30,4),IF($G$14=\"MEAL\",INDEX(Data!$CR$33:$CU$82,$D30,4),IF($G$14=\"MEMBERSHIP\",INDEX(Data!$CV$33:$CY$82,$D30,4),IF($G$14=\"WINE\",INDEX(Data!$EB$33:$EE$82,$D30,4),\"\")))))))),\"\")","v":0},{"$f":"IFERROR(SUM($E30:$H30),\"\")","v":0}]
[null,{"$f":"'Report A'!$B33","v":"2014-07-02"},{"$f":"'Report A'!$C33","v":"Wednesday"},{"$f":"'Report A'!$D33","v":2},{"$f":"IFERROR(IF($G$14=\"BEER EXCHANGE\",INDEX(Data!$DD$33:$DG$82,$D31,1),IF($G$14=\"BEER PACKAGE\",INDEX(Data!$CZ$33:$DC$82,$D31,1),IF($G$14=\"BEER SIDE ORDER\",(INDEX(Data!$DH$33:$DK$82,$D31,1)+INDEX(Data!$DL$33:$DO$82,$D31,1)+INDEX(Data!$DP$33:$DS$82,$D31,1)),IF($G$14=\"LIQUOR PACKAGE\",INDEX(Data!$DT$33:$DW$82,$D31,1),IF($G$14=\"LIQUOR SIDE ORDER\",INDEX(Data!$DX$33:$EA$82,$D31,1),IF($G$14=\"MEAL\",INDEX(Data!$CR$33:$CU$82,$D31,1),IF($G$14=\"MEMBERSHIP\",INDEX(Data!$CV$33:$CY$82,$D31,1),IF($G$14=\"WINE\",INDEX(Data!$EB$33:$EE$82,$D31,1),\"\")))))))),\"\")","v":0},{"$f":"IFERROR(IF($G$14=\"BEER EXCHANGE\",INDEX(Data!$DD$33:$DG$82,$D31,2),IF($G$14=\"BEER PACKAGE\",INDEX(Data!$CZ$33:$DC$82,$D31,2),IF($G$14=\"BEER SIDE ORDER\",(INDEX(Data!$DH$33:$DK$82,$D31,2)+INDEX(Data!$DL$33:$DO$82,$D31,2)+INDEX(Data!$DP$33:$DS$82,$D31,2)),IF($G$14=\"LIQUOR PACKAGE\",INDEX(Data!$DT$33:$DW$82,$D31,2),IF($G$14=\"LIQUOR SIDE ORDER\",INDEX(Data!$DX$33:$EA$82,$D31,2),IF($G$14=\"MEAL\",INDEX(Data!$CR$33:$CU$82,$D31,2),IF($G$14=\"MEMBERSHIP\",INDEX(Data!$CV$33:$CY$82,$D31,2),IF($G$14=\"WINE\",INDEX(Data!$EB$33:$EE$82,$D31,2),\"\")))))))),\"\")","v":0},{"$f":"IFERROR(IF($G$14=\"BEER EXCHANGE\",INDEX(Data!$DD$33:$DG$82,$D31,3),IF($G$14=\"BEER PACKAGE\",INDEX(Data!$CZ$33:$DC$82,$D31,3),IF($G$14=\"BEER SIDE ORDER\",(INDEX(Data!$DH$33:$DK$82,$D31,3)+INDEX(Data!$DL$33:$DO$82,$D31,3)+INDEX(Data!$DP$33:$DS$82,$D31,3)),IF($G$14=\"LIQUOR PACKAGE\",INDEX(Data!$DT$33:$DW$82,$D31,3),IF($G$14=\"LIQUOR SIDE ORDER\",INDEX(Data!$DX$33:$EA$82,$D31,3),IF($G$14=\"MEAL\",INDEX(Data!$CR$33:$CU$82,$D31,3),IF($G$14=\"MEMBERSHIP\",INDEX(Data!$CV$33:$CY$82,$D31,3),IF($G$14=\"WINE\",INDEX(Data!$EB$33:$EE$82,$D31,3),\"\")))))))),\"\")","v":0},{"$f":"IFERROR(IF($G$14=\"BEER EXCHANGE\",INDEX(Data!$DD$33:$DG$82,$D31,4),IF($G$14=\"BEER PACKAGE\",INDEX(Data!$CZ$33:$DC$82,$D31,4),IF($G$14=\"BEER SIDE ORDER\",(INDEX(Data!$DH$33:$DK$82,$D31,4)+INDEX(Data!$DL$33:$DO$82,$D31,4)+INDEX(Data!$DP$33:$DS$82,$D31,4)),IF($G$14=\"LIQUOR PACKAGE\",INDEX(Data!$DT$33:$DW$82,$D31,4),IF($G$14=\"LIQUOR SIDE ORDER\",INDEX(Data!$DX$33:$EA$82,$D31,4),IF($G$14=\"MEAL\",INDEX(Data!$CR$33:$CU$82,$D31,4),IF($G$14=\"MEMBERSHIP\",INDEX(Data!$CV$33:$CY$82,$D31,4),IF($G$14=\"WINE\",INDEX(Data!$EB$33:$EE$82,$D31,4),\"\")))))))),\"\")","v":0},{"$f":"IFERROR(SUM($E31:$H31),\"\")","v":0}]
[null,{"$f":"'Report A'!$B34","v":"2014-07-03"},{"$f":"'Report A'!$C34","v":"Thursday"},{"$f":"'Report A'!$D34","v":3},{"$f":"IFERROR(IF($G$14=\"BEER EXCHANGE\",INDEX(Data!$DD$33:$DG$82,$D32,1),IF($G$14=\"BEER PACKAGE\",INDEX(Data!$CZ$33:$DC$82,$D32,1),IF($G$14=\"BEER SIDE ORDER\",(INDEX(Data!$DH$33:$DK$82,$D32,1)+INDEX(Data!$DL$33:$DO$82,$D32,1)+INDEX(Data!$DP$33:$DS$82,$D32,1)),IF($G$14=\"LIQUOR PACKAGE\",INDEX(Data!$DT$33:$DW$82,$D32,1),IF($G$14=\"LIQUOR SIDE ORDER\",INDEX(Data!$DX$33:$EA$82,$D32,1),IF($G$14=\"MEAL\",INDEX(Data!$CR$33:$CU$82,$D32,1),IF($G$14=\"MEMBERSHIP\",INDEX(Data!$CV$33:$CY$82,$D32,1),IF($G$14=\"WINE\",INDEX(Data!$EB$33:$EE$82,$D32,1),\"\")))))))),\"\")","v":0},{"$f":"IFERROR(IF($G$14=\"BEER EXCHANGE\",INDEX(Data!$DD$33:$DG$82,$D32,2),IF($G$14=\"BEER PACKAGE\",INDEX(Data!$CZ$33:$DC$82,$D32,2),IF($G$14=\"BEER SIDE ORDER\",(INDEX(Data!$DH$33:$DK$82,$D32,2)+INDEX(Data!$DL$33:$DO$82,$D32,2)+INDEX(Data!$DP$33:$DS$82,$D32,2)),IF($G$14=\"LIQUOR PACKAGE\",INDEX(Data!$DT$33:$DW$82,$D32,2),IF($G$14=\"LIQUOR SIDE ORDER\",INDEX(Data!$DX$33:$EA$82,$D32,2),IF($G$14=\"MEAL\",INDEX(Data!$CR$33:$CU$82,$D32,2),IF($G$14=\"MEMBERSHIP\",INDEX(Data!$CV$33:$CY$82,$D32,2),IF($G$14=\"WINE\",INDEX(Data!$EB$33:$EE$82,$D32,2),\"\")))))))),\"\")","v":0},{"$f":"IFERROR(IF($G$14=\"BEER EXCHANGE\",INDEX(Data!$DD$33:$DG$82,$D32,3),IF($G$14=\"BEER PACKAGE\",INDEX(Data!$CZ$33:$DC$82,$D32,3),IF($G$14=\"BEER SIDE ORDER\",(INDEX(Data!$DH$33:$DK$82,$D32,3)+INDEX(Data!$DL$33:$DO$82,$D32,3)+INDEX(Data!$DP$33:$DS$82,$D32,3)),IF($G$14=\"LIQUOR PACKAGE\",INDEX(Data!$DT$33:$DW$82,$D32,3),IF($G$14=\"LIQUOR SIDE ORDER\",INDEX(Data!$DX$33:$EA$82,$D32,3),IF($G$14=\"MEAL\",INDEX(Data!$CR$33:$CU$82,$D32,3),IF($G$14=\"MEMBERSHIP\",INDEX(Data!$CV$33:$CY$82,$D32,3),IF($G$14=\"WINE\",INDEX(Data!$EB$33:$EE$82,$D32,3),\"\")))))))),\"\")","v":0},{"$f":"IFERROR(IF($G$14=\"BEER EXCHANGE\",INDEX(Data!$DD$33:$DG$82,$D32,4),IF($G$14=\"BEER PACKAGE\",INDEX(Data!$CZ$33:$DC$82,$D32,4),IF($G$14=\"BEER SIDE ORDER\",(INDEX(Data!$DH$33:$DK$82,$D32,4)+INDEX(Data!$DL$33:$DO$82,$D32,4)+INDEX(Data!$DP$33:$DS$82,$D32,4)),IF($G$14=\"LIQUOR PACKAGE\",INDEX(Data!$DT$33:$DW$82,$D32,4),IF($G$14=\"LIQUOR SIDE ORDER\",INDEX(Data!$DX$33:$EA$82,$D32,4),IF($G$14=\"MEAL\",INDEX(Data!$CR$33:$CU$82,$D32,4),IF($G$14=\"MEMBERSHIP\",INDEX(Data!$CV$33:$CY$82,$D32,4),IF($G$14=\"WINE\",INDEX(Data!$EB$33:$EE$82,$D32,4),\"\")))))))),\"\")","v":0},0]
[null,{"$f":"'Report A'!$B35","v":"2014-07-04"},{"$f":"'Report A'!$C35","v":"Friday"},{"$f":"'Report A'!$D35","v":4},{"$f":"IFERROR(IF($G$14=\"BEER EXCHANGE\",INDEX(Data!$DD$33:$DG$82,$D33,1),IF($G$14=\"BEER PACKAGE\",INDEX(Data!$CZ$33:$DC$82,$D33,1),IF($G$14=\"BEER SIDE ORDER\",(INDEX(Data!$DH$33:$DK$82,$D33,1)+INDEX(Data!$DL$33:$DO$82,$D33,1)+INDEX(Data!$DP$33:$DS$82,$D33,1)),IF($G$14=\"LIQUOR PACKAGE\",INDEX(Data!$DT$33:$DW$82,$D33,1),IF($G$14=\"LIQUOR SIDE ORDER\",INDEX(Data!$DX$33:$EA$82,$D33,1),IF($G$14=\"MEAL\",INDEX(Data!$CR$33:$CU$82,$D33,1),IF($G$14=\"MEMBERSHIP\",INDEX(Data!$CV$33:$CY$82,$D33,1),IF($G$14=\"WINE\",INDEX(Data!$EB$33:$EE$82,$D33,1),\"\")))))))),\"\")","v":0},{"$f":"IFERROR(IF($G$14=\"BEER EXCHANGE\",INDEX(Data!$DD$33:$DG$82,$D33,2),IF($G$14=\"BEER PACKAGE\",INDEX(Data!$CZ$33:$DC$82,$D33,2),IF($G$14=\"BEER SIDE ORDER\",(INDEX(Data!$DH$33:$DK$82,$D33,2)+INDEX(Data!$DL$33:$DO$82,$D33,2)+INDEX(Data!$DP$33:$DS$82,$D33,2)),IF($G$14=\"LIQUOR PACKAGE\",INDEX(Data!$DT$33:$DW$82,$D33,2),IF($G$14=\"LIQUOR SIDE ORDER\",INDEX(Data!$DX$33:$EA$82,$D33,2),IF($G$14=\"MEAL\",INDEX(Data!$CR$33:$CU$82,$D33,2),IF($G$14=\"MEMBERSHIP\",INDEX(Data!$CV$33:$CY$82,$D33,2),IF($G$14=\"WINE\",INDEX(Data!$EB$33:$EE$82,$D33,2),\"\")))))))),\"\")","v":0},{"$f":"IFERROR(IF($G$14=\"BEER EXCHANGE\",INDEX(Data!$DD$33:$DG$82,$D33,3),IF($G$14=\"BEER PACKAGE\",INDEX(Data!$CZ$33:$DC$82,$D33,3),IF($G$14=\"BEER SIDE ORDER\",(INDEX(Data!$DH$33:$DK$82,$D33,3)+INDEX(Data!$DL$33:$DO$82,$D33,3)+INDEX(Data!$DP$33:$DS$82,$D33,3)),IF($G$14=\"LIQUOR PACKAGE\",INDEX(Data!$DT$33:$DW$82,$D33,3),IF($G$14=\"LIQUOR SIDE ORDER\",INDEX(Data!$DX$33:$EA$82,$D33,3),IF($G$14=\"MEAL\",INDEX(Data!$CR$33:$CU$82,$D33,3),IF($G$14=\"MEMBERSHIP\",INDEX(Data!$CV$33:$CY$82,$D33,3),IF($G$14=\"WINE\",INDEX(Data!$EB$33:$EE$82,$D33,3),\"\")))))))),\"\")","v":0},{"$f":"IFERROR(IF($G$14=\"BEER EXCHANGE\",INDEX(Data!$DD$33:$DG$82,$D33,4),IF($G$14=\"BEER PACKAGE\",INDEX(Data!$CZ$33:$DC$82,$D33,4),IF($G$14=\"BEER SIDE ORDER\",(INDEX(Data!$DH$33:$DK$82,$D33,4)+INDEX(Data!$DL$33:$DO$82,$D33,4)+INDEX(Data!$DP$33:$DS$82,$D33,4)),IF($G$14=\"LIQUOR PACKAGE\",INDEX(Data!$DT$33:$DW$82,$D33,4),IF($G$14=\"LIQUOR SIDE ORDER\",INDEX(Data!$DX$33:$EA$82,$D33,4),IF($G$14=\"MEAL\",INDEX(Data!$CR$33:$CU$82,$D33,4),IF($G$14=\"MEMBERSHIP\",INDEX(Data!$CV$33:$CY$82,$D33,4),IF($G$14=\"WINE\",INDEX(Data!$EB$33:$EE$82,$D33,4),\"\")))))))),\"\")","v":0},0]
[null,{"$f":"'Report A'!$B36","v":"2014-07-05"},{"$f":"'Report A'!$C36","v":"Saturday"},{"$f":"'Report A'!$D36","v":5},{"$f":"IFERROR(IF($G$14=\"BEER EXCHANGE\",INDEX(Data!$DD$33:$DG$82,$D34,1),IF($G$14=\"BEER PACKAGE\",INDEX(Data!$CZ$33:$DC$82,$D34,1),IF($G$14=\"BEER SIDE ORDER\",(INDEX(Data!$DH$33:$DK$82,$D34,1)+INDEX(Data!$DL$33:$DO$82,$D34,1)+INDEX(Data!$DP$33:$DS$82,$D34,1)),IF($G$14=\"LIQUOR PACKAGE\",INDEX(Data!$DT$33:$DW$82,$D34,1),IF($G$14=\"LIQUOR SIDE ORDER\",INDEX(Data!$DX$33:$EA$82,$D34,1),IF($G$14=\"MEAL\",INDEX(Data!$CR$33:$CU$82,$D34,1),IF($G$14=\"MEMBERSHIP\",INDEX(Data!$CV$33:$CY$82,$D34,1),IF($G$14=\"WINE\",INDEX(Data!$EB$33:$EE$82,$D34,1),\"\")))))))),\"\")","v":0},{"$f":"IFERROR(IF($G$14=\"BEER EXCHANGE\",INDEX(Data!$DD$33:$DG$82,$D34,2),IF($G$14=\"BEER PACKAGE\",INDEX(Data!$CZ$33:$DC$82,$D34,2),IF($G$14=\"BEER SIDE ORDER\",(INDEX(Data!$DH$33:$DK$82,$D34,2)+INDEX(Data!$DL$33:$DO$82,$D34,2)+INDEX(Data!$DP$33:$DS$82,$D34,2)),IF($G$14=\"LIQUOR PACKAGE\",INDEX(Data!$DT$33:$DW$82,$D34,2),IF($G$14=\"LIQUOR SIDE ORDER\",INDEX(Data!$DX$33:$EA$82,$D34,2),IF($G$14=\"MEAL\",INDEX(Data!$CR$33:$CU$82,$D34,2),IF($G$14=\"MEMBERSHIP\",INDEX(Data!$CV$33:$CY$82,$D34,2),IF($G$14=\"WINE\",INDEX(Data!$EB$33:$EE$82,$D34,2),\"\")))))))),\"\")","v":0},{"$f":"IFERROR(IF($G$14=\"BEER EXCHANGE\",INDEX(Data!$DD$33:$DG$82,$D34,3),IF($G$14=\"BEER PACKAGE\",INDEX(Data!$CZ$33:$DC$82,$D34,3),IF($G$14=\"BEER SIDE ORDER\",(INDEX(Data!$DH$33:$DK$82,$D34,3)+INDEX(Data!$DL$33:$DO$82,$D34,3)+INDEX(Data!$DP$33:$DS$82,$D34,3)),IF($G$14=\"LIQUOR PACKAGE\",INDEX(Data!$DT$33:$DW$82,$D34,3),IF($G$14=\"LIQUOR SIDE ORDER\",INDEX(Data!$DX$33:$EA$82,$D34,3),IF($G$14=\"MEAL\",INDEX(Data!$CR$33:$CU$82,$D34,3),IF($G$14=\"MEMBERSHIP\",INDEX(Data!$CV$33:$CY$82,$D34,3),IF($G$14=\"WINE\",INDEX(Data!$EB$33:$EE$82,$D34,3),\"\")))))))),\"\")","v":0},{"$f":"IFERROR(IF($G$14=\"BEER EXCHANGE\",INDEX(Data!$DD$33:$DG$82,$D34,4),IF($G$14=\"BEER PACKAGE\",INDEX(Data!$CZ$33:$DC$82,$D34,4),IF($G$14=\"BEER SIDE ORDER\",(INDEX(Data!$DH$33:$DK$82,$D34,4)+INDEX(Data!$DL$33:$DO$82,$D34,4)+INDEX(Data!$DP$33:$DS$82,$D34,4)),IF($G$14=\"LIQUOR PACKAGE\",INDEX(Data!$DT$33:$DW$82,$D34,4),IF($G$14=\"LIQUOR SIDE ORDER\",INDEX(Data!$DX$33:$EA$82,$D34,4),IF($G$14=\"MEAL\",INDEX(Data!$CR$33:$CU$82,$D34,4),IF($G$14=\"MEMBERSHIP\",INDEX(Data!$CV$33:$CY$82,$D34,4),IF($G$14=\"WINE\",INDEX(Data!$EB$33:$EE$82,$D34,4),\"\")))))))),\"\")","v":0},0]
[null,{"$f":"'Report A'!$B37","v":"2014-07-06"},{"$f":"'Report A'!$C37","v":"Sunday"},{"$f":"'Report A'!$D37","v":6},{"$f":"IFERROR(IF($G$14=\"BEER EXCHANGE\",INDEX(Data!$DD$33:$DG$82,$D35,1),IF($G$14=\"BEER PACKAGE\",INDEX(Data!$CZ$33:$DC$82,$D35,1),IF($G$14=\"BEER SIDE ORDER\",(INDEX(Data!$DH$33:$DK$82,$D35,1)+INDEX(Data!$DL$33:$DO$82,$D35,1)+INDEX(Data!$DP$33:$DS$82,$D35,1)),IF($G$14=\"LIQUOR PACKAGE\",INDEX(Data!$DT$33:$DW$82,$D35,1),IF($G$14=\"LIQUOR SIDE ORDER\",INDEX(Data!$DX$33:$EA$82,$D35,1),IF($G$14=\"MEAL\",INDEX(Data!$CR$33:$CU$82,$D35,1),IF($G$14=\"MEMBERSHIP\",INDEX(Data!$CV$33:$CY$82,$D35,1),IF($G$14=\"WINE\",INDEX(Data!$EB$33:$EE$82,$D35,1),\"\")))))))),\"\")","v":0},{"$f":"IFERROR(IF($G$14=\"BEER EXCHANGE\",INDEX(Data!$DD$33:$DG$82,$D35,2),IF($G$14=\"BEER PACKAGE\",INDEX(Data!$CZ$33:$DC$82,$D35,2),IF($G$14=\"BEER SIDE ORDER\",(INDEX(Data!$DH$33:$DK$82,$D35,2)+INDEX(Data!$DL$33:$DO$82,$D35,2)+INDEX(Data!$DP$33:$DS$82,$D35,2)),IF($G$14=\"LIQUOR PACKAGE\",INDEX(Data!$DT$33:$DW$82,$D35,2),IF($G$14=\"LIQUOR SIDE ORDER\",INDEX(Data!$DX$33:$EA$82,$D35,2),IF($G$14=\"MEAL\",INDEX(Data!$CR$33:$CU$82,$D35,2),IF($G$14=\"MEMBERSHIP\",INDEX(Data!$CV$33:$CY$82,$D35,2),IF($G$14=\"WINE\",INDEX(Data!$EB$33:$EE$82,$D35,2),\"\")))))))),\"\")","v":0},{"$f":"IFERROR(IF($G$14=\"BEER EXCHANGE\",INDEX(Data!$DD$33:$DG$82,$D35,3),IF($G$14=\"BEER PACKAGE\",INDEX(Data!$CZ$33:$DC$82,$D35,3),IF($G$14=\"BEER SIDE ORDER\",(INDEX(Data!$DH$33:$DK$82,$D35,3)+INDEX(Data!$DL$33:$DO$82,$D35,3)+INDEX(Data!$DP$33:$DS$82,$D35,3)),IF($G$14=\"LIQUOR PACKAGE\",INDEX(Data!$DT$33:$DW$82,$D35,3),IF($G$14=\"LIQUOR SIDE ORDER\",INDEX(Data!$DX$33:$EA$82,$D35,3),IF($G$14=\"MEAL\",INDEX(Data!$CR$33:$CU$82,$D35,3),IF($G$14=\"MEMBERSHIP\",INDEX(Data!$CV$33:$CY$82,$D35,3),IF($G$14=\"WINE\",INDEX(Data!$EB$33:$EE$82,$D35,3),\"\")))))))),\"\")","v":0},{"$f":"IFERROR(IF($G$14=\"BEER EXCHANGE\",INDEX(Data!$DD$33:$DG$82,$D35,4),IF($G$14=\"BEER PACKAGE\",INDEX(Data!$CZ$33:$DC$82,$D35,4),IF($G$14=\"BEER SIDE ORDER\",(INDEX(Data!$DH$33:$DK$82,$D35,4)+INDEX(Data!$DL$33:$DO$82,$D35,4)+INDEX(Data!$DP$33:$DS$82,$D35,4)),IF($G$14=\"LIQUOR PACKAGE\",INDEX(Data!$DT$33:$DW$82,$D35,4),IF($G$14=\"LIQUOR SIDE ORDER\",INDEX(Data!$DX$33:$EA$82,$D35,4),IF($G$14=\"MEAL\",INDEX(Data!$CR$33:$CU$82,$D35,4),IF($G$14=\"MEMBERSHIP\",INDEX(Data!$CV$33:$CY$82,$D35,4),IF($G$14=\"WINE\",INDEX(Data!$EB$33:$EE$82,$D35,4),\"\")))))))),\"\")","v":0},0]
[null,{"$f":"'Report A'!$B38","v":"2014-07-07"},{"$f":"'Report A'!$C38","v":"Monday"},{"$f":"'Report A'!$D38","v":7},{"$f":"IFERROR(IF($G$14=\"BEER EXCHANGE\",INDEX(Data!$DD$33:$DG$82,$D36,1),IF($G$14=\"BEER PACKAGE\",INDEX(Data!$CZ$33:$DC$82,$D36,1),IF($G$14=\"BEER SIDE ORDER\",(INDEX(Data!$DH$33:$DK$82,$D36,1)+INDEX(Data!$DL$33:$DO$82,$D36,1)+INDEX(Data!$DP$33:$DS$82,$D36,1)),IF($G$14=\"LIQUOR PACKAGE\",INDEX(Data!$DT$33:$DW$82,$D36,1),IF($G$14=\"LIQUOR SIDE ORDER\",INDEX(Data!$DX$33:$EA$82,$D36,1),IF($G$14=\"MEAL\",INDEX(Data!$CR$33:$CU$82,$D36,1),IF($G$14=\"MEMBERSHIP\",INDEX(Data!$CV$33:$CY$82,$D36,1),IF($G$14=\"WINE\",INDEX(Data!$EB$33:$EE$82,$D36,1),\"\")))))))),\"\")","v":0},{"$f":"IFERROR(IF($G$14=\"BEER EXCHANGE\",INDEX(Data!$DD$33:$DG$82,$D36,2),IF($G$14=\"BEER PACKAGE\",INDEX(Data!$CZ$33:$DC$82,$D36,2),IF($G$14=\"BEER SIDE ORDER\",(INDEX(Data!$DH$33:$DK$82,$D36,2)+INDEX(Data!$DL$33:$DO$82,$D36,2)+INDEX(Data!$DP$33:$DS$82,$D36,2)),IF($G$14=\"LIQUOR PACKAGE\",INDEX(Data!$DT$33:$DW$82,$D36,2),IF($G$14=\"LIQUOR SIDE ORDER\",INDEX(Data!$DX$33:$EA$82,$D36,2),IF($G$14=\"MEAL\",INDEX(Data!$CR$33:$CU$82,$D36,2),IF($G$14=\"MEMBERSHIP\",INDEX(Data!$CV$33:$CY$82,$D36,2),IF($G$14=\"WINE\",INDEX(Data!$EB$33:$EE$82,$D36,2),\"\")))))))),\"\")","v":0},{"$f":"IFERROR(IF($G$14=\"BEER EXCHANGE\",INDEX(Data!$DD$33:$DG$82,$D36,3),IF($G$14=\"BEER PACKAGE\",INDEX(Data!$CZ$33:$DC$82,$D36,3),IF($G$14=\"BEER SIDE ORDER\",(INDEX(Data!$DH$33:$DK$82,$D36,3)+INDEX(Data!$DL$33:$DO$82,$D36,3)+INDEX(Data!$DP$33:$DS$82,$D36,3)),IF($G$14=\"LIQUOR PACKAGE\",INDEX(Data!$DT$33:$DW$82,$D36,3),IF($G$14=\"LIQUOR SIDE ORDER\",INDEX(Data!$DX$33:$EA$82,$D36,3),IF($G$14=\"MEAL\",INDEX(Data!$CR$33:$CU$82,$D36,3),IF($G$14=\"MEMBERSHIP\",INDEX(Data!$CV$33:$CY$82,$D36,3),IF($G$14=\"WINE\",INDEX(Data!$EB$33:$EE$82,$D36,3),\"\")))))))),\"\")","v":0},{"$f":"IFERROR(IF($G$14=\"BEER EXCHANGE\",INDEX(Data!$DD$33:$DG$82,$D36,4),IF($G$14=\"BEER PACKAGE\",INDEX(Data!$CZ$33:$DC$82,$D36,4),IF($G$14=\"BEER SIDE ORDER\",(INDEX(Data!$DH$33:$DK$82,$D36,4)+INDEX(Data!$DL$33:$DO$82,$D36,4)+INDEX(Data!$DP$33:$DS$82,$D36,4)),IF($G$14=\"LIQUOR PACKAGE\",INDEX(Data!$DT$33:$DW$82,$D36,4),IF($G$14=\"LIQUOR SIDE ORDER\",INDEX(Data!$DX$33:$EA$82,$D36,4),IF($G$14=\"MEAL\",INDEX(Data!$CR$33:$CU$82,$D36,4),IF($G$14=\"MEMBERSHIP\",INDEX(Data!$CV$33:$CY$82,$D36,4),IF($G$14=\"WINE\",INDEX(Data!$EB$33:$EE$82,$D36,4),\"\")))))))),\"\")","v":0},0]
[null,{"$f":"'Report A'!$B39","v":"2014-07-08"},{"$f":"'Report A'!$C39","v":"Tuesday"},{"$f":"'Report A'!$D39","v":8},{"$f":"IFERROR(IF($G$14=\"BEER EXCHANGE\",INDEX(Data!$DD$33:$DG$82,$D37,1),IF($G$14=\"BEER PACKAGE\",INDEX(Data!$CZ$33:$DC$82,$D37,1),IF($G$14=\"BEER SIDE ORDER\",(INDEX(Data!$DH$33:$DK$82,$D37,1)+INDEX(Data!$DL$33:$DO$82,$D37,1)+INDEX(Data!$DP$33:$DS$82,$D37,1)),IF($G$14=\"LIQUOR PACKAGE\",INDEX(Data!$DT$33:$DW$82,$D37,1),IF($G$14=\"LIQUOR SIDE ORDER\",INDEX(Data!$DX$33:$EA$82,$D37,1),IF($G$14=\"MEAL\",INDEX(Data!$CR$33:$CU$82,$D37,1),IF($G$14=\"MEMBERSHIP\",INDEX(Data!$CV$33:$CY$82,$D37,1),IF($G$14=\"WINE\",INDEX(Data!$EB$33:$EE$82,$D37,1),\"\")))))))),\"\")","v":0},{"$f":"IFERROR(IF($G$14=\"BEER EXCHANGE\",INDEX(Data!$DD$33:$DG$82,$D37,2),IF($G$14=\"BEER PACKAGE\",INDEX(Data!$CZ$33:$DC$82,$D37,2),IF($G$14=\"BEER SIDE ORDER\",(INDEX(Data!$DH$33:$DK$82,$D37,2)+INDEX(Data!$DL$33:$DO$82,$D37,2)+INDEX(Data!$DP$33:$DS$82,$D37,2)),IF($G$14=\"LIQUOR PACKAGE\",INDEX(Data!$DT$33:$DW$82,$D37,2),IF($G$14=\"LIQUOR SIDE ORDER\",INDEX(Data!$DX$33:$EA$82,$D37,2),IF($G$14=\"MEAL\",INDEX(Data!$CR$33:$CU$82,$D37,2),IF($G$14=\"MEMBERSHIP\",INDEX(Data!$CV$33:$CY$82,$D37,2),IF($G$14=\"WINE\",INDEX(Data!$EB$33:$EE$82,$D37,2),\"\")))))))),\"\")","v":0},{"$f":"IFERROR(IF($G$14=\"BEER EXCHANGE\",INDEX(Data!$DD$33:$DG$82,$D37,3),IF($G$14=\"BEER PACKAGE\",INDEX(Data!$CZ$33:$DC$82,$D37,3),IF($G$14=\"BEER SIDE ORDER\",(INDEX(Data!$DH$33:$DK$82,$D37,3)+INDEX(Data!$DL$33:$DO$82,$D37,3)+INDEX(Data!$DP$33:$DS$82,$D37,3)),IF($G$14=\"LIQUOR PACKAGE\",INDEX(Data!$DT$33:$DW$82,$D37,3),IF($G$14=\"LIQUOR SIDE ORDER\",INDEX(Data!$DX$33:$EA$82,$D37,3),IF($G$14=\"MEAL\",INDEX(Data!$CR$33:$CU$82,$D37,3),IF($G$14=\"MEMBERSHIP\",INDEX(Data!$CV$33:$CY$82,$D37,3),IF($G$14=\"WINE\",INDEX(Data!$EB$33:$EE$82,$D37,3),\"\")))))))),\"\")","v":0},{"$f":"IFERROR(IF($G$14=\"BEER EXCHANGE\",INDEX(Data!$DD$33:$DG$82,$D37,4),IF($G$14=\"BEER PACKAGE\",INDEX(Data!$CZ$33:$DC$82,$D37,4),IF($G$14=\"BEER SIDE ORDER\",(INDEX(Data!$DH$33:$DK$82,$D37,4)+INDEX(Data!$DL$33:$DO$82,$D37,4)+INDEX(Data!$DP$33:$DS$82,$D37,4)),IF($G$14=\"LIQUOR PACKAGE\",INDEX(Data!$DT$33:$DW$82,$D37,4),IF($G$14=\"LIQUOR SIDE ORDER\",INDEX(Data!$DX$33:$EA$82,$D37,4),IF($G$14=\"MEAL\",INDEX(Data!$CR$33:$CU$82,$D37,4),IF($G$14=\"MEMBERSHIP\",INDEX(Data!$CV$33:$CY$82,$D37,4),IF($G$14=\"WINE\",INDEX(Data!$EB$33:$EE$82,$D37,4),\"\")))))))),\"\")","v":0},0]
[null,{"$f":"'Report A'!$B40","v":"2014-07-09"},{"$f":"'Report A'!$C40","v":"Wednesday"},{"$f":"'Report A'!$D40","v":9},{"$f":"IFERROR(IF($G$14=\"BEER EXCHANGE\",INDEX(Data!$DD$33:$DG$82,$D38,1),IF($G$14=\"BEER PACKAGE\",INDEX(Data!$CZ$33:$DC$82,$D38,1),IF($G$14=\"BEER SIDE ORDER\",(INDEX(Data!$DH$33:$DK$82,$D38,1)+INDEX(Data!$DL$33:$DO$82,$D38,1)+INDEX(Data!$DP$33:$DS$82,$D38,1)),IF($G$14=\"LIQUOR PACKAGE\",INDEX(Data!$DT$33:$DW$82,$D38,1),IF($G$14=\"LIQUOR SIDE ORDER\",INDEX(Data!$DX$33:$EA$82,$D38,1),IF($G$14=\"MEAL\",INDEX(Data!$CR$33:$CU$82,$D38,1),IF($G$14=\"MEMBERSHIP\",INDEX(Data!$CV$33:$CY$82,$D38,1),IF($G$14=\"WINE\",INDEX(Data!$EB$33:$EE$82,$D38,1),\"\")))))))),\"\")","v":0},{"$f":"IFERROR(IF($G$14=\"BEER EXCHANGE\",INDEX(Data!$DD$33:$DG$82,$D38,2),IF($G$14=\"BEER PACKAGE\",INDEX(Data!$CZ$33:$DC$82,$D38,2),IF($G$14=\"BEER SIDE ORDER\",(INDEX(Data!$DH$33:$DK$82,$D38,2)+INDEX(Data!$DL$33:$DO$82,$D38,2)+INDEX(Data!$DP$33:$DS$82,$D38,2)),IF($G$14=\"LIQUOR PACKAGE\",INDEX(Data!$DT$33:$DW$82,$D38,2),IF($G$14=\"LIQUOR SIDE ORDER\",INDEX(Data!$DX$33:$EA$82,$D38,2),IF($G$14=\"MEAL\",INDEX(Data!$CR$33:$CU$82,$D38,2),IF($G$14=\"MEMBERSHIP\",INDEX(Data!$CV$33:$CY$82,$D38,2),IF($G$14=\"WINE\",INDEX(Data!$EB$33:$EE$82,$D38,2),\"\")))))))),\"\")","v":0},{"$f":"IFERROR(IF($G$14=\"BEER EXCHANGE\",INDEX(Data!$DD$33:$DG$82,$D38,3),IF($G$14=\"BEER PACKAGE\",INDEX(Data!$CZ$33:$DC$82,$D38,3),IF($G$14=\"BEER SIDE ORDER\",(INDEX(Data!$DH$33:$DK$82,$D38,3)+INDEX(Data!$DL$33:$DO$82,$D38,3)+INDEX(Data!$DP$33:$DS$82,$D38,3)),IF($G$14=\"LIQUOR PACKAGE\",INDEX(Data!$DT$33:$DW$82,$D38,3),IF($G$14=\"LIQUOR SIDE ORDER\",INDEX(Data!$DX$33:$EA$82,$D38,3),IF($G$14=\"MEAL\",INDEX(Data!$CR$33:$CU$82,$D38,3),IF($G$14=\"MEMBERSHIP\",INDEX(Data!$CV$33:$CY$82,$D38,3),IF($G$14=\"WINE\",INDEX(Data!$EB$33:$EE$82,$D38,3),\"\")))))))),\"\")","v":0},{"$f":"IFERROR(IF($G$14=\"BEER EXCHANGE\",INDEX(Data!$DD$33:$DG$82,$D38,4),IF($G$14=\"BEER PACKAGE\",INDEX(Data!$CZ$33:$DC$82,$D38,4),IF($G$14=\"BEER SIDE ORDER\",(INDEX(Data!$DH$33:$DK$82,$D38,4)+INDEX(Data!$DL$33:$DO$82,$D38,4)+INDEX(Data!$DP$33:$DS$82,$D38,4)),IF($G$14=\"LIQUOR PACKAGE\",INDEX(Data!$DT$33:$DW$82,$D38,4),IF($G$14=\"LIQUOR SIDE ORDER\",INDEX(Data!$DX$33:$EA$82,$D38,4),IF($G$14=\"MEAL\",INDEX(Data!$CR$33:$CU$82,$D38,4),IF($G$14=\"MEMBERSHIP\",INDEX(Data!$CV$33:$CY$82,$D38,4),IF($G$14=\"WINE\",INDEX(Data!$EB$33:$EE$82,$D38,4),\"\")))))))),\"\")","v":0},0]
[null,{"$f":"'Report A'!$B41","v":"2014-07-10"},{"$f":"'Report A'!$C41","v":"Thursday"},{"$f":"'Report A'!$D41","v":10},{"$f":"IFERROR(IF($G$14=\"BEER EXCHANGE\",INDEX(Data!$DD$33:$DG$82,$D39,1),IF($G$14=\"BEER PACKAGE\",INDEX(Data!$CZ$33:$DC$82,$D39,1),IF($G$14=\"BEER SIDE ORDER\",(INDEX(Data!$DH$33:$DK$82,$D39,1)+INDEX(Data!$DL$33:$DO$82,$D39,1)+INDEX(Data!$DP$33:$DS$82,$D39,1)),IF($G$14=\"LIQUOR PACKAGE\",INDEX(Data!$DT$33:$DW$82,$D39,1),IF($G$14=\"LIQUOR SIDE ORDER\",INDEX(Data!$DX$33:$EA$82,$D39,1),IF($G$14=\"MEAL\",INDEX(Data!$CR$33:$CU$82,$D39,1),IF($G$14=\"MEMBERSHIP\",INDEX(Data!$CV$33:$CY$82,$D39,1),IF($G$14=\"WINE\",INDEX(Data!$EB$33:$EE$82,$D39,1),\"\")))))))),\"\")","v":0},{"$f":"IFERROR(IF($G$14=\"BEER EXCHANGE\",INDEX(Data!$DD$33:$DG$82,$D39,2),IF($G$14=\"BEER PACKAGE\",INDEX(Data!$CZ$33:$DC$82,$D39,2),IF($G$14=\"BEER SIDE ORDER\",(INDEX(Data!$DH$33:$DK$82,$D39,2)+INDEX(Data!$DL$33:$DO$82,$D39,2)+INDEX(Data!$DP$33:$DS$82,$D39,2)),IF($G$14=\"LIQUOR PACKAGE\",INDEX(Data!$DT$33:$DW$82,$D39,2),IF($G$14=\"LIQUOR SIDE ORDER\",INDEX(Data!$DX$33:$EA$82,$D39,2),IF($G$14=\"MEAL\",INDEX(Data!$CR$33:$CU$82,$D39,2),IF($G$14=\"MEMBERSHIP\",INDEX(Data!$CV$33:$CY$82,$D39,2),IF($G$14=\"WINE\",INDEX(Data!$EB$33:$EE$82,$D39,2),\"\")))))))),\"\")","v":0},{"$f":"IFERROR(IF($G$14=\"BEER EXCHANGE\",INDEX(Data!$DD$33:$DG$82,$D39,3),IF($G$14=\"BEER PACKAGE\",INDEX(Data!$CZ$33:$DC$82,$D39,3),IF($G$14=\"BEER SIDE ORDER\",(INDEX(Data!$DH$33:$DK$82,$D39,3)+INDEX(Data!$DL$33:$DO$82,$D39,3)+INDEX(Data!$DP$33:$DS$82,$D39,3)),IF($G$14=\"LIQUOR PACKAGE\",INDEX(Data!$DT$33:$DW$82,$D39,3),IF($G$14=\"LIQUOR SIDE ORDER\",INDEX(Data!$DX$33:$EA$82,$D39,3),IF($G$14=\"MEAL\",INDEX(Data!$CR$33:$CU$82,$D39,3),IF($G$14=\"MEMBERSHIP\",INDEX(Data!$CV$33:$CY$82,$D39,3),IF($G$14=\"WINE\",INDEX(Data!$EB$33:$EE$82,$D39,3),\"\")))))))),\"\")","v":0},{"$f":"IFERROR(IF($G$14=\"BEER EXCHANGE\",INDEX(Data!$DD$33:$DG$82,$D39,4),IF($G$14=\"BEER PACKAGE\",INDEX(Data!$CZ$33:$DC$82,$D39,4),IF($G$14=\"BEER SIDE ORDER\",(INDEX(Data!$DH$33:$DK$82,$D39,4)+INDEX(Data!$DL$33:$DO$82,$D39,4)+INDEX(Data!$DP$33:$DS$82,$D39,4)),IF($G$14=\"LIQUOR PACKAGE\",INDEX(Data!$DT$33:$DW$82,$D39,4),IF($G$14=\"LIQUOR SIDE ORDER\",INDEX(Data!$DX$33:$EA$82,$D39,4),IF($G$14=\"MEAL\",INDEX(Data!$CR$33:$CU$82,$D39,4),IF($G$14=\"MEMBERSHIP\",INDEX(Data!$CV$33:$CY$82,$D39,4),IF($G$14=\"WINE\",INDEX(Data!$EB$33:$EE$82,$D39,4),\"\")))))))),\"\")","v":0},0]
[null,{"$f":"'Report A'!$B42","v":"2014-07-11"},{"$f":"'Report A'!$C42","v":"Friday"},{"$f":"'Report A'!$D42","v":11},{"$f":"IFERROR(IF($G$14=\"BEER EXCHANGE\",INDEX(Data!$DD$33:$DG$82,$D40,1),IF($G$14=\"BEER PACKAGE\",INDEX(Data!$CZ$33:$DC$82,$D40,1),IF($G$14=\"BEER SIDE ORDER\",(INDEX(Data!$DH$33:$DK$82,$D40,1)+INDEX(Data!$DL$33:$DO$82,$D40,1)+INDEX(Data!$DP$33:$DS$82,$D40,1)),IF($G$14=\"LIQUOR PACKAGE\",INDEX(Data!$DT$33:$DW$82,$D40,1),IF($G$14=\"LIQUOR SIDE ORDER\",INDEX(Data!$DX$33:$EA$82,$D40,1),IF($G$14=\"MEAL\",INDEX(Data!$CR$33:$CU$82,$D40,1),IF($G$14=\"MEMBERSHIP\",INDEX(Data!$CV$33:$CY$82,$D40,1),IF($G$14=\"WINE\",INDEX(Data!$EB$33:$EE$82,$D40,1),\"\")))))))),\"\")","v":0},{"$f":"IFERROR(IF($G$14=\"BEER EXCHANGE\",INDEX(Data!$DD$33:$DG$82,$D40,2),IF($G$14=\"BEER PACKAGE\",INDEX(Data!$CZ$33:$DC$82,$D40,2),IF($G$14=\"BEER SIDE ORDER\",(INDEX(Data!$DH$33:$DK$82,$D40,2)+INDEX(Data!$DL$33:$DO$82,$D40,2)+INDEX(Data!$DP$33:$DS$82,$D40,2)),IF($G$14=\"LIQUOR PACKAGE\",INDEX(Data!$DT$33:$DW$82,$D40,2),IF($G$14=\"LIQUOR SIDE ORDER\",INDEX(Data!$DX$33:$EA$82,$D40,2),IF($G$14=\"MEAL\",INDEX(Data!$CR$33:$CU$82,$D40,2),IF($G$14=\"MEMBERSHIP\",INDEX(Data!$CV$33:$CY$82,$D40,2),IF($G$14=\"WINE\",INDEX(Data!$EB$33:$EE$82,$D40,2),\"\")))))))),\"\")","v":0},{"$f":"IFERROR(IF($G$14=\"BEER EXCHANGE\",INDEX(Data!$DD$33:$DG$82,$D40,3),IF($G$14=\"BEER PACKAGE\",INDEX(Data!$CZ$33:$DC$82,$D40,3),IF($G$14=\"BEER SIDE ORDER\",(INDEX(Data!$DH$33:$DK$82,$D40,3)+INDEX(Data!$DL$33:$DO$82,$D40,3)+INDEX(Data!$DP$33:$DS$82,$D40,3)),IF($G$14=\"LIQUOR PACKAGE\",INDEX(Data!$DT$33:$DW$82,$D40,3),IF($G$14=\"LIQUOR SIDE ORDER\",INDEX(Data!$DX$33:$EA$82,$D40,3),IF($G$14=\"MEAL\",INDEX(Data!$CR$33:$CU$82,$D40,3),IF($G$14=\"MEMBERSHIP\",INDEX(Data!$CV$33:$CY$82,$D40,3),IF($G$14=\"WINE\",INDEX(Data!$EB$33:$EE$82,$D40,3),\"\")))))))),\"\")","v":0},{"$f":"IFERROR(IF($G$14=\"BEER EXCHANGE\",INDEX(Data!$DD$33:$DG$82,$D40,4),IF($G$14=\"BEER PACKAGE\",INDEX(Data!$CZ$33:$DC$82,$D40,4),IF($G$14=\"BEER SIDE ORDER\",(INDEX(Data!$DH$33:$DK$82,$D40,4)+INDEX(Data!$DL$33:$DO$82,$D40,4)+INDEX(Data!$DP$33:$DS$82,$D40,4)),IF($G$14=\"LIQUOR PACKAGE\",INDEX(Data!$DT$33:$DW$82,$D40,4),IF($G$14=\"LIQUOR SIDE ORDER\",INDEX(Data!$DX$33:$EA$82,$D40,4),IF($G$14=\"MEAL\",INDEX(Data!$CR$33:$CU$82,$D40,4),IF($G$14=\"MEMBERSHIP\",INDEX(Data!$CV$33:$CY$82,$D40,4),IF($G$14=\"WINE\",INDEX(Data!$EB$33:$EE$82,$D40,4),\"\")))))))),\"\")","v":0},0]
[null,{"$f":"'Report A'!$B43","v":"2014-07-12"},{"$f":"'Report A'!$C43","v":"Saturday"},{"$f":"'Report A'!$D43","v":12},{"$f":"IFERROR(IF($G$14=\"BEER EXCHANGE\",INDEX(Data!$DD$33:$DG$82,$D41,1),IF($G$14=\"BEER PACKAGE\",INDEX(Data!$CZ$33:$DC$82,$D41,1),IF($G$14=\"BEER SIDE ORDER\",(INDEX(Data!$DH$33:$DK$82,$D41,1)+INDEX(Data!$DL$33:$DO$82,$D41,1)+INDEX(Data!$DP$33:$DS$82,$D41,1)),IF($G$14=\"LIQUOR PACKAGE\",INDEX(Data!$DT$33:$DW$82,$D41,1),IF($G$14=\"LIQUOR SIDE ORDER\",INDEX(Data!$DX$33:$EA$82,$D41,1),IF($G$14=\"MEAL\",INDEX(Data!$CR$33:$CU$82,$D41,1),IF($G$14=\"MEMBERSHIP\",INDEX(Data!$CV$33:$CY$82,$D41,1),IF($G$14=\"WINE\",INDEX(Data!$EB$33:$EE$82,$D41,1),\"\")))))))),\"\")","v":0},{"$f":"IFERROR(IF($G$14=\"BEER EXCHANGE\",INDEX(Data!$DD$33:$DG$82,$D41,2),IF($G$14=\"BEER PACKAGE\",INDEX(Data!$CZ$33:$DC$82,$D41,2),IF($G$14=\"BEER SIDE ORDER\",(INDEX(Data!$DH$33:$DK$82,$D41,2)+INDEX(Data!$DL$33:$DO$82,$D41,2)+INDEX(Data!$DP$33:$DS$82,$D41,2)),IF($G$14=\"LIQUOR PACKAGE\",INDEX(Data!$DT$33:$DW$82,$D41,2),IF($G$14=\"LIQUOR SIDE ORDER\",INDEX(Data!$DX$33:$EA$82,$D41,2),IF($G$14=\"MEAL\",INDEX(Data!$CR$33:$CU$82,$D41,2),IF($G$14=\"MEMBERSHIP\",INDEX(Data!$CV$33:$CY$82,$D41,2),IF($G$14=\"WINE\",INDEX(Data!$EB$33:$EE$82,$D41,2),\"\")))))))),\"\")","v":0},{"$f":"IFERROR(IF($G$14=\"BEER EXCHANGE\",INDEX(Data!$DD$33:$DG$82,$D41,3),IF($G$14=\"BEER PACKAGE\",INDEX(Data!$CZ$33:$DC$82,$D41,3),IF($G$14=\"BEER SIDE ORDER\",(INDEX(Data!$DH$33:$DK$82,$D41,3)+INDEX(Data!$DL$33:$DO$82,$D41,3)+INDEX(Data!$DP$33:$DS$82,$D41,3)),IF($G$14=\"LIQUOR PACKAGE\",INDEX(Data!$DT$33:$DW$82,$D41,3),IF($G$14=\"LIQUOR SIDE ORDER\",INDEX(Data!$DX$33:$EA$82,$D41,3),IF($G$14=\"MEAL\",INDEX(Data!$CR$33:$CU$82,$D41,3),IF($G$14=\"MEMBERSHIP\",INDEX(Data!$CV$33:$CY$82,$D41,3),IF($G$14=\"WINE\",INDEX(Data!$EB$33:$EE$82,$D41,3),\"\")))))))),\"\")","v":0},{"$f":"IFERROR(IF($G$14=\"BEER EXCHANGE\",INDEX(Data!$DD$33:$DG$82,$D41,4),IF($G$14=\"BEER PACKAGE\",INDEX(Data!$CZ$33:$DC$82,$D41,4),IF($G$14=\"BEER SIDE ORDER\",(INDEX(Data!$DH$33:$DK$82,$D41,4)+INDEX(Data!$DL$33:$DO$82,$D41,4)+INDEX(Data!$DP$33:$DS$82,$D41,4)),IF($G$14=\"LIQUOR PACKAGE\",INDEX(Data!$DT$33:$DW$82,$D41,4),IF($G$14=\"LIQUOR SIDE ORDER\",INDEX(Data!$DX$33:$EA$82,$D41,4),IF($G$14=\"MEAL\",INDEX(Data!$CR$33:$CU$82,$D41,4),IF($G$14=\"MEMBERSHIP\",INDEX(Data!$CV$33:$CY$82,$D41,4),IF($G$14=\"WINE\",INDEX(Data!$EB$33:$EE$82,$D41,4),\"\")))))))),\"\")","v":0},0]
[null,{"$f":"'Report A'!$B44","v":"2014-07-13"},{"$f":"'Report A'!$C44","v":"Sunday"},{"$f":"'Report A'!$D44","v":13},{"$f":"IFERROR(IF($G$14=\"BEER EXCHANGE\",INDEX(Data!$DD$33:$DG$82,$D42,1),IF($G$14=\"BEER PACKAGE\",INDEX(Data!$CZ$33:$DC$82,$D42,1),IF($G$14=\"BEER SIDE ORDER\",(INDEX(Data!$DH$33:$DK$82,$D42,1)+INDEX(Data!$DL$33:$DO$82,$D42,1)+INDEX(Data!$DP$33:$DS$82,$D42,1)),IF($G$14=\"LIQUOR PACKAGE\",INDEX(Data!$DT$33:$DW$82,$D42,1),IF($G$14=\"LIQUOR SIDE ORDER\",INDEX(Data!$DX$33:$EA$82,$D42,1),IF($G$14=\"MEAL\",INDEX(Data!$CR$33:$CU$82,$D42,1),IF($G$14=\"MEMBERSHIP\",INDEX(Data!$CV$33:$CY$82,$D42,1),IF($G$14=\"WINE\",INDEX(Data!$EB$33:$EE$82,$D42,1),\"\")))))))),\"\")","v":0},{"$f":"IFERROR(IF($G$14=\"BEER EXCHANGE\",INDEX(Data!$DD$33:$DG$82,$D42,2),IF($G$14=\"BEER PACKAGE\",INDEX(Data!$CZ$33:$DC$82,$D42,2),IF($G$14=\"BEER SIDE ORDER\",(INDEX(Data!$DH$33:$DK$82,$D42,2)+INDEX(Data!$DL$33:$DO$82,$D42,2)+INDEX(Data!$DP$33:$DS$82,$D42,2)),IF($G$14=\"LIQUOR PACKAGE\",INDEX(Data!$DT$33:$DW$82,$D42,2),IF($G$14=\"LIQUOR SIDE ORDER\",INDEX(Data!$DX$33:$EA$82,$D42,2),IF($G$14=\"MEAL\",INDEX(Data!$CR$33:$CU$82,$D42,2),IF($G$14=\"MEMBERSHIP\",INDEX(Data!$CV$33:$CY$82,$D42,2),IF($G$14=\"WINE\",INDEX(Data!$EB$33:$EE$82,$D42,2),\"\")))))))),\"\")","v":0},{"$f":"IFERROR(IF($G$14=\"BEER EXCHANGE\",INDEX(Data!$DD$33:$DG$82,$D42,3),IF($G$14=\"BEER PACKAGE\",INDEX(Data!$CZ$33:$DC$82,$D42,3),IF($G$14=\"BEER SIDE ORDER\",(INDEX(Data!$DH$33:$DK$82,$D42,3)+INDEX(Data!$DL$33:$DO$82,$D42,3)+INDEX(Data!$DP$33:$DS$82,$D42,3)),IF($G$14=\"LIQUOR PACKAGE\",INDEX(Data!$DT$33:$DW$82,$D42,3),IF($G$14=\"LIQUOR SIDE ORDER\",INDEX(Data!$DX$33:$EA$82,$D42,3),IF($G$14=\"MEAL\",INDEX(Data!$CR$33:$CU$82,$D42,3),IF($G$14=\"MEMBERSHIP\",INDEX(Data!$CV$33:$CY$82,$D42,3),IF($G$14=\"WINE\",INDEX(Data!$EB$33:$EE$82,$D42,3),\"\")))))))),\"\")","v":0},{"$f":"IFERROR(IF($G$14=\"BEER EXCHANGE\",INDEX(Data!$DD$33:$DG$82,$D42,4),IF($G$14=\"BEER PACKAGE\",INDEX(Data!$CZ$33:$DC$82,$D42,4),IF($G$14=\"BEER SIDE ORDER\",(INDEX(Data!$DH$33:$DK$82,$D42,4)+INDEX(Data!$DL$33:$DO$82,$D42,4)+INDEX(Data!$DP$33:$DS$82,$D42,4)),IF($G$14=\"LIQUOR PACKAGE\",INDEX(Data!$DT$33:$DW$82,$D42,4),IF($G$14=\"LIQUOR SIDE ORDER\",INDEX(Data!$DX$33:$EA$82,$D42,4),IF($G$14=\"MEAL\",INDEX(Data!$CR$33:$CU$82,$D42,4),IF($G$14=\"MEMBERSHIP\",INDEX(Data!$CV$33:$CY$82,$D42,4),IF($G$14=\"WINE\",INDEX(Data!$EB$33:$EE$82,$D42,4),\"\")))))))),\"\")","v":0},0]
[null,{"$f":"'Report A'!$B45","v":"2014-07-14"},{"$f":"'Report A'!$C45","v":"Monday"},{"$f":"'Report A'!$D45","v":14},{"$f":"IFERROR(IF($G$14=\"BEER EXCHANGE\",INDEX(Data!$DD$33:$DG$82,$D43,1),IF($G$14=\"BEER PACKAGE\",INDEX(Data!$CZ$33:$DC$82,$D43,1),IF($G$14=\"BEER SIDE ORDER\",(INDEX(Data!$DH$33:$DK$82,$D43,1)+INDEX(Data!$DL$33:$DO$82,$D43,1)+INDEX(Data!$DP$33:$DS$82,$D43,1)),IF($G$14=\"LIQUOR PACKAGE\",INDEX(Data!$DT$33:$DW$82,$D43,1),IF($G$14=\"LIQUOR SIDE ORDER\",INDEX(Data!$DX$33:$EA$82,$D43,1),IF($G$14=\"MEAL\",INDEX(Data!$CR$33:$CU$82,$D43,1),IF($G$14=\"MEMBERSHIP\",INDEX(Data!$CV$33:$CY$82,$D43,1),IF($G$14=\"WINE\",INDEX(Data!$EB$33:$EE$82,$D43,1),\"\")))))))),\"\")","v":0},{"$f":"IFERROR(IF($G$14=\"BEER EXCHANGE\",INDEX(Data!$DD$33:$DG$82,$D43,2),IF($G$14=\"BEER PACKAGE\",INDEX(Data!$CZ$33:$DC$82,$D43,2),IF($G$14=\"BEER SIDE ORDER\",(INDEX(Data!$DH$33:$DK$82,$D43,2)+INDEX(Data!$DL$33:$DO$82,$D43,2)+INDEX(Data!$DP$33:$DS$82,$D43,2)),IF($G$14=\"LIQUOR PACKAGE\",INDEX(Data!$DT$33:$DW$82,$D43,2),IF($G$14=\"LIQUOR SIDE ORDER\",INDEX(Data!$DX$33:$EA$82,$D43,2),IF($G$14=\"MEAL\",INDEX(Data!$CR$33:$CU$82,$D43,2),IF($G$14=\"MEMBERSHIP\",INDEX(Data!$CV$33:$CY$82,$D43,2),IF($G$14=\"WINE\",INDEX(Data!$EB$33:$EE$82,$D43,2),\"\")))))))),\"\")","v":0},{"$f":"IFERROR(IF($G$14=\"BEER EXCHANGE\",INDEX(Data!$DD$33:$DG$82,$D43,3),IF($G$14=\"BEER PACKAGE\",INDEX(Data!$CZ$33:$DC$82,$D43,3),IF($G$14=\"BEER SIDE ORDER\",(INDEX(Data!$DH$33:$DK$82,$D43,3)+INDEX(Data!$DL$33:$DO$82,$D43,3)+INDEX(Data!$DP$33:$DS$82,$D43,3)),IF($G$14=\"LIQUOR PACKAGE\",INDEX(Data!$DT$33:$DW$82,$D43,3),IF($G$14=\"LIQUOR SIDE ORDER\",INDEX(Data!$DX$33:$EA$82,$D43,3),IF($G$14=\"MEAL\",INDEX(Data!$CR$33:$CU$82,$D43,3),IF($G$14=\"MEMBERSHIP\",INDEX(Data!$CV$33:$CY$82,$D43,3),IF($G$14=\"WINE\",INDEX(Data!$EB$33:$EE$82,$D43,3),\"\")))))))),\"\")","v":0},{"$f":"IFERROR(IF($G$14=\"BEER EXCHANGE\",INDEX(Data!$DD$33:$DG$82,$D43,4),IF($G$14=\"BEER PACKAGE\",INDEX(Data!$CZ$33:$DC$82,$D43,4),IF($G$14=\"BEER SIDE ORDER\",(INDEX(Data!$DH$33:$DK$82,$D43,4)+INDEX(Data!$DL$33:$DO$82,$D43,4)+INDEX(Data!$DP$33:$DS$82,$D43,4)),IF($G$14=\"LIQUOR PACKAGE\",INDEX(Data!$DT$33:$DW$82,$D43,4),IF($G$14=\"LIQUOR SIDE ORDER\",INDEX(Data!$DX$33:$EA$82,$D43,4),IF($G$14=\"MEAL\",INDEX(Data!$CR$33:$CU$82,$D43,4),IF($G$14=\"MEMBERSHIP\",INDEX(Data!$CV$33:$CY$82,$D43,4),IF($G$14=\"WINE\",INDEX(Data!$EB$33:$EE$82,$D43,4),\"\")))))))),\"\")","v":0},0]
[null,{"$f":"'Report A'!$B46","v":"2014-07-15"},{"$f":"'Report A'!$C46","v":"Tuesday"},{"$f":"'Report A'!$D46","v":15},{"$f":"IFERROR(IF($G$14=\"BEER EXCHANGE\",INDEX(Data!$DD$33:$DG$82,$D44,1),IF($G$14=\"BEER PACKAGE\",INDEX(Data!$CZ$33:$DC$82,$D44,1),IF($G$14=\"BEER SIDE ORDER\",(INDEX(Data!$DH$33:$DK$82,$D44,1)+INDEX(Data!$DL$33:$DO$82,$D44,1)+INDEX(Data!$DP$33:$DS$82,$D44,1)),IF($G$14=\"LIQUOR PACKAGE\",INDEX(Data!$DT$33:$DW$82,$D44,1),IF($G$14=\"LIQUOR SIDE ORDER\",INDEX(Data!$DX$33:$EA$82,$D44,1),IF($G$14=\"MEAL\",INDEX(Data!$CR$33:$CU$82,$D44,1),IF($G$14=\"MEMBERSHIP\",INDEX(Data!$CV$33:$CY$82,$D44,1),IF($G$14=\"WINE\",INDEX(Data!$EB$33:$EE$82,$D44,1),\"\")))))))),\"\")","v":0},{"$f":"IFERROR(IF($G$14=\"BEER EXCHANGE\",INDEX(Data!$DD$33:$DG$82,$D44,2),IF($G$14=\"BEER PACKAGE\",INDEX(Data!$CZ$33:$DC$82,$D44,2),IF($G$14=\"BEER SIDE ORDER\",(INDEX(Data!$DH$33:$DK$82,$D44,2)+INDEX(Data!$DL$33:$DO$82,$D44,2)+INDEX(Data!$DP$33:$DS$82,$D44,2)),IF($G$14=\"LIQUOR PACKAGE\",INDEX(Data!$DT$33:$DW$82,$D44,2),IF($G$14=\"LIQUOR SIDE ORDER\",INDEX(Data!$DX$33:$EA$82,$D44,2),IF($G$14=\"MEAL\",INDEX(Data!$CR$33:$CU$82,$D44,2),IF($G$14=\"MEMBERSHIP\",INDEX(Data!$CV$33:$CY$82,$D44,2),IF($G$14=\"WINE\",INDEX(Data!$EB$33:$EE$82,$D44,2),\"\")))))))),\"\")","v":0},{"$f":"IFERROR(IF($G$14=\"BEER EXCHANGE\",INDEX(Data!$DD$33:$DG$82,$D44,3),IF($G$14=\"BEER PACKAGE\",INDEX(Data!$CZ$33:$DC$82,$D44,3),IF($G$14=\"BEER SIDE ORDER\",(INDEX(Data!$DH$33:$DK$82,$D44,3)+INDEX(Data!$DL$33:$DO$82,$D44,3)+INDEX(Data!$DP$33:$DS$82,$D44,3)),IF($G$14=\"LIQUOR PACKAGE\",INDEX(Data!$DT$33:$DW$82,$D44,3),IF($G$14=\"LIQUOR SIDE ORDER\",INDEX(Data!$DX$33:$EA$82,$D44,3),IF($G$14=\"MEAL\",INDEX(Data!$CR$33:$CU$82,$D44,3),IF($G$14=\"MEMBERSHIP\",INDEX(Data!$CV$33:$CY$82,$D44,3),IF($G$14=\"WINE\",INDEX(Data!$EB$33:$EE$82,$D44,3),\"\")))))))),\"\")","v":0},{"$f":"IFERROR(IF($G$14=\"BEER EXCHANGE\",INDEX(Data!$DD$33:$DG$82,$D44,4),IF($G$14=\"BEER PACKAGE\",INDEX(Data!$CZ$33:$DC$82,$D44,4),IF($G$14=\"BEER SIDE ORDER\",(INDEX(Data!$DH$33:$DK$82,$D44,4)+INDEX(Data!$DL$33:$DO$82,$D44,4)+INDEX(Data!$DP$33:$DS$82,$D44,4)),IF($G$14=\"LIQUOR PACKAGE\",INDEX(Data!$DT$33:$DW$82,$D44,4),IF($G$14=\"LIQUOR SIDE ORDER\",INDEX(Data!$DX$33:$EA$82,$D44,4),IF($G$14=\"MEAL\",INDEX(Data!$CR$33:$CU$82,$D44,4),IF($G$14=\"MEMBERSHIP\",INDEX(Data!$CV$33:$CY$82,$D44,4),IF($G$14=\"WINE\",INDEX(Data!$EB$33:$EE$82,$D44,4),\"\")))))))),\"\")","v":0},0]
[null,{"$f":"'Report A'!$B47","v":"2014-07-16"},{"$f":"'Report A'!$C47","v":"Wednesday"},{"$f":"'Report A'!$D47","v":16},{"$f":"IFERROR(IF($G$14=\"BEER EXCHANGE\",INDEX(Data!$DD$33:$DG$82,$D45,1),IF($G$14=\"BEER PACKAGE\",INDEX(Data!$CZ$33:$DC$82,$D45,1),IF($G$14=\"BEER SIDE ORDER\",(INDEX(Data!$DH$33:$DK$82,$D45,1)+INDEX(Data!$DL$33:$DO$82,$D45,1)+INDEX(Data!$DP$33:$DS$82,$D45,1)),IF($G$14=\"LIQUOR PACKAGE\",INDEX(Data!$DT$33:$DW$82,$D45,1),IF($G$14=\"LIQUOR SIDE ORDER\",INDEX(Data!$DX$33:$EA$82,$D45,1),IF($G$14=\"MEAL\",INDEX(Data!$CR$33:$CU$82,$D45,1),IF($G$14=\"MEMBERSHIP\",INDEX(Data!$CV$33:$CY$82,$D45,1),IF($G$14=\"WINE\",INDEX(Data!$EB$33:$EE$82,$D45,1),\"\")))))))),\"\")","v":0},{"$f":"IFERROR(IF($G$14=\"BEER EXCHANGE\",INDEX(Data!$DD$33:$DG$82,$D45,2),IF($G$14=\"BEER PACKAGE\",INDEX(Data!$CZ$33:$DC$82,$D45,2),IF($G$14=\"BEER SIDE ORDER\",(INDEX(Data!$DH$33:$DK$82,$D45,2)+INDEX(Data!$DL$33:$DO$82,$D45,2)+INDEX(Data!$DP$33:$DS$82,$D45,2)),IF($G$14=\"LIQUOR PACKAGE\",INDEX(Data!$DT$33:$DW$82,$D45,2),IF($G$14=\"LIQUOR SIDE ORDER\",INDEX(Data!$DX$33:$EA$82,$D45,2),IF($G$14=\"MEAL\",INDEX(Data!$CR$33:$CU$82,$D45,2),IF($G$14=\"MEMBERSHIP\",INDEX(Data!$CV$33:$CY$82,$D45,2),IF($G$14=\"WINE\",INDEX(Data!$EB$33:$EE$82,$D45,2),\"\")))))))),\"\")","v":0},{"$f":"IFERROR(IF($G$14=\"BEER EXCHANGE\",INDEX(Data!$DD$33:$DG$82,$D45,3),IF($G$14=\"BEER PACKAGE\",INDEX(Data!$CZ$33:$DC$82,$D45,3),IF($G$14=\"BEER SIDE ORDER\",(INDEX(Data!$DH$33:$DK$82,$D45,3)+INDEX(Data!$DL$33:$DO$82,$D45,3)+INDEX(Data!$DP$33:$DS$82,$D45,3)),IF($G$14=\"LIQUOR PACKAGE\",INDEX(Data!$DT$33:$DW$82,$D45,3),IF($G$14=\"LIQUOR SIDE ORDER\",INDEX(Data!$DX$33:$EA$82,$D45,3),IF($G$14=\"MEAL\",INDEX(Data!$CR$33:$CU$82,$D45,3),IF($G$14=\"MEMBERSHIP\",INDEX(Data!$CV$33:$CY$82,$D45,3),IF($G$14=\"WINE\",INDEX(Data!$EB$33:$EE$82,$D45,3),\"\")))))))),\"\")","v":0},{"$f":"IFERROR(IF($G$14=\"BEER EXCHANGE\",INDEX(Data!$DD$33:$DG$82,$D45,4),IF($G$14=\"BEER PACKAGE\",INDEX(Data!$CZ$33:$DC$82,$D45,4),IF($G$14=\"BEER SIDE ORDER\",(INDEX(Data!$DH$33:$DK$82,$D45,4)+INDEX(Data!$DL$33:$DO$82,$D45,4)+INDEX(Data!$DP$33:$DS$82,$D45,4)),IF($G$14=\"LIQUOR PACKAGE\",INDEX(Data!$DT$33:$DW$82,$D45,4),IF($G$14=\"LIQUOR SIDE ORDER\",INDEX(Data!$DX$33:$EA$82,$D45,4),IF($G$14=\"MEAL\",INDEX(Data!$CR$33:$CU$82,$D45,4),IF($G$14=\"MEMBERSHIP\",INDEX(Data!$CV$33:$CY$82,$D45,4),IF($G$14=\"WINE\",INDEX(Data!$EB$33:$EE$82,$D45,4),\"\")))))))),\"\")","v":0},0]
[null,{"$f":"'Report A'!$B48","v":"2014-07-17"},{"$f":"'Report A'!$C48","v":"Thursday"},{"$f":"'Report A'!$D48","v":17},{"$f":"IFERROR(IF($G$14=\"BEER EXCHANGE\",INDEX(Data!$DD$33:$DG$82,$D46,1),IF($G$14=\"BEER PACKAGE\",INDEX(Data!$CZ$33:$DC$82,$D46,1),IF($G$14=\"BEER SIDE ORDER\",(INDEX(Data!$DH$33:$DK$82,$D46,1)+INDEX(Data!$DL$33:$DO$82,$D46,1)+INDEX(Data!$DP$33:$DS$82,$D46,1)),IF($G$14=\"LIQUOR PACKAGE\",INDEX(Data!$DT$33:$DW$82,$D46,1),IF($G$14=\"LIQUOR SIDE ORDER\",INDEX(Data!$DX$33:$EA$82,$D46,1),IF($G$14=\"MEAL\",INDEX(Data!$CR$33:$CU$82,$D46,1),IF($G$14=\"MEMBERSHIP\",INDEX(Data!$CV$33:$CY$82,$D46,1),IF($G$14=\"WINE\",INDEX(Data!$EB$33:$EE$82,$D46,1),\"\")))))))),\"\")","v":0},{"$f":"IFERROR(IF($G$14=\"BEER EXCHANGE\",INDEX(Data!$DD$33:$DG$82,$D46,2),IF($G$14=\"BEER PACKAGE\",INDEX(Data!$CZ$33:$DC$82,$D46,2),IF($G$14=\"BEER SIDE ORDER\",(INDEX(Data!$DH$33:$DK$82,$D46,2)+INDEX(Data!$DL$33:$DO$82,$D46,2)+INDEX(Data!$DP$33:$DS$82,$D46,2)),IF($G$14=\"LIQUOR PACKAGE\",INDEX(Data!$DT$33:$DW$82,$D46,2),IF($G$14=\"LIQUOR SIDE ORDER\",INDEX(Data!$DX$33:$EA$82,$D46,2),IF($G$14=\"MEAL\",INDEX(Data!$CR$33:$CU$82,$D46,2),IF($G$14=\"MEMBERSHIP\",INDEX(Data!$CV$33:$CY$82,$D46,2),IF($G$14=\"WINE\",INDEX(Data!$EB$33:$EE$82,$D46,2),\"\")))))))),\"\")","v":0},{"$f":"IFERROR(IF($G$14=\"BEER EXCHANGE\",INDEX(Data!$DD$33:$DG$82,$D46,3),IF($G$14=\"BEER PACKAGE\",INDEX(Data!$CZ$33:$DC$82,$D46,3),IF($G$14=\"BEER SIDE ORDER\",(INDEX(Data!$DH$33:$DK$82,$D46,3)+INDEX(Data!$DL$33:$DO$82,$D46,3)+INDEX(Data!$DP$33:$DS$82,$D46,3)),IF($G$14=\"LIQUOR PACKAGE\",INDEX(Data!$DT$33:$DW$82,$D46,3),IF($G$14=\"LIQUOR SIDE ORDER\",INDEX(Data!$DX$33:$EA$82,$D46,3),IF($G$14=\"MEAL\",INDEX(Data!$CR$33:$CU$82,$D46,3),IF($G$14=\"MEMBERSHIP\",INDEX(Data!$CV$33:$CY$82,$D46,3),IF($G$14=\"WINE\",INDEX(Data!$EB$33:$EE$82,$D46,3),\"\")))))))),\"\")","v":0},{"$f":"IFERROR(IF($G$14=\"BEER EXCHANGE\",INDEX(Data!$DD$33:$DG$82,$D46,4),IF($G$14=\"BEER PACKAGE\",INDEX(Data!$CZ$33:$DC$82,$D46,4),IF($G$14=\"BEER SIDE ORDER\",(INDEX(Data!$DH$33:$DK$82,$D46,4)+INDEX(Data!$DL$33:$DO$82,$D46,4)+INDEX(Data!$DP$33:$DS$82,$D46,4)),IF($G$14=\"LIQUOR PACKAGE\",INDEX(Data!$DT$33:$DW$82,$D46,4),IF($G$14=\"LIQUOR SIDE ORDER\",INDEX(Data!$DX$33:$EA$82,$D46,4),IF($G$14=\"MEAL\",INDEX(Data!$CR$33:$CU$82,$D46,4),IF($G$14=\"MEMBERSHIP\",INDEX(Data!$CV$33:$CY$82,$D46,4),IF($G$14=\"WINE\",INDEX(Data!$EB$33:$EE$82,$D46,4),\"\")))))))),\"\")","v":0},0]
[null,{"$f":"'Report A'!$B49","v":"2014-07-18"},{"$f":"'Report A'!$C49","v":"Friday"},{"$f":"'Report A'!$D49","v":18},{"$f":"IFERROR(IF($G$14=\"BEER EXCHANGE\",INDEX(Data!$DD$33:$DG$82,$D47,1),IF($G$14=\"BEER PACKAGE\",INDEX(Data!$CZ$33:$DC$82,$D47,1),IF($G$14=\"BEER SIDE ORDER\",(INDEX(Data!$DH$33:$DK$82,$D47,1)+INDEX(Data!$DL$33:$DO$82,$D47,1)+INDEX(Data!$DP$33:$DS$82,$D47,1)),IF($G$14=\"LIQUOR PACKAGE\",INDEX(Data!$DT$33:$DW$82,$D47,1),IF($G$14=\"LIQUOR SIDE ORDER\",INDEX(Data!$DX$33:$EA$82,$D47,1),IF($G$14=\"MEAL\",INDEX(Data!$CR$33:$CU$82,$D47,1),IF($G$14=\"MEMBERSHIP\",INDEX(Data!$CV$33:$CY$82,$D47,1),IF($G$14=\"WINE\",INDEX(Data!$EB$33:$EE$82,$D47,1),\"\")))))))),\"\")","v":0},{"$f":"IFERROR(IF($G$14=\"BEER EXCHANGE\",INDEX(Data!$DD$33:$DG$82,$D47,2),IF($G$14=\"BEER PACKAGE\",INDEX(Data!$CZ$33:$DC$82,$D47,2),IF($G$14=\"BEER SIDE ORDER\",(INDEX(Data!$DH$33:$DK$82,$D47,2)+INDEX(Data!$DL$33:$DO$82,$D47,2)+INDEX(Data!$DP$33:$DS$82,$D47,2)),IF($G$14=\"LIQUOR PACKAGE\",INDEX(Data!$DT$33:$DW$82,$D47,2),IF($G$14=\"LIQUOR SIDE ORDER\",INDEX(Data!$DX$33:$EA$82,$D47,2),IF($G$14=\"MEAL\",INDEX(Data!$CR$33:$CU$82,$D47,2),IF($G$14=\"MEMBERSHIP\",INDEX(Data!$CV$33:$CY$82,$D47,2),IF($G$14=\"WINE\",INDEX(Data!$EB$33:$EE$82,$D47,2),\"\")))))))),\"\")","v":0},{"$f":"IFERROR(IF($G$14=\"BEER EXCHANGE\",INDEX(Data!$DD$33:$DG$82,$D47,3),IF($G$14=\"BEER PACKAGE\",INDEX(Data!$CZ$33:$DC$82,$D47,3),IF($G$14=\"BEER SIDE ORDER\",(INDEX(Data!$DH$33:$DK$82,$D47,3)+INDEX(Data!$DL$33:$DO$82,$D47,3)+INDEX(Data!$DP$33:$DS$82,$D47,3)),IF($G$14=\"LIQUOR PACKAGE\",INDEX(Data!$DT$33:$DW$82,$D47,3),IF($G$14=\"LIQUOR SIDE ORDER\",INDEX(Data!$DX$33:$EA$82,$D47,3),IF($G$14=\"MEAL\",INDEX(Data!$CR$33:$CU$82,$D47,3),IF($G$14=\"MEMBERSHIP\",INDEX(Data!$CV$33:$CY$82,$D47,3),IF($G$14=\"WINE\",INDEX(Data!$EB$33:$EE$82,$D47,3),\"\")))))))),\"\")","v":0},{"$f":"IFERROR(IF($G$14=\"BEER EXCHANGE\",INDEX(Data!$DD$33:$DG$82,$D47,4),IF($G$14=\"BEER PACKAGE\",INDEX(Data!$CZ$33:$DC$82,$D47,4),IF($G$14=\"BEER SIDE ORDER\",(INDEX(Data!$DH$33:$DK$82,$D47,4)+INDEX(Data!$DL$33:$DO$82,$D47,4)+INDEX(Data!$DP$33:$DS$82,$D47,4)),IF($G$14=\"LIQUOR PACKAGE\",INDEX(Data!$DT$33:$DW$82,$D47,4),IF($G$14=\"LIQUOR SIDE ORDER\",INDEX(Data!$DX$33:$EA$82,$D47,4),IF($G$14=\"MEAL\",INDEX(Data!$CR$33:$CU$82,$D47,4),IF($G$14=\"MEMBERSHIP\",INDEX(Data!$CV$33:$CY$82,$D47,4),IF($G$14=\"WINE\",INDEX(Data!$EB$33:$EE$82,$D47,4),\"\")))))))),\"\")","v":0},0]
[null,{"$f":"'Report A'!$B50","v":"2014-07-19"},{"$f":"'Report A'!$C50","v":"Saturday"},{"$f":"'Report A'!$D50","v":19},{"$f":"IFERROR(IF($G$14=\"BEER EXCHANGE\",INDEX(Data!$DD$33:$DG$82,$D48,1),IF($G$14=\"BEER PACKAGE\",INDEX(Data!$CZ$33:$DC$82,$D48,1),IF($G$14=\"BEER SIDE ORDER\",(INDEX(Data!$DH$33:$DK$82,$D48,1)+INDEX(Data!$DL$33:$DO$82,$D48,1)+INDEX(Data!$DP$33:$DS$82,$D48,1)),IF($G$14=\"LIQUOR PACKAGE\",INDEX(Data!$DT$33:$DW$82,$D48,1),IF($G$14=\"LIQUOR SIDE ORDER\",INDEX(Data!$DX$33:$EA$82,$D48,1),IF($G$14=\"MEAL\",INDEX(Data!$CR$33:$CU$82,$D48,1),IF($G$14=\"MEMBERSHIP\",INDEX(Data!$CV$33:$CY$82,$D48,1),IF($G$14=\"WINE\",INDEX(Data!$EB$33:$EE$82,$D48,1),\"\")))))))),\"\")","v":0},{"$f":"IFERROR(IF($G$14=\"BEER EXCHANGE\",INDEX(Data!$DD$33:$DG$82,$D48,2),IF($G$14=\"BEER PACKAGE\",INDEX(Data!$CZ$33:$DC$82,$D48,2),IF($G$14=\"BEER SIDE ORDER\",(INDEX(Data!$DH$33:$DK$82,$D48,2)+INDEX(Data!$DL$33:$DO$82,$D48,2)+INDEX(Data!$DP$33:$DS$82,$D48,2)),IF($G$14=\"LIQUOR PACKAGE\",INDEX(Data!$DT$33:$DW$82,$D48,2),IF($G$14=\"LIQUOR SIDE ORDER\",INDEX(Data!$DX$33:$EA$82,$D48,2),IF($G$14=\"MEAL\",INDEX(Data!$CR$33:$CU$82,$D48,2),IF($G$14=\"MEMBERSHIP\",INDEX(Data!$CV$33:$CY$82,$D48,2),IF($G$14=\"WINE\",INDEX(Data!$EB$33:$EE$82,$D48,2),\"\")))))))),\"\")","v":0},{"$f":"IFERROR(IF($G$14=\"BEER EXCHANGE\",INDEX(Data!$DD$33:$DG$82,$D48,3),IF($G$14=\"BEER PACKAGE\",INDEX(Data!$CZ$33:$DC$82,$D48,3),IF($G$14=\"BEER SIDE ORDER\",(INDEX(Data!$DH$33:$DK$82,$D48,3)+INDEX(Data!$DL$33:$DO$82,$D48,3)+INDEX(Data!$DP$33:$DS$82,$D48,3)),IF($G$14=\"LIQUOR PACKAGE\",INDEX(Data!$DT$33:$DW$82,$D48,3),IF($G$14=\"LIQUOR SIDE ORDER\",INDEX(Data!$DX$33:$EA$82,$D48,3),IF($G$14=\"MEAL\",INDEX(Data!$CR$33:$CU$82,$D48,3),IF($G$14=\"MEMBERSHIP\",INDEX(Data!$CV$33:$CY$82,$D48,3),IF($G$14=\"WINE\",INDEX(Data!$EB$33:$EE$82,$D48,3),\"\")))))))),\"\")","v":0},{"$f":"IFERROR(IF($G$14=\"BEER EXCHANGE\",INDEX(Data!$DD$33:$DG$82,$D48,4),IF($G$14=\"BEER PACKAGE\",INDEX(Data!$CZ$33:$DC$82,$D48,4),IF($G$14=\"BEER SIDE ORDER\",(INDEX(Data!$DH$33:$DK$82,$D48,4)+INDEX(Data!$DL$33:$DO$82,$D48,4)+INDEX(Data!$DP$33:$DS$82,$D48,4)),IF($G$14=\"LIQUOR PACKAGE\",INDEX(Data!$DT$33:$DW$82,$D48,4),IF($G$14=\"LIQUOR SIDE ORDER\",INDEX(Data!$DX$33:$EA$82,$D48,4),IF($G$14=\"MEAL\",INDEX(Data!$CR$33:$CU$82,$D48,4),IF($G$14=\"MEMBERSHIP\",INDEX(Data!$CV$33:$CY$82,$D48,4),IF($G$14=\"WINE\",INDEX(Data!$EB$33:$EE$82,$D48,4),\"\")))))))),\"\")","v":0},0]
[null,{"$f":"'Report A'!$B51","v":"2014-07-20"},{"$f":"'Report A'!$C51","v":"Sunday"},{"$f":"'Report A'!$D51","v":20},{"$f":"IFERROR(IF($G$14=\"BEER EXCHANGE\",INDEX(Data!$DD$33:$DG$82,$D49,1),IF($G$14=\"BEER PACKAGE\",INDEX(Data!$CZ$33:$DC$82,$D49,1),IF($G$14=\"BEER SIDE ORDER\",(INDEX(Data!$DH$33:$DK$82,$D49,1)+INDEX(Data!$DL$33:$DO$82,$D49,1)+INDEX(Data!$DP$33:$DS$82,$D49,1)),IF($G$14=\"LIQUOR PACKAGE\",INDEX(Data!$DT$33:$DW$82,$D49,1),IF($G$14=\"LIQUOR SIDE ORDER\",INDEX(Data!$DX$33:$EA$82,$D49,1),IF($G$14=\"MEAL\",INDEX(Data!$CR$33:$CU$82,$D49,1),IF($G$14=\"MEMBERSHIP\",INDEX(Data!$CV$33:$CY$82,$D49,1),IF($G$14=\"WINE\",INDEX(Data!$EB$33:$EE$82,$D49,1),\"\")))))))),\"\")","v":0},{"$f":"IFERROR(IF($G$14=\"BEER EXCHANGE\",INDEX(Data!$DD$33:$DG$82,$D49,2),IF($G$14=\"BEER PACKAGE\",INDEX(Data!$CZ$33:$DC$82,$D49,2),IF($G$14=\"BEER SIDE ORDER\",(INDEX(Data!$DH$33:$DK$82,$D49,2)+INDEX(Data!$DL$33:$DO$82,$D49,2)+INDEX(Data!$DP$33:$DS$82,$D49,2)),IF($G$14=\"LIQUOR PACKAGE\",INDEX(Data!$DT$33:$DW$82,$D49,2),IF($G$14=\"LIQUOR SIDE ORDER\",INDEX(Data!$DX$33:$EA$82,$D49,2),IF($G$14=\"MEAL\",INDEX(Data!$CR$33:$CU$82,$D49,2),IF($G$14=\"MEMBERSHIP\",INDEX(Data!$CV$33:$CY$82,$D49,2),IF($G$14=\"WINE\",INDEX(Data!$EB$33:$EE$82,$D49,2),\"\")))))))),\"\")","v":0},{"$f":"IFERROR(IF($G$14=\"BEER EXCHANGE\",INDEX(Data!$DD$33:$DG$82,$D49,3),IF($G$14=\"BEER PACKAGE\",INDEX(Data!$CZ$33:$DC$82,$D49,3),IF($G$14=\"BEER SIDE ORDER\",(INDEX(Data!$DH$33:$DK$82,$D49,3)+INDEX(Data!$DL$33:$DO$82,$D49,3)+INDEX(Data!$DP$33:$DS$82,$D49,3)),IF($G$14=\"LIQUOR PACKAGE\",INDEX(Data!$DT$33:$DW$82,$D49,3),IF($G$14=\"LIQUOR SIDE ORDER\",INDEX(Data!$DX$33:$EA$82,$D49,3),IF($G$14=\"MEAL\",INDEX(Data!$CR$33:$CU$82,$D49,3),IF($G$14=\"MEMBERSHIP\",INDEX(Data!$CV$33:$CY$82,$D49,3),IF($G$14=\"WINE\",INDEX(Data!$EB$33:$EE$82,$D49,3),\"\")))))))),\"\")","v":0},{"$f":"IFERROR(IF($G$14=\"BEER EXCHANGE\",INDEX(Data!$DD$33:$DG$82,$D49,4),IF($G$14=\"BEER PACKAGE\",INDEX(Data!$CZ$33:$DC$82,$D49,4),IF($G$14=\"BEER SIDE ORDER\",(INDEX(Data!$DH$33:$DK$82,$D49,4)+INDEX(Data!$DL$33:$DO$82,$D49,4)+INDEX(Data!$DP$33:$DS$82,$D49,4)),IF($G$14=\"LIQUOR PACKAGE\",INDEX(Data!$DT$33:$DW$82,$D49,4),IF($G$14=\"LIQUOR SIDE ORDER\",INDEX(Data!$DX$33:$EA$82,$D49,4),IF($G$14=\"MEAL\",INDEX(Data!$CR$33:$CU$82,$D49,4),IF($G$14=\"MEMBERSHIP\",INDEX(Data!$CV$33:$CY$82,$D49,4),IF($G$14=\"WINE\",INDEX(Data!$EB$33:$EE$82,$D49,4),\"\")))))))),\"\")","v":0},0]
[null,{"$f":"'Report A'!$B52","v":"2014-07-21"},{"$f":"'Report A'!$C52","v":"Monday"},{"$f":"'Report A'!$D52","v":21},{"$f":"IFERROR(IF($G$14=\"BEER EXCHANGE\",INDEX(Data!$DD$33:$DG$82,$D50,1),IF($G$14=\"BEER PACKAGE\",INDEX(Data!$CZ$33:$DC$82,$D50,1),IF($G$14=\"BEER SIDE ORDER\",(INDEX(Data!$DH$33:$DK$82,$D50,1)+INDEX(Data!$DL$33:$DO$82,$D50,1)+INDEX(Data!$DP$33:$DS$82,$D50,1)),IF($G$14=\"LIQUOR PACKAGE\",INDEX(Data!$DT$33:$DW$82,$D50,1),IF($G$14=\"LIQUOR SIDE ORDER\",INDEX(Data!$DX$33:$EA$82,$D50,1),IF($G$14=\"MEAL\",INDEX(Data!$CR$33:$CU$82,$D50,1),IF($G$14=\"MEMBERSHIP\",INDEX(Data!$CV$33:$CY$82,$D50,1),IF($G$14=\"WINE\",INDEX(Data!$EB$33:$EE$82,$D50,1),\"\")))))))),\"\")","v":0},{"$f":"IFERROR(IF($G$14=\"BEER EXCHANGE\",INDEX(Data!$DD$33:$DG$82,$D50,2),IF($G$14=\"BEER PACKAGE\",INDEX(Data!$CZ$33:$DC$82,$D50,2),IF($G$14=\"BEER SIDE ORDER\",(INDEX(Data!$DH$33:$DK$82,$D50,2)+INDEX(Data!$DL$33:$DO$82,$D50,2)+INDEX(Data!$DP$33:$DS$82,$D50,2)),IF($G$14=\"LIQUOR PACKAGE\",INDEX(Data!$DT$33:$DW$82,$D50,2),IF($G$14=\"LIQUOR SIDE ORDER\",INDEX(Data!$DX$33:$EA$82,$D50,2),IF($G$14=\"MEAL\",INDEX(Data!$CR$33:$CU$82,$D50,2),IF($G$14=\"MEMBERSHIP\",INDEX(Data!$CV$33:$CY$82,$D50,2),IF($G$14=\"WINE\",INDEX(Data!$EB$33:$EE$82,$D50,2),\"\")))))))),\"\")","v":0},{"$f":"IFERROR(IF($G$14=\"BEER EXCHANGE\",INDEX(Data!$DD$33:$DG$82,$D50,3),IF($G$14=\"BEER PACKAGE\",INDEX(Data!$CZ$33:$DC$82,$D50,3),IF($G$14=\"BEER SIDE ORDER\",(INDEX(Data!$DH$33:$DK$82,$D50,3)+INDEX(Data!$DL$33:$DO$82,$D50,3)+INDEX(Data!$DP$33:$DS$82,$D50,3)),IF($G$14=\"LIQUOR PACKAGE\",INDEX(Data!$DT$33:$DW$82,$D50,3),IF($G$14=\"LIQUOR SIDE ORDER\",INDEX(Data!$DX$33:$EA$82,$D50,3),IF($G$14=\"MEAL\",INDEX(Data!$CR$33:$CU$82,$D50,3),IF($G$14=\"MEMBERSHIP\",INDEX(Data!$CV$33:$CY$82,$D50,3),IF($G$14=\"WINE\",INDEX(Data!$EB$33:$EE$82,$D50,3),\"\")))))))),\"\")","v":0},{"$f":"IFERROR(IF($G$14=\"BEER EXCHANGE\",INDEX(Data!$DD$33:$DG$82,$D50,4),IF($G$14=\"BEER PACKAGE\",INDEX(Data!$CZ$33:$DC$82,$D50,4),IF($G$14=\"BEER SIDE ORDER\",(INDEX(Data!$DH$33:$DK$82,$D50,4)+INDEX(Data!$DL$33:$DO$82,$D50,4)+INDEX(Data!$DP$33:$DS$82,$D50,4)),IF($G$14=\"LIQUOR PACKAGE\",INDEX(Data!$DT$33:$DW$82,$D50,4),IF($G$14=\"LIQUOR SIDE ORDER\",INDEX(Data!$DX$33:$EA$82,$D50,4),IF($G$14=\"MEAL\",INDEX(Data!$CR$33:$CU$82,$D50,4),IF($G$14=\"MEMBERSHIP\",INDEX(Data!$CV$33:$CY$82,$D50,4),IF($G$14=\"WINE\",INDEX(Data!$EB$33:$EE$82,$D50,4),\"\")))))))),\"\")","v":0},0]
[null,{"$f":"'Report A'!$B53","v":"2014-07-22"},{"$f":"'Report A'!$C53","v":"Tuesday"},{"$f":"'Report A'!$D53","v":22},{"$f":"IFERROR(IF($G$14=\"BEER EXCHANGE\",INDEX(Data!$DD$33:$DG$82,$D51,1),IF($G$14=\"BEER PACKAGE\",INDEX(Data!$CZ$33:$DC$82,$D51,1),IF($G$14=\"BEER SIDE ORDER\",(INDEX(Data!$DH$33:$DK$82,$D51,1)+INDEX(Data!$DL$33:$DO$82,$D51,1)+INDEX(Data!$DP$33:$DS$82,$D51,1)),IF($G$14=\"LIQUOR PACKAGE\",INDEX(Data!$DT$33:$DW$82,$D51,1),IF($G$14=\"LIQUOR SIDE ORDER\",INDEX(Data!$DX$33:$EA$82,$D51,1),IF($G$14=\"MEAL\",INDEX(Data!$CR$33:$CU$82,$D51,1),IF($G$14=\"MEMBERSHIP\",INDEX(Data!$CV$33:$CY$82,$D51,1),IF($G$14=\"WINE\",INDEX(Data!$EB$33:$EE$82,$D51,1),\"\")))))))),\"\")","v":0},{"$f":"IFERROR(IF($G$14=\"BEER EXCHANGE\",INDEX(Data!$DD$33:$DG$82,$D51,2),IF($G$14=\"BEER PACKAGE\",INDEX(Data!$CZ$33:$DC$82,$D51,2),IF($G$14=\"BEER SIDE ORDER\",(INDEX(Data!$DH$33:$DK$82,$D51,2)+INDEX(Data!$DL$33:$DO$82,$D51,2)+INDEX(Data!$DP$33:$DS$82,$D51,2)),IF($G$14=\"LIQUOR PACKAGE\",INDEX(Data!$DT$33:$DW$82,$D51,2),IF($G$14=\"LIQUOR SIDE ORDER\",INDEX(Data!$DX$33:$EA$82,$D51,2),IF($G$14=\"MEAL\",INDEX(Data!$CR$33:$CU$82,$D51,2),IF($G$14=\"MEMBERSHIP\",INDEX(Data!$CV$33:$CY$82,$D51,2),IF($G$14=\"WINE\",INDEX(Data!$EB$33:$EE$82,$D51,2),\"\")))))))),\"\")","v":0},{"$f":"IFERROR(IF($G$14=\"BEER EXCHANGE\",INDEX(Data!$DD$33:$DG$82,$D51,3),IF($G$14=\"BEER PACKAGE\",INDEX(Data!$CZ$33:$DC$82,$D51,3),IF($G$14=\"BEER SIDE ORDER\",(INDEX(Data!$DH$33:$DK$82,$D51,3)+INDEX(Data!$DL$33:$DO$82,$D51,3)+INDEX(Data!$DP$33:$DS$82,$D51,3)),IF($G$14=\"LIQUOR PACKAGE\",INDEX(Data!$DT$33:$DW$82,$D51,3),IF($G$14=\"LIQUOR SIDE ORDER\",INDEX(Data!$DX$33:$EA$82,$D51,3),IF($G$14=\"MEAL\",INDEX(Data!$CR$33:$CU$82,$D51,3),IF($G$14=\"MEMBERSHIP\",INDEX(Data!$CV$33:$CY$82,$D51,3),IF($G$14=\"WINE\",INDEX(Data!$EB$33:$EE$82,$D51,3),\"\")))))))),\"\")","v":0},{"$f":"IFERROR(IF($G$14=\"BEER EXCHANGE\",INDEX(Data!$DD$33:$DG$82,$D51,4),IF($G$14=\"BEER PACKAGE\",INDEX(Data!$CZ$33:$DC$82,$D51,4),IF($G$14=\"BEER SIDE ORDER\",(INDEX(Data!$DH$33:$DK$82,$D51,4)+INDEX(Data!$DL$33:$DO$82,$D51,4)+INDEX(Data!$DP$33:$DS$82,$D51,4)),IF($G$14=\"LIQUOR PACKAGE\",INDEX(Data!$DT$33:$DW$82,$D51,4),IF($G$14=\"LIQUOR SIDE ORDER\",INDEX(Data!$DX$33:$EA$82,$D51,4),IF($G$14=\"MEAL\",INDEX(Data!$CR$33:$CU$82,$D51,4),IF($G$14=\"MEMBERSHIP\",INDEX(Data!$CV$33:$CY$82,$D51,4),IF($G$14=\"WINE\",INDEX(Data!$EB$33:$EE$82,$D51,4),\"\")))))))),\"\")","v":0},0]
[null,{"$f":"'Report A'!$B54","v":"2014-07-23"},{"$f":"'Report A'!$C54","v":"Wednesday"},{"$f":"'Report A'!$D54","v":23},{"$f":"IFERROR(IF($G$14=\"BEER EXCHANGE\",INDEX(Data!$DD$33:$DG$82,$D52,1),IF($G$14=\"BEER PACKAGE\",INDEX(Data!$CZ$33:$DC$82,$D52,1),IF($G$14=\"BEER SIDE ORDER\",(INDEX(Data!$DH$33:$DK$82,$D52,1)+INDEX(Data!$DL$33:$DO$82,$D52,1)+INDEX(Data!$DP$33:$DS$82,$D52,1)),IF($G$14=\"LIQUOR PACKAGE\",INDEX(Data!$DT$33:$DW$82,$D52,1),IF($G$14=\"LIQUOR SIDE ORDER\",INDEX(Data!$DX$33:$EA$82,$D52,1),IF($G$14=\"MEAL\",INDEX(Data!$CR$33:$CU$82,$D52,1),IF($G$14=\"MEMBERSHIP\",INDEX(Data!$CV$33:$CY$82,$D52,1),IF($G$14=\"WINE\",INDEX(Data!$EB$33:$EE$82,$D52,1),\"\")))))))),\"\")","v":0},{"$f":"IFERROR(IF($G$14=\"BEER EXCHANGE\",INDEX(Data!$DD$33:$DG$82,$D52,2),IF($G$14=\"BEER PACKAGE\",INDEX(Data!$CZ$33:$DC$82,$D52,2),IF($G$14=\"BEER SIDE ORDER\",(INDEX(Data!$DH$33:$DK$82,$D52,2)+INDEX(Data!$DL$33:$DO$82,$D52,2)+INDEX(Data!$DP$33:$DS$82,$D52,2)),IF($G$14=\"LIQUOR PACKAGE\",INDEX(Data!$DT$33:$DW$82,$D52,2),IF($G$14=\"LIQUOR SIDE ORDER\",INDEX(Data!$DX$33:$EA$82,$D52,2),IF($G$14=\"MEAL\",INDEX(Data!$CR$33:$CU$82,$D52,2),IF($G$14=\"MEMBERSHIP\",INDEX(Data!$CV$33:$CY$82,$D52,2),IF($G$14=\"WINE\",INDEX(Data!$EB$33:$EE$82,$D52,2),\"\")))))))),\"\")","v":0},{"$f":"IFERROR(IF($G$14=\"BEER EXCHANGE\",INDEX(Data!$DD$33:$DG$82,$D52,3),IF($G$14=\"BEER PACKAGE\",INDEX(Data!$CZ$33:$DC$82,$D52,3),IF($G$14=\"BEER SIDE ORDER\",(INDEX(Data!$DH$33:$DK$82,$D52,3)+INDEX(Data!$DL$33:$DO$82,$D52,3)+INDEX(Data!$DP$33:$DS$82,$D52,3)),IF($G$14=\"LIQUOR PACKAGE\",INDEX(Data!$DT$33:$DW$82,$D52,3),IF($G$14=\"LIQUOR SIDE ORDER\",INDEX(Data!$DX$33:$EA$82,$D52,3),IF($G$14=\"MEAL\",INDEX(Data!$CR$33:$CU$82,$D52,3),IF($G$14=\"MEMBERSHIP\",INDEX(Data!$CV$33:$CY$82,$D52,3),IF($G$14=\"WINE\",INDEX(Data!$EB$33:$EE$82,$D52,3),\"\")))))))),\"\")","v":0},{"$f":"IFERROR(IF($G$14=\"BEER EXCHANGE\",INDEX(Data!$DD$33:$DG$82,$D52,4),IF($G$14=\"BEER PACKAGE\",INDEX(Data!$CZ$33:$DC$82,$D52,4),IF($G$14=\"BEER SIDE ORDER\",(INDEX(Data!$DH$33:$DK$82,$D52,4)+INDEX(Data!$DL$33:$DO$82,$D52,4)+INDEX(Data!$DP$33:$DS$82,$D52,4)),IF($G$14=\"LIQUOR PACKAGE\",INDEX(Data!$DT$33:$DW$82,$D52,4),IF($G$14=\"LIQUOR SIDE ORDER\",INDEX(Data!$DX$33:$EA$82,$D52,4),IF($G$14=\"MEAL\",INDEX(Data!$CR$33:$CU$82,$D52,4),IF($G$14=\"MEMBERSHIP\",INDEX(Data!$CV$33:$CY$82,$D52,4),IF($G$14=\"WINE\",INDEX(Data!$EB$33:$EE$82,$D52,4),\"\")))))))),\"\")","v":0},0]
[null,{"$f":"'Report A'!$B55","v":"2014-07-24"},{"$f":"'Report A'!$C55","v":"Thursday"},{"$f":"'Report A'!$D55","v":24},{"$f":"IFERROR(IF($G$14=\"BEER EXCHANGE\",INDEX(Data!$DD$33:$DG$82,$D53,1),IF($G$14=\"BEER PACKAGE\",INDEX(Data!$CZ$33:$DC$82,$D53,1),IF($G$14=\"BEER SIDE ORDER\",(INDEX(Data!$DH$33:$DK$82,$D53,1)+INDEX(Data!$DL$33:$DO$82,$D53,1)+INDEX(Data!$DP$33:$DS$82,$D53,1)),IF($G$14=\"LIQUOR PACKAGE\",INDEX(Data!$DT$33:$DW$82,$D53,1),IF($G$14=\"LIQUOR SIDE ORDER\",INDEX(Data!$DX$33:$EA$82,$D53,1),IF($G$14=\"MEAL\",INDEX(Data!$CR$33:$CU$82,$D53,1),IF($G$14=\"MEMBERSHIP\",INDEX(Data!$CV$33:$CY$82,$D53,1),IF($G$14=\"WINE\",INDEX(Data!$EB$33:$EE$82,$D53,1),\"\")))))))),\"\")","v":0},{"$f":"IFERROR(IF($G$14=\"BEER EXCHANGE\",INDEX(Data!$DD$33:$DG$82,$D53,2),IF($G$14=\"BEER PACKAGE\",INDEX(Data!$CZ$33:$DC$82,$D53,2),IF($G$14=\"BEER SIDE ORDER\",(INDEX(Data!$DH$33:$DK$82,$D53,2)+INDEX(Data!$DL$33:$DO$82,$D53,2)+INDEX(Data!$DP$33:$DS$82,$D53,2)),IF($G$14=\"LIQUOR PACKAGE\",INDEX(Data!$DT$33:$DW$82,$D53,2),IF($G$14=\"LIQUOR SIDE ORDER\",INDEX(Data!$DX$33:$EA$82,$D53,2),IF($G$14=\"MEAL\",INDEX(Data!$CR$33:$CU$82,$D53,2),IF($G$14=\"MEMBERSHIP\",INDEX(Data!$CV$33:$CY$82,$D53,2),IF($G$14=\"WINE\",INDEX(Data!$EB$33:$EE$82,$D53,2),\"\")))))))),\"\")","v":0},{"$f":"IFERROR(IF($G$14=\"BEER EXCHANGE\",INDEX(Data!$DD$33:$DG$82,$D53,3),IF($G$14=\"BEER PACKAGE\",INDEX(Data!$CZ$33:$DC$82,$D53,3),IF($G$14=\"BEER SIDE ORDER\",(INDEX(Data!$DH$33:$DK$82,$D53,3)+INDEX(Data!$DL$33:$DO$82,$D53,3)+INDEX(Data!$DP$33:$DS$82,$D53,3)),IF($G$14=\"LIQUOR PACKAGE\",INDEX(Data!$DT$33:$DW$82,$D53,3),IF($G$14=\"LIQUOR SIDE ORDER\",INDEX(Data!$DX$33:$EA$82,$D53,3),IF($G$14=\"MEAL\",INDEX(Data!$CR$33:$CU$82,$D53,3),IF($G$14=\"MEMBERSHIP\",INDEX(Data!$CV$33:$CY$82,$D53,3),IF($G$14=\"WINE\",INDEX(Data!$EB$33:$EE$82,$D53,3),\"\")))))))),\"\")","v":0},{"$f":"IFERROR(IF($G$14=\"BEER EXCHANGE\",INDEX(Data!$DD$33:$DG$82,$D53,4),IF($G$14=\"BEER PACKAGE\",INDEX(Data!$CZ$33:$DC$82,$D53,4),IF($G$14=\"BEER SIDE ORDER\",(INDEX(Data!$DH$33:$DK$82,$D53,4)+INDEX(Data!$DL$33:$DO$82,$D53,4)+INDEX(Data!$DP$33:$DS$82,$D53,4)),IF($G$14=\"LIQUOR PACKAGE\",INDEX(Data!$DT$33:$DW$82,$D53,4),IF($G$14=\"LIQUOR SIDE ORDER\",INDEX(Data!$DX$33:$EA$82,$D53,4),IF($G$14=\"MEAL\",INDEX(Data!$CR$33:$CU$82,$D53,4),IF($G$14=\"MEMBERSHIP\",INDEX(Data!$CV$33:$CY$82,$D53,4),IF($G$14=\"WINE\",INDEX(Data!$EB$33:$EE$82,$D53,4),\"\")))))))),\"\")","v":0},0]
[null,{"$f":"'Report A'!$B56","v":"2014-07-25"},{"$f":"'Report A'!$C56","v":"Friday"},{"$f":"'Report A'!$D56","v":25},{"$f":"IFERROR(IF($G$14=\"BEER EXCHANGE\",INDEX(Data!$DD$33:$DG$82,$D54,1),IF($G$14=\"BEER PACKAGE\",INDEX(Data!$CZ$33:$DC$82,$D54,1),IF($G$14=\"BEER SIDE ORDER\",(INDEX(Data!$DH$33:$DK$82,$D54,1)+INDEX(Data!$DL$33:$DO$82,$D54,1)+INDEX(Data!$DP$33:$DS$82,$D54,1)),IF($G$14=\"LIQUOR PACKAGE\",INDEX(Data!$DT$33:$DW$82,$D54,1),IF($G$14=\"LIQUOR SIDE ORDER\",INDEX(Data!$DX$33:$EA$82,$D54,1),IF($G$14=\"MEAL\",INDEX(Data!$CR$33:$CU$82,$D54,1),IF($G$14=\"MEMBERSHIP\",INDEX(Data!$CV$33:$CY$82,$D54,1),IF($G$14=\"WINE\",INDEX(Data!$EB$33:$EE$82,$D54,1),\"\")))))))),\"\")","v":0},{"$f":"IFERROR(IF($G$14=\"BEER EXCHANGE\",INDEX(Data!$DD$33:$DG$82,$D54,2),IF($G$14=\"BEER PACKAGE\",INDEX(Data!$CZ$33:$DC$82,$D54,2),IF($G$14=\"BEER SIDE ORDER\",(INDEX(Data!$DH$33:$DK$82,$D54,2)+INDEX(Data!$DL$33:$DO$82,$D54,2)+INDEX(Data!$DP$33:$DS$82,$D54,2)),IF($G$14=\"LIQUOR PACKAGE\",INDEX(Data!$DT$33:$DW$82,$D54,2),IF($G$14=\"LIQUOR SIDE ORDER\",INDEX(Data!$DX$33:$EA$82,$D54,2),IF($G$14=\"MEAL\",INDEX(Data!$CR$33:$CU$82,$D54,2),IF($G$14=\"MEMBERSHIP\",INDEX(Data!$CV$33:$CY$82,$D54,2),IF($G$14=\"WINE\",INDEX(Data!$EB$33:$EE$82,$D54,2),\"\")))))))),\"\")","v":0},{"$f":"IFERROR(IF($G$14=\"BEER EXCHANGE\",INDEX(Data!$DD$33:$DG$82,$D54,3),IF($G$14=\"BEER PACKAGE\",INDEX(Data!$CZ$33:$DC$82,$D54,3),IF($G$14=\"BEER SIDE ORDER\",(INDEX(Data!$DH$33:$DK$82,$D54,3)+INDEX(Data!$DL$33:$DO$82,$D54,3)+INDEX(Data!$DP$33:$DS$82,$D54,3)),IF($G$14=\"LIQUOR PACKAGE\",INDEX(Data!$DT$33:$DW$82,$D54,3),IF($G$14=\"LIQUOR SIDE ORDER\",INDEX(Data!$DX$33:$EA$82,$D54,3),IF($G$14=\"MEAL\",INDEX(Data!$CR$33:$CU$82,$D54,3),IF($G$14=\"MEMBERSHIP\",INDEX(Data!$CV$33:$CY$82,$D54,3),IF($G$14=\"WINE\",INDEX(Data!$EB$33:$EE$82,$D54,3),\"\")))))))),\"\")","v":0},{"$f":"IFERROR(IF($G$14=\"BEER EXCHANGE\",INDEX(Data!$DD$33:$DG$82,$D54,4),IF($G$14=\"BEER PACKAGE\",INDEX(Data!$CZ$33:$DC$82,$D54,4),IF($G$14=\"BEER SIDE ORDER\",(INDEX(Data!$DH$33:$DK$82,$D54,4)+INDEX(Data!$DL$33:$DO$82,$D54,4)+INDEX(Data!$DP$33:$DS$82,$D54,4)),IF($G$14=\"LIQUOR PACKAGE\",INDEX(Data!$DT$33:$DW$82,$D54,4),IF($G$14=\"LIQUOR SIDE ORDER\",INDEX(Data!$DX$33:$EA$82,$D54,4),IF($G$14=\"MEAL\",INDEX(Data!$CR$33:$CU$82,$D54,4),IF($G$14=\"MEMBERSHIP\",INDEX(Data!$CV$33:$CY$82,$D54,4),IF($G$14=\"WINE\",INDEX(Data!$EB$33:$EE$82,$D54,4),\"\")))))))),\"\")","v":0},0]
[null,{"$f":"'Report A'!$B57","v":"2014-07-26"},{"$f":"'Report A'!$C57","v":"Saturday"},{"$f":"'Report A'!$D57","v":26},{"$f":"IFERROR(IF($G$14=\"BEER EXCHANGE\",INDEX(Data!$DD$33:$DG$82,$D55,1),IF($G$14=\"BEER PACKAGE\",INDEX(Data!$CZ$33:$DC$82,$D55,1),IF($G$14=\"BEER SIDE ORDER\",(INDEX(Data!$DH$33:$DK$82,$D55,1)+INDEX(Data!$DL$33:$DO$82,$D55,1)+INDEX(Data!$DP$33:$DS$82,$D55,1)),IF($G$14=\"LIQUOR PACKAGE\",INDEX(Data!$DT$33:$DW$82,$D55,1),IF($G$14=\"LIQUOR SIDE ORDER\",INDEX(Data!$DX$33:$EA$82,$D55,1),IF($G$14=\"MEAL\",INDEX(Data!$CR$33:$CU$82,$D55,1),IF($G$14=\"MEMBERSHIP\",INDEX(Data!$CV$33:$CY$82,$D55,1),IF($G$14=\"WINE\",INDEX(Data!$EB$33:$EE$82,$D55,1),\"\")))))))),\"\")","v":0},{"$f":"IFERROR(IF($G$14=\"BEER EXCHANGE\",INDEX(Data!$DD$33:$DG$82,$D55,2),IF($G$14=\"BEER PACKAGE\",INDEX(Data!$CZ$33:$DC$82,$D55,2),IF($G$14=\"BEER SIDE ORDER\",(INDEX(Data!$DH$33:$DK$82,$D55,2)+INDEX(Data!$DL$33:$DO$82,$D55,2)+INDEX(Data!$DP$33:$DS$82,$D55,2)),IF($G$14=\"LIQUOR PACKAGE\",INDEX(Data!$DT$33:$DW$82,$D55,2),IF($G$14=\"LIQUOR SIDE ORDER\",INDEX(Data!$DX$33:$EA$82,$D55,2),IF($G$14=\"MEAL\",INDEX(Data!$CR$33:$CU$82,$D55,2),IF($G$14=\"MEMBERSHIP\",INDEX(Data!$CV$33:$CY$82,$D55,2),IF($G$14=\"WINE\",INDEX(Data!$EB$33:$EE$82,$D55,2),\"\")))))))),\"\")","v":0},{"$f":"IFERROR(IF($G$14=\"BEER EXCHANGE\",INDEX(Data!$DD$33:$DG$82,$D55,3),IF($G$14=\"BEER PACKAGE\",INDEX(Data!$CZ$33:$DC$82,$D55,3),IF($G$14=\"BEER SIDE ORDER\",(INDEX(Data!$DH$33:$DK$82,$D55,3)+INDEX(Data!$DL$33:$DO$82,$D55,3)+INDEX(Data!$DP$33:$DS$82,$D55,3)),IF($G$14=\"LIQUOR PACKAGE\",INDEX(Data!$DT$33:$DW$82,$D55,3),IF($G$14=\"LIQUOR SIDE ORDER\",INDEX(Data!$DX$33:$EA$82,$D55,3),IF($G$14=\"MEAL\",INDEX(Data!$CR$33:$CU$82,$D55,3),IF($G$14=\"MEMBERSHIP\",INDEX(Data!$CV$33:$CY$82,$D55,3),IF($G$14=\"WINE\",INDEX(Data!$EB$33:$EE$82,$D55,3),\"\")))))))),\"\")","v":0},{"$f":"IFERROR(IF($G$14=\"BEER EXCHANGE\",INDEX(Data!$DD$33:$DG$82,$D55,4),IF($G$14=\"BEER PACKAGE\",INDEX(Data!$CZ$33:$DC$82,$D55,4),IF($G$14=\"BEER SIDE ORDER\",(INDEX(Data!$DH$33:$DK$82,$D55,4)+INDEX(Data!$DL$33:$DO$82,$D55,4)+INDEX(Data!$DP$33:$DS$82,$D55,4)),IF($G$14=\"LIQUOR PACKAGE\",INDEX(Data!$DT$33:$DW$82,$D55,4),IF($G$14=\"LIQUOR SIDE ORDER\",INDEX(Data!$DX$33:$EA$82,$D55,4),IF($G$14=\"MEAL\",INDEX(Data!$CR$33:$CU$82,$D55,4),IF($G$14=\"MEMBERSHIP\",INDEX(Data!$CV$33:$CY$82,$D55,4),IF($G$14=\"WINE\",INDEX(Data!$EB$33:$EE$82,$D55,4),\"\")))))))),\"\")","v":0},0]
[null,{"$f":"'Report A'!$B58","v":"2014-07-27"},{"$f":"'Report A'!$C58","v":"Sunday"},{"$f":"'Report A'!$D58","v":27},{"$f":"IFERROR(IF($G$14=\"BEER EXCHANGE\",INDEX(Data!$DD$33:$DG$82,$D56,1),IF($G$14=\"BEER PACKAGE\",INDEX(Data!$CZ$33:$DC$82,$D56,1),IF($G$14=\"BEER SIDE ORDER\",(INDEX(Data!$DH$33:$DK$82,$D56,1)+INDEX(Data!$DL$33:$DO$82,$D56,1)+INDEX(Data!$DP$33:$DS$82,$D56,1)),IF($G$14=\"LIQUOR PACKAGE\",INDEX(Data!$DT$33:$DW$82,$D56,1),IF($G$14=\"LIQUOR SIDE ORDER\",INDEX(Data!$DX$33:$EA$82,$D56,1),IF($G$14=\"MEAL\",INDEX(Data!$CR$33:$CU$82,$D56,1),IF($G$14=\"MEMBERSHIP\",INDEX(Data!$CV$33:$CY$82,$D56,1),IF($G$14=\"WINE\",INDEX(Data!$EB$33:$EE$82,$D56,1),\"\")))))))),\"\")","v":0},{"$f":"IFERROR(IF($G$14=\"BEER EXCHANGE\",INDEX(Data!$DD$33:$DG$82,$D56,2),IF($G$14=\"BEER PACKAGE\",INDEX(Data!$CZ$33:$DC$82,$D56,2),IF($G$14=\"BEER SIDE ORDER\",(INDEX(Data!$DH$33:$DK$82,$D56,2)+INDEX(Data!$DL$33:$DO$82,$D56,2)+INDEX(Data!$DP$33:$DS$82,$D56,2)),IF($G$14=\"LIQUOR PACKAGE\",INDEX(Data!$DT$33:$DW$82,$D56,2),IF($G$14=\"LIQUOR SIDE ORDER\",INDEX(Data!$DX$33:$EA$82,$D56,2),IF($G$14=\"MEAL\",INDEX(Data!$CR$33:$CU$82,$D56,2),IF($G$14=\"MEMBERSHIP\",INDEX(Data!$CV$33:$CY$82,$D56,2),IF($G$14=\"WINE\",INDEX(Data!$EB$33:$EE$82,$D56,2),\"\")))))))),\"\")","v":0},{"$f":"IFERROR(IF($G$14=\"BEER EXCHANGE\",INDEX(Data!$DD$33:$DG$82,$D56,3),IF($G$14=\"BEER PACKAGE\",INDEX(Data!$CZ$33:$DC$82,$D56,3),IF($G$14=\"BEER SIDE ORDER\",(INDEX(Data!$DH$33:$DK$82,$D56,3)+INDEX(Data!$DL$33:$DO$82,$D56,3)+INDEX(Data!$DP$33:$DS$82,$D56,3)),IF($G$14=\"LIQUOR PACKAGE\",INDEX(Data!$DT$33:$DW$82,$D56,3),IF($G$14=\"LIQUOR SIDE ORDER\",INDEX(Data!$DX$33:$EA$82,$D56,3),IF($G$14=\"MEAL\",INDEX(Data!$CR$33:$CU$82,$D56,3),IF($G$14=\"MEMBERSHIP\",INDEX(Data!$CV$33:$CY$82,$D56,3),IF($G$14=\"WINE\",INDEX(Data!$EB$33:$EE$82,$D56,3),\"\")))))))),\"\")","v":0},{"$f":"IFERROR(IF($G$14=\"BEER EXCHANGE\",INDEX(Data!$DD$33:$DG$82,$D56,4),IF($G$14=\"BEER PACKAGE\",INDEX(Data!$CZ$33:$DC$82,$D56,4),IF($G$14=\"BEER SIDE ORDER\",(INDEX(Data!$DH$33:$DK$82,$D56,4)+INDEX(Data!$DL$33:$DO$82,$D56,4)+INDEX(Data!$DP$33:$DS$82,$D56,4)),IF($G$14=\"LIQUOR PACKAGE\",INDEX(Data!$DT$33:$DW$82,$D56,4),IF($G$14=\"LIQUOR SIDE ORDER\",INDEX(Data!$DX$33:$EA$82,$D56,4),IF($G$14=\"MEAL\",INDEX(Data!$CR$33:$CU$82,$D56,4),IF($G$14=\"MEMBERSHIP\",INDEX(Data!$CV$33:$CY$82,$D56,4),IF($G$14=\"WINE\",INDEX(Data!$EB$33:$EE$82,$D56,4),\"\")))))))),\"\")","v":0},0]
[null,{"$f":"'Report A'!$B59","v":"2014-07-28"},{"$f":"'Report A'!$C59","v":"Monday"},{"$f":"'Report A'!$D59","v":28},{"$f":"IFERROR(IF($G$14=\"BEER EXCHANGE\",INDEX(Data!$DD$33:$DG$82,$D57,1),IF($G$14=\"BEER PACKAGE\",INDEX(Data!$CZ$33:$DC$82,$D57,1),IF($G$14=\"BEER SIDE ORDER\",(INDEX(Data!$DH$33:$DK$82,$D57,1)+INDEX(Data!$DL$33:$DO$82,$D57,1)+INDEX(Data!$DP$33:$DS$82,$D57,1)),IF($G$14=\"LIQUOR PACKAGE\",INDEX(Data!$DT$33:$DW$82,$D57,1),IF($G$14=\"LIQUOR SIDE ORDER\",INDEX(Data!$DX$33:$EA$82,$D57,1),IF($G$14=\"MEAL\",INDEX(Data!$CR$33:$CU$82,$D57,1),IF($G$14=\"MEMBERSHIP\",INDEX(Data!$CV$33:$CY$82,$D57,1),IF($G$14=\"WINE\",INDEX(Data!$EB$33:$EE$82,$D57,1),\"\")))))))),\"\")","v":0},{"$f":"IFERROR(IF($G$14=\"BEER EXCHANGE\",INDEX(Data!$DD$33:$DG$82,$D57,2),IF($G$14=\"BEER PACKAGE\",INDEX(Data!$CZ$33:$DC$82,$D57,2),IF($G$14=\"BEER SIDE ORDER\",(INDEX(Data!$DH$33:$DK$82,$D57,2)+INDEX(Data!$DL$33:$DO$82,$D57,2)+INDEX(Data!$DP$33:$DS$82,$D57,2)),IF($G$14=\"LIQUOR PACKAGE\",INDEX(Data!$DT$33:$DW$82,$D57,2),IF($G$14=\"LIQUOR SIDE ORDER\",INDEX(Data!$DX$33:$EA$82,$D57,2),IF($G$14=\"MEAL\",INDEX(Data!$CR$33:$CU$82,$D57,2),IF($G$14=\"MEMBERSHIP\",INDEX(Data!$CV$33:$CY$82,$D57,2),IF($G$14=\"WINE\",INDEX(Data!$EB$33:$EE$82,$D57,2),\"\")))))))),\"\")","v":0},{"$f":"IFERROR(IF($G$14=\"BEER EXCHANGE\",INDEX(Data!$DD$33:$DG$82,$D57,3),IF($G$14=\"BEER PACKAGE\",INDEX(Data!$CZ$33:$DC$82,$D57,3),IF($G$14=\"BEER SIDE ORDER\",(INDEX(Data!$DH$33:$DK$82,$D57,3)+INDEX(Data!$DL$33:$DO$82,$D57,3)+INDEX(Data!$DP$33:$DS$82,$D57,3)),IF($G$14=\"LIQUOR PACKAGE\",INDEX(Data!$DT$33:$DW$82,$D57,3),IF($G$14=\"LIQUOR SIDE ORDER\",INDEX(Data!$DX$33:$EA$82,$D57,3),IF($G$14=\"MEAL\",INDEX(Data!$CR$33:$CU$82,$D57,3),IF($G$14=\"MEMBERSHIP\",INDEX(Data!$CV$33:$CY$82,$D57,3),IF($G$14=\"WINE\",INDEX(Data!$EB$33:$EE$82,$D57,3),\"\")))))))),\"\")","v":0},{"$f":"IFERROR(IF($G$14=\"BEER EXCHANGE\",INDEX(Data!$DD$33:$DG$82,$D57,4),IF($G$14=\"BEER PACKAGE\",INDEX(Data!$CZ$33:$DC$82,$D57,4),IF($G$14=\"BEER SIDE ORDER\",(INDEX(Data!$DH$33:$DK$82,$D57,4)+INDEX(Data!$DL$33:$DO$82,$D57,4)+INDEX(Data!$DP$33:$DS$82,$D57,4)),IF($G$14=\"LIQUOR PACKAGE\",INDEX(Data!$DT$33:$DW$82,$D57,4),IF($G$14=\"LIQUOR SIDE ORDER\",INDEX(Data!$DX$33:$EA$82,$D57,4),IF($G$14=\"MEAL\",INDEX(Data!$CR$33:$CU$82,$D57,4),IF($G$14=\"MEMBERSHIP\",INDEX(Data!$CV$33:$CY$82,$D57,4),IF($G$14=\"WINE\",INDEX(Data!$EB$33:$EE$82,$D57,4),\"\")))))))),\"\")","v":0},0]
[null,{"$f":"'Report A'!$B60","v":"2014-07-29"},{"$f":"'Report A'!$C60","v":"Tuesday"},{"$f":"'Report A'!$D60","v":29},{"$f":"IFERROR(IF($G$14=\"BEER EXCHANGE\",INDEX(Data!$DD$33:$DG$82,$D58,1),IF($G$14=\"BEER PACKAGE\",INDEX(Data!$CZ$33:$DC$82,$D58,1),IF($G$14=\"BEER SIDE ORDER\",(INDEX(Data!$DH$33:$DK$82,$D58,1)+INDEX(Data!$DL$33:$DO$82,$D58,1)+INDEX(Data!$DP$33:$DS$82,$D58,1)),IF($G$14=\"LIQUOR PACKAGE\",INDEX(Data!$DT$33:$DW$82,$D58,1),IF($G$14=\"LIQUOR SIDE ORDER\",INDEX(Data!$DX$33:$EA$82,$D58,1),IF($G$14=\"MEAL\",INDEX(Data!$CR$33:$CU$82,$D58,1),IF($G$14=\"MEMBERSHIP\",INDEX(Data!$CV$33:$CY$82,$D58,1),IF($G$14=\"WINE\",INDEX(Data!$EB$33:$EE$82,$D58,1),\"\")))))))),\"\")","v":0},{"$f":"IFERROR(IF($G$14=\"BEER EXCHANGE\",INDEX(Data!$DD$33:$DG$82,$D58,2),IF($G$14=\"BEER PACKAGE\",INDEX(Data!$CZ$33:$DC$82,$D58,2),IF($G$14=\"BEER SIDE ORDER\",(INDEX(Data!$DH$33:$DK$82,$D58,2)+INDEX(Data!$DL$33:$DO$82,$D58,2)+INDEX(Data!$DP$33:$DS$82,$D58,2)),IF($G$14=\"LIQUOR PACKAGE\",INDEX(Data!$DT$33:$DW$82,$D58,2),IF($G$14=\"LIQUOR SIDE ORDER\",INDEX(Data!$DX$33:$EA$82,$D58,2),IF($G$14=\"MEAL\",INDEX(Data!$CR$33:$CU$82,$D58,2),IF($G$14=\"MEMBERSHIP\",INDEX(Data!$CV$33:$CY$82,$D58,2),IF($G$14=\"WINE\",INDEX(Data!$EB$33:$EE$82,$D58,2),\"\")))))))),\"\")","v":0},{"$f":"IFERROR(IF($G$14=\"BEER EXCHANGE\",INDEX(Data!$DD$33:$DG$82,$D58,3),IF($G$14=\"BEER PACKAGE\",INDEX(Data!$CZ$33:$DC$82,$D58,3),IF($G$14=\"BEER SIDE ORDER\",(INDEX(Data!$DH$33:$DK$82,$D58,3)+INDEX(Data!$DL$33:$DO$82,$D58,3)+INDEX(Data!$DP$33:$DS$82,$D58,3)),IF($G$14=\"LIQUOR PACKAGE\",INDEX(Data!$DT$33:$DW$82,$D58,3),IF($G$14=\"LIQUOR SIDE ORDER\",INDEX(Data!$DX$33:$EA$82,$D58,3),IF($G$14=\"MEAL\",INDEX(Data!$CR$33:$CU$82,$D58,3),IF($G$14=\"MEMBERSHIP\",INDEX(Data!$CV$33:$CY$82,$D58,3),IF($G$14=\"WINE\",INDEX(Data!$EB$33:$EE$82,$D58,3),\"\")))))))),\"\")","v":0},{"$f":"IFERROR(IF($G$14=\"BEER EXCHANGE\",INDEX(Data!$DD$33:$DG$82,$D58,4),IF($G$14=\"BEER PACKAGE\",INDEX(Data!$CZ$33:$DC$82,$D58,4),IF($G$14=\"BEER SIDE ORDER\",(INDEX(Data!$DH$33:$DK$82,$D58,4)+INDEX(Data!$DL$33:$DO$82,$D58,4)+INDEX(Data!$DP$33:$DS$82,$D58,4)),IF($G$14=\"LIQUOR PACKAGE\",INDEX(Data!$DT$33:$DW$82,$D58,4),IF($G$14=\"LIQUOR SIDE ORDER\",INDEX(Data!$DX$33:$EA$82,$D58,4),IF($G$14=\"MEAL\",INDEX(Data!$CR$33:$CU$82,$D58,4),IF($G$14=\"MEMBERSHIP\",INDEX(Data!$CV$33:$CY$82,$D58,4),IF($G$14=\"WINE\",INDEX(Data!$EB$33:$EE$82,$D58,4),\"\")))))))),\"\")","v":0},0]
[null,{"$f":"'Report A'!$B61","v":"2014-07-30"},{"$f":"'Report A'!$C61","v":"Wednesday"},{"$f":"'Report A'!$D61","v":30},{"$f":"IFERROR(IF($G$14=\"BEER EXCHANGE\",INDEX(Data!$DD$33:$DG$82,$D59,1),IF($G$14=\"BEER PACKAGE\",INDEX(Data!$CZ$33:$DC$82,$D59,1),IF($G$14=\"BEER SIDE ORDER\",(INDEX(Data!$DH$33:$DK$82,$D59,1)+INDEX(Data!$DL$33:$DO$82,$D59,1)+INDEX(Data!$DP$33:$DS$82,$D59,1)),IF($G$14=\"LIQUOR PACKAGE\",INDEX(Data!$DT$33:$DW$82,$D59,1),IF($G$14=\"LIQUOR SIDE ORDER\",INDEX(Data!$DX$33:$EA$82,$D59,1),IF($G$14=\"MEAL\",INDEX(Data!$CR$33:$CU$82,$D59,1),IF($G$14=\"MEMBERSHIP\",INDEX(Data!$CV$33:$CY$82,$D59,1),IF($G$14=\"WINE\",INDEX(Data!$EB$33:$EE$82,$D59,1),\"\")))))))),\"\")","v":0},{"$f":"IFERROR(IF($G$14=\"BEER EXCHANGE\",INDEX(Data!$DD$33:$DG$82,$D59,2),IF($G$14=\"BEER PACKAGE\",INDEX(Data!$CZ$33:$DC$82,$D59,2),IF($G$14=\"BEER SIDE ORDER\",(INDEX(Data!$DH$33:$DK$82,$D59,2)+INDEX(Data!$DL$33:$DO$82,$D59,2)+INDEX(Data!$DP$33:$DS$82,$D59,2)),IF($G$14=\"LIQUOR PACKAGE\",INDEX(Data!$DT$33:$DW$82,$D59,2),IF($G$14=\"LIQUOR SIDE ORDER\",INDEX(Data!$DX$33:$EA$82,$D59,2),IF($G$14=\"MEAL\",INDEX(Data!$CR$33:$CU$82,$D59,2),IF($G$14=\"MEMBERSHIP\",INDEX(Data!$CV$33:$CY$82,$D59,2),IF($G$14=\"WINE\",INDEX(Data!$EB$33:$EE$82,$D59,2),\"\")))))))),\"\")","v":0},{"$f":"IFERROR(IF($G$14=\"BEER EXCHANGE\",INDEX(Data!$DD$33:$DG$82,$D59,3),IF($G$14=\"BEER PACKAGE\",INDEX(Data!$CZ$33:$DC$82,$D59,3),IF($G$14=\"BEER SIDE ORDER\",(INDEX(Data!$DH$33:$DK$82,$D59,3)+INDEX(Data!$DL$33:$DO$82,$D59,3)+INDEX(Data!$DP$33:$DS$82,$D59,3)),IF($G$14=\"LIQUOR PACKAGE\",INDEX(Data!$DT$33:$DW$82,$D59,3),IF($G$14=\"LIQUOR SIDE ORDER\",INDEX(Data!$DX$33:$EA$82,$D59,3),IF($G$14=\"MEAL\",INDEX(Data!$CR$33:$CU$82,$D59,3),IF($G$14=\"MEMBERSHIP\",INDEX(Data!$CV$33:$CY$82,$D59,3),IF($G$14=\"WINE\",INDEX(Data!$EB$33:$EE$82,$D59,3),\"\")))))))),\"\")","v":0},{"$f":"IFERROR(IF($G$14=\"BEER EXCHANGE\",INDEX(Data!$DD$33:$DG$82,$D59,4),IF($G$14=\"BEER PACKAGE\",INDEX(Data!$CZ$33:$DC$82,$D59,4),IF($G$14=\"BEER SIDE ORDER\",(INDEX(Data!$DH$33:$DK$82,$D59,4)+INDEX(Data!$DL$33:$DO$82,$D59,4)+INDEX(Data!$DP$33:$DS$82,$D59,4)),IF($G$14=\"LIQUOR PACKAGE\",INDEX(Data!$DT$33:$DW$82,$D59,4),IF($G$14=\"LIQUOR SIDE ORDER\",INDEX(Data!$DX$33:$EA$82,$D59,4),IF($G$14=\"MEAL\",INDEX(Data!$CR$33:$CU$82,$D59,4),IF($G$14=\"MEMBERSHIP\",INDEX(Data!$CV$33:$CY$82,$D59,4),IF($G$14=\"WINE\",INDEX(Data!$EB$33:$EE$82,$D59,4),\"\")))))))),\"\")","v":0},0]
[null,{"$f":"'Report A'!$B62","v":"2014-07-31"},{"$f":"'Report A'!$C62","v":"Thursday"},{"$f":"'Report A'!$D62","v":31},{"$f":"IFERROR(IF($G$14=\"BEER EXCHANGE\",INDEX(Data!$DD$33:$DG$82,$D60,1),IF($G$14=\"BEER PACKAGE\",INDEX(Data!$CZ$33:$DC$82,$D60,1),IF($G$14=\"BEER SIDE ORDER\",(INDEX(Data!$DH$33:$DK$82,$D60,1)+INDEX(Data!$DL$33:$DO$82,$D60,1)+INDEX(Data!$DP$33:$DS$82,$D60,1)),IF($G$14=\"LIQUOR PACKAGE\",INDEX(Data!$DT$33:$DW$82,$D60,1),IF($G$14=\"LIQUOR SIDE ORDER\",INDEX(Data!$DX$33:$EA$82,$D60,1),IF($G$14=\"MEAL\",INDEX(Data!$CR$33:$CU$82,$D60,1),IF($G$14=\"MEMBERSHIP\",INDEX(Data!$CV$33:$CY$82,$D60,1),IF($G$14=\"WINE\",INDEX(Data!$EB$33:$EE$82,$D60,1),\"\")))))))),\"\")","v":0},{"$f":"IFERROR(IF($G$14=\"BEER EXCHANGE\",INDEX(Data!$DD$33:$DG$82,$D60,2),IF($G$14=\"BEER PACKAGE\",INDEX(Data!$CZ$33:$DC$82,$D60,2),IF($G$14=\"BEER SIDE ORDER\",(INDEX(Data!$DH$33:$DK$82,$D60,2)+INDEX(Data!$DL$33:$DO$82,$D60,2)+INDEX(Data!$DP$33:$DS$82,$D60,2)),IF($G$14=\"LIQUOR PACKAGE\",INDEX(Data!$DT$33:$DW$82,$D60,2),IF($G$14=\"LIQUOR SIDE ORDER\",INDEX(Data!$DX$33:$EA$82,$D60,2),IF($G$14=\"MEAL\",INDEX(Data!$CR$33:$CU$82,$D60,2),IF($G$14=\"MEMBERSHIP\",INDEX(Data!$CV$33:$CY$82,$D60,2),IF($G$14=\"WINE\",INDEX(Data!$EB$33:$EE$82,$D60,2),\"\")))))))),\"\")","v":0},{"$f":"IFERROR(IF($G$14=\"BEER EXCHANGE\",INDEX(Data!$DD$33:$DG$82,$D60,3),IF($G$14=\"BEER PACKAGE\",INDEX(Data!$CZ$33:$DC$82,$D60,3),IF($G$14=\"BEER SIDE ORDER\",(INDEX(Data!$DH$33:$DK$82,$D60,3)+INDEX(Data!$DL$33:$DO$82,$D60,3)+INDEX(Data!$DP$33:$DS$82,$D60,3)),IF($G$14=\"LIQUOR PACKAGE\",INDEX(Data!$DT$33:$DW$82,$D60,3),IF($G$14=\"LIQUOR SIDE ORDER\",INDEX(Data!$DX$33:$EA$82,$D60,3),IF($G$14=\"MEAL\",INDEX(Data!$CR$33:$CU$82,$D60,3),IF($G$14=\"MEMBERSHIP\",INDEX(Data!$CV$33:$CY$82,$D60,3),IF($G$14=\"WINE\",INDEX(Data!$EB$33:$EE$82,$D60,3),\"\")))))))),\"\")","v":0},{"$f":"IFERROR(IF($G$14=\"BEER EXCHANGE\",INDEX(Data!$DD$33:$DG$82,$D60,4),IF($G$14=\"BEER PACKAGE\",INDEX(Data!$CZ$33:$DC$82,$D60,4),IF($G$14=\"BEER SIDE ORDER\",(INDEX(Data!$DH$33:$DK$82,$D60,4)+INDEX(Data!$DL$33:$DO$82,$D60,4)+INDEX(Data!$DP$33:$DS$82,$D60,4)),IF($G$14=\"LIQUOR PACKAGE\",INDEX(Data!$DT$33:$DW$82,$D60,4),IF($G$14=\"LIQUOR SIDE ORDER\",INDEX(Data!$DX$33:$EA$82,$D60,4),IF($G$14=\"MEAL\",INDEX(Data!$CR$33:$CU$82,$D60,4),IF($G$14=\"MEMBERSHIP\",INDEX(Data!$CV$33:$CY$82,$D60,4),IF($G$14=\"WINE\",INDEX(Data!$EB$33:$EE$82,$D60,4),\"\")))))))),\"\")","v":0},0]

{"sheet":"Report G","index":8,"n_rows":59,"n_cols":33,"rows_kept":59,"cut":false,"hidden":false,"merged":[]}
[]
[]
[null,null,"MONTHLY SERVICE REPORTING BY OUTLET"]
[]
[]
[null,"SUBJECT","REPORT G : CUSTOMER SATISFACTION FROM FEEDBACK"]
[]
[null,"OUTLET",{"$f":"Data!$C$8","v":"SBA"}]
[]
[null,"MONTH / YEAR",{"$f":"Data!$C$10","v":"July 2014"}]
[]
[null,"MENU"]
[]
[null,"DATE","DAY","ROW","RATINGS FROM FEEDBACK FORMS",null,null,null,null,null,null,null,null,null,null,null,"QUESTIONAIRE FROM FEEDBACK FORMS",null,null,null,null,null,null,"OTHER VALUABLE COMMENTS FROM CUSTOMERS",null,null,null,null,null,null,null,null,"CHART G1 : MONTHLY % RATING FROM FEEDBACK FORMS"]
[null,null,null,null,"CHOOSE AREA OF RATING",null,null,null,null,null,"RECEPTION",null,null,null,null,null,"QUESTION 01",null,null,null,null,"QUESTION 02",null,null,null,null,null,null,null,null,null,null,"CHART G2 : MONTHLY % RESPONSE TO QUESTIONAIRE FROM FEEDBACK FORMS"]
[null,null,null,null,"TOTAL","EXCELLENT","GOOD","NORMAL","POOR","EXCELLENT","GOOD","NORMAL","POOR","TOTAL","YES","NO","YES","NO","TOTAL","YES","NO","YES","NO","TOTAL","J","L","LL","LLL","J","L","LL","LLL","CHART G3 : MONTHLY % ( UNSOLICITED ) COMMENTS FROM FEEDBACK FORMS"]
[null,null,null,null,"( rating )","( rating )","( rating )","( rating )","( rating )","( % )","( % )","( % )","( % )","( rating )","( rating )","( rating )","( % )","( % )","( rating )","( rating )","( rating )","( % )","( % )","( rating )","( rating )","( rating )","( rating )","( rating )","( % )","( % )","( % )","( % )"]
[null,"SUMMARY FOR MONTH"]
[null,"% RATING FOR MONTH",null,null,{"$f":"SUM(E$29:E$59)","v":0},{"$f":"SUM(F$29:F$59)","v":0},0,0,0,{"$f":"IFERROR($F19/$E19,\"\")","v":""},{"$f":"IFERROR($G19/$E19,\"\")","v":""},{"$f":"IFERROR($H19/$E19,\"\")","v":""},{"$f":"IFERROR($I19/$E19,\"\")","v":""},{"$f":"SUM(N$29:N$59)","v":0},{"$f":"SUM(O$29:O$59)","v":0},0,{"$f":"IFERROR($O19/$N19,\"\")","v":""},{"$f":"IFERROR($P19/$N19,\"\")","v":""},{"$f":"SUM(S$29:S$59)","v":0},{"$f":"SUM(T$29:T$59)","v":0},0,{"$f":"IFERROR($T19/$S19,\"\")","v":""},{"$f":"IFERROR($U19/$S19,\"\")","v":""},{"$f":"SUM(X$29:X$59)","v":0},{"$f":"SUM(Y$29:Y$59)","v":0},0,0,0,{"$f":"IFERROR($Y19/$X19,\"\")","v":""},{"$f":"IFERROR($Z19/$X19,\"\")","v":""},{"$f":"IFERROR($AA19/$X19,\"\")","v":""},{"$f":"IFERROR($AB19/$X19,\"\")","v":""},"CHART G1"]
[null,"HIGHEST % RATING",null,null,{"$f":"IFERROR(IF(LARGE(E$29:E$59,1)>0,LARGE(E$29:E$59,1),\"NIL\"),\"NIL\")","v":"NIL"},{"$f":"IFERROR(IF(LARGE(F$29:F$59,1)>0,LARGE(F$29:F$59,1),\"NIL\"),\"NIL\")","v":"NIL"},"NIL","NIL","NIL",{"$f":"IFERROR(IF(LARGE(J$29:J$59,1)>0,LARGE(J$29:J$59,1),\"NIL\"),\"NIL\")","v":"NIL"},"NIL","NIL","NIL",{"$f":"IFERROR(IF(LARGE(N$29:N$59,1)>0,LARGE(N$29:N$59,1),\"NIL\"),\"NIL\")","v":"NIL"},{"$f":"IFERROR(IF(LARGE(O$29:O$59,1)>0,LARGE(O$29:O$59,1),\"NIL\"),\"NIL\")","v":"NIL"},"NIL","NIL","NIL",{"$f":"IFERROR(IF(LARGE(S$29:S$59,1)>0,LARGE(S$29:S$59,1),\"NIL\"),\"NIL\")","v":"NIL"},{"$f":"IFERROR(IF(LARGE(T$29:T$59,1)>0,LARGE(T$29:T$59,1),\"NIL\"),\"NIL\")","v":"NIL"},"NIL","NIL","NIL",{"$f":"IFERROR(IF(LARGE(X$29:X$59,1)>0,LARGE(X$29:X$59,1),\"NIL\"),\"NIL\")","v":"NIL"},{"$f":"IFERROR(IF(LARGE(Y$29:Y$59,1)>0,LARGE(Y$29:Y$59,1),\"NIL\"),\"NIL\")","v":"NIL"},"NIL","NIL","NIL","NIL","NIL","NIL","NIL"]
[null,"LOWEST % RATING",null,null,{"$f":"IFERROR(IF(LARGE(E$29:E$59,COUNTIF(E$29:E$59,\">0\"))<>E$20,LARGE(E$29:E$59,COUNTIF(E$29:E$59,\">0\")),\"NIL\"),\"NIL\")","v":"NIL"},{"$f":"IFERROR(IF(LARGE(F$29:F$59,COUNTIF(F$29:F$59,\">0\"))<>F$20,LARGE(F$29:F$59,COUNTIF(F$29:F$59,\">0\")),\"NIL\"),\"NIL\")","v":"NIL"},"NIL","NIL","NIL","NIL","NIL","NIL","NIL","NIL","NIL","NIL","NIL","NIL","NIL","NIL","NIL","NIL","NIL","NIL","NIL","NIL","NIL","NIL","NIL","NIL","NIL","NIL"]
[null,"% RATING FOR","MONDAY",null,{"$f":"IFERROR(SUMIF($C$29:$C$59,\"Monday*\",E$29:E$59),\"\")","v":0},{"$f":"IFERROR(SUMIF($C$29:$C$59,\"Monday*\",F$29:F$59),\"\")","v":0},0,0,0,{"$f":"IFERROR($F22/$E22,\"\")","v":""},{"$f":"IFERROR($G22/$E22,\"\")","v":""},{"$f":"IFERROR($H22/$E22,\"\")","v":""},{"$f":"IFERROR($I22/$E22,\"\")","v":""},{"$f":"IFERROR(SUMIF($C$29:$C$59,\"Monday*\",N$29:N$59),\"\")","v":0},{"$f":"IFERROR(SUMIF($C$29:$C$59,\"Monday*\",O$29:O$59),\"\")","v":0},0,{"$f":"IFERROR(SUMIF($C$29:$C$59,\"Monday*\",Q$29:Q$59)/COUNTIF($C$29:$C$59,\"Monday*\"),\"\")","v":0},{"$f":"IFERROR(SUMIF($C$29:$C$59,\"Monday*\",R$29:R$59)/COUNTIF($C$29:$C$59,\"Monday*\"),\"\")","v":0},{"$f":"IFERROR(SUMIF($C$29:$C$59,\"Monday*\",S$29:S$59),\"\")","v":0},{"$f":"IFERROR(SUMIF($C$29:$C$59,\"Monday*\",T$29:T$59),\"\")","v":0},0,{"$f":"IFERROR(SUMIF($C$29:$C$59,\"Monday*\",V$29:V$59)/COUNTIF($C$29:$C$59,\"Monday*\"),\"\")","v":0},{"$f":"IFERROR(SUMIF($C$29:$C$59,\"Monday*\",W$29:W$59)/COUNTIF($C$29:$C$59,\"Monday*\"),\"\")","v":0},{"$f":"IFERROR(SUMIF($C$29:$C$59,\"Monday*\",X$29:X$59),\"\")","v":0},{"$f":"IFERROR(SUMIF($C$29:$C$59,\"Monday*\",Y$29:Y$59),\"\")","v":0},0,0,0,{"$f":"IFERROR(SUMIF($C$29:$C$59,\"Monday*\",AC$29:AC$59)/COUNTIF($C$29:$C$59,\"Monday*\"),\"\")","v":0},{"$f":"IFERROR(SUMIF($C$29:$C$59,\"Monday*\",AD$29:AD$59)/COUNTIF($C$29:$C$59,\"Monday*\"),\"\")","v":0},{"$f":"IFERROR(SUMIF($C$29:$C$59,\"Monday*\",AE$29:AE$59)/COUNTIF($C$29:$C$59,\"Monday*\"),\"\")","v":0},{"$f":"IFERROR(SUMIF($C$29:$C$59,\"Monday*\",AF$29:AF$59)/COUNTIF($C$29:$C$59,\"Monday*\"),\"\")","v":0}]
[null,null,"TUESDAY",null,{"$f":"IFERROR(SUMIF($C$29:$C$59,\"Tuesday*\",E$29:E$59),\"\")","v":0},{"$f":"IFERROR(SUMIF($C$29:$C$59,\"Tuesday*\",F$29:F$59),\"\")","v":0},0,0,0,{"$f":"IFERROR($F23/$E23,\"\")","v":""},{"$f":"IFERROR($G23/$E23,\"\")","v":""},{"$f":"IFERROR($H23/$E23,\"\")","v":""},{"$f":"IFERROR($I23/$E23,\"\")","v":""},{"$f":"IFERROR(SUMIF($C$29:$C$59,\"Tuesday*\",N$29:N$59),\"\")","v":0},{"$f":"IFERROR(SUMIF($C$29:$C$59,\"Tuesday*\",O$29:O$59),\"\")","v":0},0,{"$f":"IFERROR(SUMIF($C$29:$C$59,\"Tuesday*\",Q$29:Q$59)/COUNTIF($C$29:$C$59,\"Tuesday*\"),\"\")","v":0},{"$f":"IFERROR(SUMIF($C$29:$C$59,\"Tuesday*\",R$29:R$59)/COUNTIF($C$29:$C$59,\"Tuesday*\"),\"\")","v":0},{"$f":"IFERROR(SUMIF($C$29:$C$59,\"Tuesday*\",S$29:S$59),\"\")","v":0},{"$f":"IFERROR(SUMIF($C$29:$C$59,\"Tuesday*\",T$29:T$59),\"\")","v":0},0,{"$f":"IFERROR(SUMIF($C$29:$C$59,\"Tuesday*\",V$29:V$59)/COUNTIF($C$29:$C$59,\"Tuesday*\"),\"\")","v":0},{"$f":"IFERROR(SUMIF($C$29:$C$59,\"Tuesday*\",W$29:W$59)/COUNTIF($C$29:$C$59,\"Tuesday*\"),\"\")","v":0},{"$f":"IFERROR(SUMIF($C$29:$C$59,\"Tuesday*\",X$29:X$59),\"\")","v":0},{"$f":"IFERROR(SUMIF($C$29:$C$59,\"Tuesday*\",Y$29:Y$59),\"\")","v":0},0,0,0,{"$f":"IFERROR(SUMIF($C$29:$C$59,\"Tuesday*\",AC$29:AC$59)/COUNTIF($C$29:$C$59,\"Tuesday*\"),\"\")","v":0},{"$f":"IFERROR(SUMIF($C$29:$C$59,\"Tuesday*\",AD$29:AD$59)/COUNTIF($C$29:$C$59,\"Tuesday*\"),\"\")","v":0},{"$f":"IFERROR(SUMIF($C$29:$C$59,\"Tuesday*\",AE$29:AE$59)/COUNTIF($C$29:$C$59,\"Tuesday*\"),\"\")","v":0},{"$f":"IFERROR(SUMIF($C$29:$C$59,\"Tuesday*\",AF$29:AF$59)/COUNTIF($C$29:$C$59,\"Tuesday*\"),\"\")","v":0}]
[null,null,"WEDNESDAY",null,{"$f":"IFERROR(SUMIF($C$29:$C$59,\"Wednesday*\",E$29:E$59),\"\")","v":0},{"$f":"IFERROR(SUMIF($C$29:$C$59,\"Wednesday*\",F$29:F$59),\"\")","v":0},0,0,0,"","","","",{"$f":"IFERROR(SUMIF($C$29:$C$59,\"Wednesday*\",N$29:N$59),\"\")","v":0},{"$f":"IFERROR(SUMIF($C$29:$C$59,\"Wednesday*\",O$29:O$59),\"\")","v":0},0,{"$f":"IFERROR(SUMIF($C$29:$C$59,\"Wednesday*\",Q$29:Q$59)/COUNTIF($C$29:$C$59,\"Wednesday*\"),\"\")","v":0},{"$f":"IFERROR(SUMIF($C$29:$C$59,\"Wednesday*\",R$29:R$59)/COUNTIF($C$29:$C$59,\"Wednesday*\"),\"\")","v":0},{"$f":"IFERROR(SUMIF($C$29:$C$59,\"Wednesday*\",S$29:S$59),\"\")","v":0},{"$f":"IFERROR(SUMIF($C$29:$C$59,\"Wednesday*\",T$29:T$59),\"\")","v":0},0,{"$f":"IFERROR(SUMIF($C$29:$C$59,\"Wednesday*\",V$29:V$59)/COUNTIF($C$29:$C$59,\"Wednesday*\"),\"\")","v":0},{"$f":"IFERROR(SUMIF($C$29:$C$59,\"Wednesday*\",W$29:W$59)/COUNTIF($C$29:$C$59,\"Wednesday*\"),\"\")","v":0},{"$f":"IFERROR(SUMIF($C$29:$C$59,\"Wednesday*\",X$29:X$59),\"\")","v":0},{"$f":"IFERROR(SUMIF($C$29:$C$59,\"Wednesday*\",Y$29:Y$59),\"\")","v":0},0,0,0,{"$f":"IFERROR(SUMIF($C$29:$C$59,\"Wednesday*\",AC$29:AC$59)/COUNTIF($C$29:$C$59,\"Wednesday*\"),\"\")","v":0},{"$f":"IFERROR(SUMIF($C$29:$C$59,\"Wednesday*\",AD$29:AD$59)/COUNTIF($C$29:$C$59,\"Wednesday*\"),\"\")","v":0},{"$f":"IFERROR(SUMIF($C$29:$C$59,\"Wednesday*\",AE$29:AE$59)/COUNTIF($C$29:$C$59,\"Wednesday*\"),\"\")","v":0},{"$f":"IFERROR(SUMIF($C$29:$C$59,\"Wednesday*\",AF$29:AF$59)/COUNTIF($C$29:$C$59,\"Wednesday*\"),\"\")","v":0}]
[null,null,"THURSDAY",null,{"$f":"IFERROR(SUMIF($C$29:$C$59,\"Thursday*\",E$29:E$59),\"\")","v":0},{"$f":"IFERROR(SUMIF($C$29:$C$59,\"Thursday*\",F$29:F$59),\"\")","v":0},0,0,0,"","","","",{"$f":"IFERROR(SUMIF($C$29:$C$59,\"Thursday*\",N$29:N$59),\"\")","v":0},{"$f":"IFERROR(SUMIF($C$29:$C$59,\"Thursday*\",O$29:O$59),\"\")","v":0},0,{"$f":"IFERROR(SUMIF($C$29:$C$59,\"Thursday*\",Q$29:Q$59)/COUNTIF($C$29:$C$59,\"Thursday*\"),\"\")","v":0},{"$f":"IFERROR(SUMIF($C$29:$C$59,\"Thursday*\",R$29:R$59)/COUNTIF($C$29:$C$59,\"Thursday*\"),\"\")","v":0},{"$f":"IFERROR(SUMIF($C$29:$C$59,\"Thursday*\",S$29:S$59),\"\")","v":0},{"$f":"IFERROR(SUMIF($C$29:$C$59,\"Thursday*\",T$29:T$59),\"\")","v":0},0,{"$f":"IFERROR(SUMIF($C$29:$C$59,\"Thursday*\",V$29:V$59)/COUNTIF($C$29:$C$59,\"Thursday*\"),\"\")","v":0},{"$f":"IFERROR(SUMIF($C$29:$C$59,\"Thursday*\",W$29:W$59)/COUNTIF($C$29:$C$59,\"Thursday*\"),\"\")","v":0},{"$f":"IFERROR(SUMIF($C$29:$C$59,\"Thursday*\",X$29:X$59),\"\")","v":0},{"$f":"IFERROR(SUMIF($C$29:$C$59,\"Thursday*\",Y$29:Y$59),\"\")","v":0},0,0,0,{"$f":"IFERROR(SUMIF($C$29:$C$59,\"Thursday*\",AC$29:AC$59)/COUNTIF($C$29:$C$59,\"Thursday*\"),\"\")","v":0},{"$f":"IFERROR(SUMIF($C$29:$C$59,\"Thursday*\",AD$29:AD$59)/COUNTIF($C$29:$C$59,\"Thursday*\"),\"\")","v":0},{"$f":"IFERROR(SUMIF($C$29:$C$59,\"Thursday*\",AE$29:AE$59)/COUNTIF($C$29:$C$59,\"Thursday*\"),\"\")","v":0},{"$f":"IFERROR(SUMIF($C$29:$C$59,\"Thursday*\",AF$29:AF$59)/COUNTIF($C$29:$C$59,\"Thursday*\"),\"\")","v":0}]
[null,null,"FRIDAY",null,{"$f":"IFERROR(SUMIF($C$29:$C$59,\"Friday*\",E$29:E$59),\"\")","v":0},{"$f":"IFERROR(SUMIF($C$29:$C$59,\"Friday*\",F$29:F$59),\"\")","v":0},0,0,0,"","","","",{"$f":"IFERROR(SUMIF($C$29:$C$59,\"Friday*\",N$29:N$59),\"\")","v":0},{"$f":"IFERROR(SUMIF($C$29:$C$59,\"Friday*\",O$29:O$59),\"\")","v":0},0,{"$f":"IFERROR(SUMIF($C$29:$C$59,\"Friday*\",Q$29:Q$59)/COUNTIF($C$29:$C$59,\"Friday*\"),\"\")","v":0},{"$f":"IFERROR(SUMIF($C$29:$C$59,\"Friday*\",R$29:R$59)/COUNTIF($C$29:$C$59,\"Friday*\"),\"\")","v":0},{"$f":"IFERROR(SUMIF($C$29:$C$59,\"Friday*\",S$29:S$59),\"\")","v":0},{"$f":"IFERROR(SUMIF($C$29:$C$59,\"Friday*\",T$29:T$59),\"\")","v":0},0,{"$f":"IFERROR(SUMIF($C$29:$C$59,\"Friday*\",V$29:V$59)/COUNTIF($C$29:$C$59,\"Friday*\"),\"\")","v":0},{"$f":"IFERROR(SUMIF($C$29:$C$59,\"Friday*\",W$29:W$59)/COUNTIF($C$29:$C$59,\"Friday*\"),\"\")","v":0},{"$f":"IFERROR(SUMIF($C$29:$C$59,\"Friday*\",X$29:X$59),\"\")","v":0},{"$f":"IFERROR(SUMIF($C$29:$C$59,\"Friday*\",Y$29:Y$59),\"\")","v":0},0,0,0,{"$f":"IFERROR(SUMIF($C$29:$C$59,\"Friday*\",AC$29:AC$59)/COUNTIF($C$29:$C$59,\"Friday*\"),\"\")","v":0},{"$f":"IFERROR(SUMIF($C$29:$C$59,\"Friday*\",AD$29:AD$59)/COUNTIF($C$29:$C$59,\"Friday*\"),\"\")","v":0},{"$f":"IFERROR(SUMIF($C$29:$C$59,\"Friday*\",AE$29:AE$59)/COUNTIF($C$29:$C$59,\"Friday*\"),\"\")","v":0},{"$f":"IFERROR(SUMIF($C$29:$C$59,\"Friday*\",AF$29:AF$59)/COUNTIF($C$29:$C$59,\"Friday*\"),\"\")","v":0}]
[null,null,"SATURDAY",null,{"$f":"IFERROR(SUMIF($C$29:$C$59,\"Saturday*\",E$29:E$59),\"\")","v":0},{"$f":"IFERROR(SUMIF($C$29:$C$59,\"Saturday*\",F$29:F$59),\"\")","v":0},0,0,0,"","","","",{"$f":"IFERROR(SUMIF($C$29:$C$59,\"Saturday*\",N$29:N$59),\"\")","v":0},{"$f":"IFERROR(SUMIF($C$29:$C$59,\"Saturday*\",O$29:O$59),\"\")","v":0},0,{"$f":"IFERROR(SUMIF($C$29:$C$59,\"Saturday*\",Q$29:Q$59)/COUNTIF($C$29:$C$59,\"Saturday*\"),\"\")","v":0},{"$f":"IFERROR(SUMIF($C$29:$C$59,\"Saturday*\",R$29:R$59)/COUNTIF($C$29:$C$59,\"Saturday*\"),\"\")","v":0},{"$f":"IFERROR(SUMIF($C$29:$C$59,\"Saturday*\",S$29:S$59),\"\")","v":0},{"$f":"IFERROR(SUMIF($C$29:$C$59,\"Saturday*\",T$29:T$59),\"\")","v":0},0,{"$f":"IFERROR(SUMIF($C$29:$C$59,\"Saturday*\",V$29:V$59)/COUNTIF($C$29:$C$59,\"Saturday*\"),\"\")","v":0},{"$f":"IFERROR(SUMIF($C$29:$C$59,\"Saturday*\",W$29:W$59)/COUNTIF($C$29:$C$59,\"Saturday*\"),\"\")","v":0},{"$f":"IFERROR(SUMIF($C$29:$C$59,\"Saturday*\",X$29:X$59),\"\")","v":0},{"$f":"IFERROR(SUMIF($C$29:$C$59,\"Saturday*\",Y$29:Y$59),\"\")","v":0},0,0,0,{"$f":"IFERROR(SUMIF($C$29:$C$59,\"Saturday*\",AC$29:AC$59)/COUNTIF($C$29:$C$59,\"Saturday*\"),\"\")","v":0},{"$f":"IFERROR(SUMIF($C$29:$C$59,\"Saturday*\",AD$29:AD$59)/COUNTIF($C$29:$C$59,\"Saturday*\"),\"\")","v":0},{"$f":"IFERROR(SUMIF($C$29:$C$59,\"Saturday*\",AE$29:AE$59)/COUNTIF($C$29:$C$59,\"Saturday*\"),\"\")","v":0},{"$f":"IFERROR(SUMIF($C$29:$C$59,\"Saturday*\",AF$29:AF$59)/COUNTIF($C$29:$C$59,\"Saturday*\"),\"\")","v":0}]
[null,null,"SUNDAY",null,{"$f":"IFERROR(SUMIF($C$29:$C$59,\"Sunday*\",E$29:E$59),\"\")","v":0},{"$f":"IFERROR(SUMIF($C$29:$C$59,\"Sunday*\",F$29:F$59),\"\")","v":0},0,0,0,"","","","",{"$f":"IFERROR(SUMIF($C$29:$C$59,\"Sunday*\",N$29:N$59),\"\")","v":0},{"$f":"IFERROR(SUMIF($C$29:$C$59,\"Sunday*\",O$29:O$59),\"\")","v":0},0,{"$f":"IFERROR(SUMIF($C$29:$C$59,\"Sunday*\",Q$29:Q$59)/COUNTIF($C$29:$C$59,\"Sunday*\"),\"\")","v":0},{"$f":"IFERROR(SUMIF($C$29:$C$59,\"Sunday*\",R$29:R$59)/COUNTIF($C$29:$C$59,\"Sunday*\"),\"\")","v":0},{"$f":"IFERROR(SUMIF($C$29:$C$59,\"Sunday*\",S$29:S$59),\"\")","v":0},{"$f":"IFERROR(SUMIF($C$29:$C$59,\"Sunday*\",T$29:T$59),\"\")","v":0},0,{"$f":"IFERROR(SUMIF($C$29:$C$59,\"Sunday*\",V$29:V$59)/COUNTIF($C$29:$C$59,\"Sunday*\"),\"\")","v":0},{"$f":"IFERROR(SUMIF($C$29:$C$59,\"Sunday*\",W$29:W$59)/COUNTIF($C$29:$C$59,\"Sunday*\"),\"\")","v":0},{"$f":"IFERROR(SUMIF($C$29:$C$59,\"Sunday*\",X$29:X$59),\"\")","v":0},{"$f":"IFERROR(SUMIF($C$29:$C$59,\"Sunday*\",Y$29:Y$59),\"\")","v":0},0,0,0,{"$f":"IFERROR(SUMIF($C$29:$C$59,\"Sunday*\",AC$29:AC$59)/COUNTIF($C$29:$C$59,\"Sunday*\"),\"\")","v":0},{"$f":"IFERROR(SUMIF($C$29:$C$59,\"Sunday*\",AD$29:AD$59)/COUNTIF($C$29:$C$59,\"Sunday*\"),\"\")","v":0},{"$f":"IFERROR(SUMIF($C$29:$C$59,\"Sunday*\",AE$29:AE$59)/COUNTIF($C$29:$C$59,\"Sunday*\"),\"\")","v":0},{"$f":"IFERROR(SUMIF($C$29:$C$59,\"Sunday*\",AF$29:AF$59)/COUNTIF($C$29:$C$59,\"Sunday*\"),\"\")","v":0}]
[null,{"$f":"'Report A'!$B32","v":"2014-07-01"},{"$f":"'Report A'!$C32","v":"Tuesday"},{"$f":"'Report A'!$D32","v":1},{"$f":"IFERROR(SUM($F29:$I29),\"\")","v":0},{"$f":"IFERROR(IF($K$15=Data!$J$14,INDEX(Data!$EF$33:$EI$82,$D29,1),IF($K$15=Data!$J$15,INDEX(Data!$EJ$33:$EM$82,$D29,1),IF($K$15=Data!$J$16,INDEX(Data!$EN$33:$EQ$82,$D29,1),IF($K$15=Data!$J$17,INDEX(Data!$ER$33:$EU$82,$D29,1),\"\")))),\"\")","v":0},{"$f":"IFERROR(IF($K$15=Data!$J$14,INDEX(Data!$EF$33:$EI$82,$D29,2),IF($K$15=Data!$J$15,INDEX(Data!$EJ$33:$EM$82,$D29,2),IF($K$15=Data!$J$16,INDEX(Data!$EN$33:$EQ$82,$D29,2),IF($K$15=Data!$J$17,INDEX(Data!$ER$33:$EU$82,$D29,2),\"\")))),\"\")","v":0},{"$f":"IFERROR(IF($K$15=Data!$J$14,INDEX(Data!$EF$33:$EI$82,$D29,3),IF($K$15=Data!$J$15,INDEX(Data!$EJ$33:$EM$82,$D29,3),IF($K$15=Data!$J$16,INDEX(Data!$EN$33:$EQ$82,$D29,3),IF($K$15=Data!$J$17,INDEX(Data!$ER$33:$EU$82,$D29,3),\"\")))),\"\")","v":0},{"$f":"IFERROR(IF($K$15=Data!$J$14,INDEX(Data!$EF$33:$EI$82,$D29,4),IF($K$15=Data!$J$15,INDEX(Data!$EJ$33:$EM$82,$D29,4),IF($K$15=Data!$J$16,INDEX(Data!$EN$33:$EQ$82,$D29,4),IF($K$15=Data!$J$17,INDEX(Data!$ER$33:$EU$82,$D29,4),\"\")))),\"\")","v":0},{"$f":"IFERROR($F29/$E29,\"\")","v":""},{"$f":"IFERROR($G29/$E29,\"\")","v":""},{"$f":"IFERROR($H29/$E29,\"\")","v":""},{"$f":"IFERROR($I29/$E29,\"\")","v":""},{"$f":"IFERROR(SUM($O29:$P29),\"\")","v":0},{"$f":"IFERROR(INDIRECT(\"Data!$EV$\"&$D29+32),\"\")","v":0},{"$f":"IFERROR(INDIRECT(\"Data!$EW$\"&$D29+32),\"\")","v":0},{"$f":"IFERROR($O29/$N29,\"\")","v":""},{"$f":"IFERROR($P29/$N29,\"\")","v":""},{"$f":"IFERROR(SUM($T29:$U29),\"\")","v":0},{"$f":"IFERROR(INDIRECT(\"Data!$EX$\"&$D29+32),\"\")","v":0},{"$f":"IFERROR(INDIRECT(\"Data!$EY$\"&$D29+32),\"\")","v":0},{"$f":"IFERROR($T29/$S29,\"\")","v":""},{"$f":"IFERROR($U29/$S29,\"\")","v":""},{"$f":"IFERROR(SUM($Y29:$AB29),\"\")","v":0},{"$f":"IFERROR(INDIRECT(\"Data!$EZ$\"&$D29+32),\"\")","v":0},{"$f":"IFERROR(INDIRECT(\"Data!$FA$\"&$D29+32),\"\")","v":0},{"$f":"IFERROR(INDIRECT(\"Data!$FB$\"&$D29+32),\"\")","v":0},{"$f":"IFERROR(INDIRECT(\"Data!$FC$\"&$D29+32),\"\")","v":0},{"$f":"IFERROR($Y29/$X29,\"\")","v":""},{"$f":"IFERROR($Z29/$X29,\"\")","v":""},{"$f":"IFERROR($AA29/$X29,\"\")","v":""},{"$f":"IFERROR($AB29/$X29,\"\")","v":""}]
[null,{"$f":"'Report A'!$B33","v":"2014-07-02"},{"$f":"'Report A'!$C33","v":"Wednesday"},{"$f":"'Report A'!$D33","v":2},{"$f":"IFERROR(SUM($F30:$I30),\"\")","v":0},{"$f":"IFERROR(IF($K$15=Data!$J$14,INDEX(Data!$EF$33:$EI$82,$D30,1),IF($K$15=Data!$J$15,INDEX(Data!$EJ$33:$EM$82,$D30,1),IF($K$15=Data!$J$16,INDEX(Data!$EN$33:$EQ$82,$D30,1),IF($K$15=Data!$J$17,INDEX(Data!$ER$33:$EU$82,$D30,1),\"\")))),\"\")","v":0},{"$f":"IFERROR(IF($K$15=Data!$J$14,INDEX(Data!$EF$33:$EI$82,$D30,2),IF($K$15=Data!$J$15,INDEX(Data!$EJ$33:$EM$82,$D30,2),IF($K$15=Data!$J$16,INDEX(Data!$EN$33:$EQ$82,$D30,2),IF($K$15=Data!$J$17,INDEX(Data!$ER$33:$EU$82,$D30,2),\"\")))),\"\")","v":0},{"$f":"IFERROR(IF($K$15=Data!$J$14,INDEX(Data!$EF$33:$EI$82,$D30,3),IF($K$15=Data!$J$15,INDEX(Data!$EJ$33:$EM$82,$D30,3),IF($K$15=Data!$J$16,INDEX(Data!$EN$33:$EQ$82,$D30,3),IF($K$15=Data!$J$17,INDEX(Data!$ER$33:$EU$82,$D30,3),\"\")))),\"\")","v":0},{"$f":"IFERROR(IF($K$15=Data!$J$14,INDEX(Data!$EF$33:$EI$82,$D30,4),IF($K$15=Data!$J$15,INDEX(Data!$EJ$33:$EM$82,$D30,4),IF($K$15=Data!$J$16,INDEX(Data!$EN$33:$EQ$82,$D30,4),IF($K$15=Data!$J$17,INDEX(Data!$ER$33:$EU$82,$D30,4),\"\")))),\"\")","v":0},{"$f":"IFERROR($F30/$E30,\"\")","v":""},{"$f":"IFERROR($G30/$E30,\"\")","v":""},{"$f":"IFERROR($H30/$E30,\"\")","v":""},{"$f":"IFERROR($I30/$E30,\"\")","v":""},{"$f":"IFERROR(SUM($O30:$P30),\"\")","v":0},{"$f":"IFERROR(INDIRECT(\"Data!$EV$\"&$D30+32),\"\")","v":0},{"$f":"IFERROR(INDIRECT(\"Data!$EW$\"&$D30+32),\"\")","v":0},{"$f":"IFERROR($O30/$N30,\"\")","v":""},{"$f":"IFERROR($P30/$N30,\"\")","v":""},{"$f":"IFERROR(SUM($T30:$U30),\"\")","v":0},{"$f":"IFERROR(INDIRECT(\"Data!$EX$\"&$D30+32),\"\")","v":0},{"$f":"IFERROR(INDIRECT(\"Data!$EY$\"&$D30+32),\"\")","v":0},{"$f":"IFERROR($T30/$S30,\"\")","v":""},{"$f":"IFERROR($U30/$S30,\"\")","v":""},{"$f":"IFERROR(SUM($Y30:$AB30),\"\")","v":0},{"$f":"IFERROR(INDIRECT(\"Data!$EZ$\"&$D30+32),\"\")","v":0},{"$f":"IFERROR(INDIRECT(\"Data!$FA$\"&$D30+32),\"\")","v":0},{"$f":"IFERROR(INDIRECT(\"Data!$FB$\"&$D30+32),\"\")","v":0},{"$f":"IFERROR(INDIRECT(\"Data!$FC$\"&$D30+32),\"\")","v":0},{"$f":"IFERROR($Y30/$X30,\"\")","v":""},{"$f":"IFERROR($Z30/$X30,\"\")","v":""},{"$f":"IFERROR($AA30/$X30,\"\")","v":""},{"$f":"IFERROR($AB30/$X30,\"\")","v":""}]
[null,{"$f":"'Report A'!$B34","v":"2014-07-03"},{"$f":"'Report A'!$C34","v":"Thursday"},{"$f":"'Report A'!$D34","v":3},0,{"$f":"IFERROR(IF($K$15=Data!$J$14,INDEX(Data!$EF$33:$EI$82,$D31,1),IF($K$15=Data!$J$15,INDEX(Data!$EJ$33:$EM$82,$D31,1),IF($K$15=Data!$J$16,INDEX(Data!$EN$33:$EQ$82,$D31,1),IF($K$15=Data!$J$17,INDEX(Data!$ER$33:$EU$82,$D31,1),\"\")))),\"\")","v":0},{"$f":"IFERROR(IF($K$15=Data!$J$14,INDEX(Data!$EF$33:$EI$82,$D31,2),IF($K$15=Data!$J$15,INDEX(Data!$EJ$33:$EM$82,$D31,2),IF($K$15=Data!$J$16,INDEX(Data!$EN$33:$EQ$82,$D31,2),IF($K$15=Data!$J$17,INDEX(Data!$ER$33:$EU$82,$D31,2),\"\")))),\"\")","v":0},{"$f":"IFERROR(IF($K$15=Data!$J$14,INDEX(Data!$EF$33:$EI$82,$D31,3),IF($K$15=Data!$J$15,INDEX(Data!$EJ$33:$EM$82,$D31,3),IF($K$15=Data!$J$16,INDEX(Data!$EN$33:$EQ$82,$D31,3),IF($K$15=Data!$J$17,INDEX(Data!$ER$33:$EU$82,$D31,3),\"\")))),\"\")","v":0},{"$f":"IFERROR(IF($K$15=Data!$J$14,INDEX(Data!$EF$33:$EI$82,$D31,4),IF($K$15=Data!$J$15,INDEX(Data!$EJ$33:$EM$82,$D31,4),IF($K$15=Data!$J$16,INDEX(Data!$EN$33:$EQ$82,$D31,4),IF($K$15=Data!$J$17,INDEX(Data!$ER$33:$EU$82,$D31,4),\"\")))),\"\")","v":0},"","","","",0,0,0,"","",0,0,0,"","",0,0,0,0,0,"","","",""]
[null,{"$f":"'Report A'!$B35","v":"2014-07-04"},{"$f":"'Report A'!$C35","v":"Friday"},{"$f":"'Report A'!$D35","v":4},0,{"$f":"IFERROR(IF($K$15=Data!$J$14,INDEX(Data!$EF$33:$EI$82,$D32,1),IF($K$15=Data!$J$15,INDEX(Data!$EJ$33:$EM$82,$D32,1),IF($K$15=Data!$J$16,INDEX(Data!$EN$33:$EQ$82,$D32,1),IF($K$15=Data!$J$17,INDEX(Data!$ER$33:$EU$82,$D32,1),\"\")))),\"\")","v":0},{"$f":"IFERROR(IF($K$15=Data!$J$14,INDEX(Data!$EF$33:$EI$82,$D32,2),IF($K$15=Data!$J$15,INDEX(Data!$EJ$33:$EM$82,$D32,2),IF($K$15=Data!$J$16,INDEX(Data!$EN$33:$EQ$82,$D32,2),IF($K$15=Data!$J$17,INDEX(Data!$ER$33:$EU$82,$D32,2),\"\")))),\"\")","v":0},{"$f":"IFERROR(IF($K$15=Data!$J$14,INDEX(Data!$EF$33:$EI$82,$D32,3),IF($K$15=Data!$J$15,INDEX(Data!$EJ$33:$EM$82,$D32,3),IF($K$15=Data!$J$16,INDEX(Data!$EN$33:$EQ$82,$D32,3),IF($K$15=Data!$J$17,INDEX(Data!$ER$33:$EU$82,$D32,3),\"\")))),\"\")","v":0},{"$f":"IFERROR(IF($K$15=Data!$J$14,INDEX(Data!$EF$33:$EI$82,$D32,4),IF($K$15=Data!$J$15,INDEX(Data!$EJ$33:$EM$82,$D32,4),IF($K$15=Data!$J$16,INDEX(Data!$EN$33:$EQ$82,$D32,4),IF($K$15=Data!$J$17,INDEX(Data!$ER$33:$EU$82,$D32,4),\"\")))),\"\")","v":0},"","","","",0,0,0,"","",0,0,0,"","",0,0,0,0,0,"","","","","CHART G3"]
[null,{"$f":"'Report A'!$B36","v":"2014-07-05"},{"$f":"'Report A'!$C36","v":"Saturday"},{"$f":"'Report A'!$D36","v":5},0,{"$f":"IFERROR(IF($K$15=Data!$J$14,INDEX(Data!$EF$33:$EI$82,$D33,1),IF($K$15=Data!$J$15,INDEX(Data!$EJ$33:$EM$82,$D33,1),IF($K$15=Data!$J$16,INDEX(Data!$EN$33:$EQ$82,$D33,1),IF($K$15=Data!$J$17,INDEX(Data!$ER$33:$EU$82,$D33,1),\"\")))),\"\")","v":0},{"$f":"IFERROR(IF($K$15=Data!$J$14,INDEX(Data!$EF$33:$EI$82,$D33,2),IF($K$15=Data!$J$15,INDEX(Data!$EJ$33:$EM$82,$D33,2),IF($K$15=Data!$J$16,INDEX(Data!$EN$33:$EQ$82,$D33,2),IF($K$15=Data!$J$17,INDEX(Data!$ER$33:$EU$82,$D33,2),\"\")))),\"\")","v":0},{"$f":"IFERROR(IF($K$15=Data!$J$14,INDEX(Data!$EF$33:$EI$82,$D33,3),IF($K$15=Data!$J$15,INDEX(Data!$EJ$33:$EM$82,$D33,3),IF($K$15=Data!$J$16,INDEX(Data!$EN$33:$EQ$82,$D33,3),IF($K$15=Data!$J$17,INDEX(Data!$ER$33:$EU$82,$D33,3),\"\")))),\"\")","v":0},{"$f":"IFERROR(IF($K$15=Data!$J$14,INDEX(Data!$EF$33:$EI$82,$D33,4),IF($K$15=Data!$J$15,INDEX(Data!$EJ$33:$EM$82,$D33,4),IF($K$15=Data!$J$16,INDEX(Data!$EN$33:$EQ$82,$D33,4),IF($K$15=Data!$J$17,INDEX(Data!$ER$33:$EU$82,$D33,4),\"\")))),\"\")","v":0},"","","","",0,0,0,"","",0,0,0,"","",0,0,0,0,0,"","","",""]
[null,{"$f":"'Report A'!$B37","v":"2014-07-06"},{"$f":"'Report A'!$C37","v":"Sunday"},{"$f":"'Report A'!$D37","v":6},0,{"$f":"IFERROR(IF($K$15=Data!$J$14,INDEX(Data!$EF$33:$EI$82,$D34,1),IF($K$15=Data!$J$15,INDEX(Data!$EJ$33:$EM$82,$D34,1),IF($K$15=Data!$J$16,INDEX(Data!$EN$33:$EQ$82,$D34,1),IF($K$15=Data!$J$17,INDEX(Data!$ER$33:$EU$82,$D34,1),\"\")))),\"\")","v":0},{"$f":"IFERROR(IF($K$15=Data!$J$14,INDEX(Data!$EF$33:$EI$82,$D34,2),IF($K$15=Data!$J$15,INDEX(Data!$EJ$33:$EM$82,$D34,2),IF($K$15=Data!$J$16,INDEX(Data!$EN$33:$EQ$82,$D34,2),IF($K$15=Data!$J$17,INDEX(Data!$ER$33:$EU$82,$D34,2),\"\")))),\"\")","v":0},{"$f":"IFERROR(IF($K$15=Data!$J$14,INDEX(Data!$EF$33:$EI$82,$D34,3),IF($K$15=Data!$J$15,INDEX(Data!$EJ$33:$EM$82,$D34,3),IF($K$15=Data!$J$16,INDEX(Data!$EN$33:$EQ$82,$D34,3),IF($K$15=Data!$J$17,INDEX(Data!$ER$33:$EU$82,$D34,3),\"\")))),\"\")","v":0},{"$f":"IFERROR(IF($K$15=Data!$J$14,INDEX(Data!$EF$33:$EI$82,$D34,4),IF($K$15=Data!$J$15,INDEX(Data!$EJ$33:$EM$82,$D34,4),IF($K$15=Data!$J$16,INDEX(Data!$EN$33:$EQ$82,$D34,4),IF($K$15=Data!$J$17,INDEX(Data!$ER$33:$EU$82,$D34,4),\"\")))),\"\")","v":0},"","","","",0,0,0,"","",0,0,0,"","",0,0,0,0,0,"","","",""]
[null,{"$f":"'Report A'!$B38","v":"2014-07-07"},{"$f":"'Report A'!$C38","v":"Monday"},{"$f":"'Report A'!$D38","v":7},0,{"$f":"IFERROR(IF($K$15=Data!$J$14,INDEX(Data!$EF$33:$EI$82,$D35,1),IF($K$15=Data!$J$15,INDEX(Data!$EJ$33:$EM$82,$D35,1),IF($K$15=Data!$J$16,INDEX(Data!$EN$33:$EQ$82,$D35,1),IF($K$15=Data!$J$17,INDEX(Data!$ER$33:$EU$82,$D35,1),\"\")))),\"\")","v":0},{"$f":"IFERROR(IF($K$15=Data!$J$14,INDEX(Data!$EF$33:$EI$82,$D35,2),IF($K$15=Data!$J$15,INDEX(Data!$EJ$33:$EM$82,$D35,2),IF($K$15=Data!$J$16,INDEX(Data!$EN$33:$EQ$82,$D35,2),IF($K$15=Data!$J$17,INDEX(Data!$ER$33:$EU$82,$D35,2),\"\")))),\"\")","v":0},{"$f":"IFERROR(IF($K$15=Data!$J$14,INDEX(Data!$EF$33:$EI$82,$D35,3),IF($K$15=Data!$J$15,INDEX(Data!$EJ$33:$EM$82,$D35,3),IF($K$15=Data!$J$16,INDEX(Data!$EN$33:$EQ$82,$D35,3),IF($K$15=Data!$J$17,INDEX(Data!$ER$33:$EU$82,$D35,3),\"\")))),\"\")","v":0},{"$f":"IFERROR(IF($K$15=Data!$J$14,INDEX(Data!$EF$33:$EI$82,$D35,4),IF($K$15=Data!$J$15,INDEX(Data!$EJ$33:$EM$82,$D35,4),IF($K$15=Data!$J$16,INDEX(Data!$EN$33:$EQ$82,$D35,4),IF($K$15=Data!$J$17,INDEX(Data!$ER$33:$EU$82,$D35,4),\"\")))),\"\")","v":0},"","","","",0,0,0,"","",0,0,0,"","",0,0,0,0,0,"","","",""]
[null,{"$f":"'Report A'!$B39","v":"2014-07-08"},{"$f":"'Report A'!$C39","v":"Tuesday"},{"$f":"'Report A'!$D39","v":8},0,{"$f":"IFERROR(IF($K$15=Data!$J$14,INDEX(Data!$EF$33:$EI$82,$D36,1),IF($K$15=Data!$J$15,INDEX(Data!$EJ$33:$EM$82,$D36,1),IF($K$15=Data!$J$16,INDEX(Data!$EN$33:$EQ$82,$D36,1),IF($K$15=Data!$J$17,INDEX(Data!$ER$33:$EU$82,$D36,1),\"\")))),\"\")","v":0},{"$f":"IFERROR(IF($K$15=Data!$J$14,INDEX(Data!$EF$33:$EI$82,$D36,2),IF($K$15=Data!$J$15,INDEX(Data!$EJ$33:$EM$82,$D36,2),IF($K$15=Data!$J$16,INDEX(Data!$EN$33:$EQ$82,$D36,2),IF($K$15=Data!$J$17,INDEX(Data!$ER$33:$EU$82,$D36,2),\"\")))),\"\")","v":0},{"$f":"IFERROR(IF($K$15=Data!$J$14,INDEX(Data!$EF$33:$EI$82,$D36,3),IF($K$15=Data!$J$15,INDEX(Data!$EJ$33:$EM$82,$D36,3),IF($K$15=Data!$J$16,INDEX(Data!$EN$33:$EQ$82,$D36,3),IF($K$15=Data!$J$17,INDEX(Data!$ER$33:$EU$82,$D36,3),\"\")))),\"\")","v":0},{"$f":"IFERROR(IF($K$15=Data!$J$14,INDEX(Data!$EF$33:$EI$82,$D36,4),IF($K$15=Data!$J$15,INDEX(Data!$EJ$33:$EM$82,$D36,4),IF($K$15=Data!$J$16,INDEX(Data!$EN$33:$EQ$82,$D36,4),IF($K$15=Data!$J$17,INDEX(Data!$ER$33:$EU$82,$D36,4),\"\")))),\"\")","v":0},"","","","",0,0,0,"","",0,0,0,"","",0,0,0,0,0,"","","",""]
[null,{"$f":"'Report A'!$B40","v":"2014-07-09"},{"$f":"'Report A'!$C40","v":"Wednesday"},{"$f":"'Report A'!$D40","v":9},0,{"$f":"IFERROR(IF($K$15=Data!$J$14,INDEX(Data!$EF$33:$EI$82,$D37,1),IF($K$15=Data!$J$15,INDEX(Data!$EJ$33:$EM$82,$D37,1),IF($K$15=Data!$J$16,INDEX(Data!$EN$33:$EQ$82,$D37,1),IF($K$15=Data!$J$17,INDEX(Data!$ER$33:$EU$82,$D37,1),\"\")))),\"\")","v":0},{"$f":"IFERROR(IF($K$15=Data!$J$14,INDEX(Data!$EF$33:$EI$82,$D37,2),IF($K$15=Data!$J$15,INDEX(Data!$EJ$33:$EM$82,$D37,2),IF($K$15=Data!$J$16,INDEX(Data!$EN$33:$EQ$82,$D37,2),IF($K$15=Data!$J$17,INDEX(Data!$ER$33:$EU$82,$D37,2),\"\")))),\"\")","v":0},{"$f":"IFERROR(IF($K$15=Data!$J$14,INDEX(Data!$EF$33:$EI$82,$D37,3),IF($K$15=Data!$J$15,INDEX(Data!$EJ$33:$EM$82,$D37,3),IF($K$15=Data!$J$16,INDEX(Data!$EN$33:$EQ$82,$D37,3),IF($K$15=Data!$J$17,INDEX(Data!$ER$33:$EU$82,$D37,3),\"\")))),\"\")","v":0},{"$f":"IFERROR(IF($K$15=Data!$J$14,INDEX(Data!$EF$33:$EI$82,$D37,4),IF($K$15=Data!$J$15,INDEX(Data!$EJ$33:$EM$82,$D37,4),IF($K$15=Data!$J$16,INDEX(Data!$EN$33:$EQ$82,$D37,4),IF($K$15=Data!$J$17,INDEX(Data!$ER$33:$EU$82,$D37,4),\"\")))),\"\")","v":0},"","","","",0,0,0,"","",0,0,0,"","",0,0,0,0,0,"","","",""]
[null,{"$f":"'Report A'!$B41","v":"2014-07-10"},{"$f":"'Report A'!$C41","v":"Thursday"},{"$f":"'Report A'!$D41","v":10},0,{"$f":"IFERROR(IF($K$15=Data!$J$14,INDEX(Data!$EF$33:$EI$82,$D38,1),IF($K$15=Data!$J$15,INDEX(Data!$EJ$33:$EM$82,$D38,1),IF($K$15=Data!$J$16,INDEX(Data!$EN$33:$EQ$82,$D38,1),IF($K$15=Data!$J$17,INDEX(Data!$ER$33:$EU$82,$D38,1),\"\")))),\"\")","v":0},{"$f":"IFERROR(IF($K$15=Data!$J$14,INDEX(Data!$EF$33:$EI$82,$D38,2),IF($K$15=Data!$J$15,INDEX(Data!$EJ$33:$EM$82,$D38,2),IF($K$15=Data!$J$16,INDEX(Data!$EN$33:$EQ$82,$D38,2),IF($K$15=Data!$J$17,INDEX(Data!$ER$33:$EU$82,$D38,2),\"\")))),\"\")","v":0},{"$f":"IFERROR(IF($K$15=Data!$J$14,INDEX(Data!$EF$33:$EI$82,$D38,3),IF($K$15=Data!$J$15,INDEX(Data!$EJ$33:$EM$82,$D38,3),IF($K$15=Data!$J$16,INDEX(Data!$EN$33:$EQ$82,$D38,3),IF($K$15=Data!$J$17,INDEX(Data!$ER$33:$EU$82,$D38,3),\"\")))),\"\")","v":0},{"$f":"IFERROR(IF($K$15=Data!$J$14,INDEX(Data!$EF$33:$EI$82,$D38,4),IF($K$15=Data!$J$15,INDEX(Data!$EJ$33:$EM$82,$D38,4),IF($K$15=Data!$J$16,INDEX(Data!$EN$33:$EQ$82,$D38,4),IF($K$15=Data!$J$17,INDEX(Data!$ER$33:$EU$82,$D38,4),\"\")))),\"\")","v":0},"","","","",0,0,0,"","",0,0,0,"","",0,0,0,0,0,"","","",""]
[null,{"$f":"'Report A'!$B42","v":"2014-07-11"},{"$f":"'Report A'!$C42","v":"Friday"},{"$f":"'Report A'!$D42","v":11},0,{"$f":"IFERROR(IF($K$15=Data!$J$14,INDEX(Data!$EF$33:$EI$82,$D39,1),IF($K$15=Data!$J$15,INDEX(Data!$EJ$33:$EM$82,$D39,1),IF($K$15=Data!$J$16,INDEX(Data!$EN$33:$EQ$82,$D39,1),IF($K$15=Data!$J$17,INDEX(Data!$ER$33:$EU$82,$D39,1),\"\")))),\"\")","v":0},{"$f":"IFERROR(IF($K$15=Data!$J$14,INDEX(Data!$EF$33:$EI$82,$D39,2),IF($K$15=Data!$J$15,INDEX(Data!$EJ$33:$EM$82,$D39,2),IF($K$15=Data!$J$16,INDEX(Data!$EN$33:$EQ$82,$D39,2),IF($K$15=Data!$J$17,INDEX(Data!$ER$33:$EU$82,$D39,2),\"\")))),\"\")","v":0},{"$f":"IFERROR(IF($K$15=Data!$J$14,INDEX(Data!$EF$33:$EI$82,$D39,3),IF($K$15=Data!$J$15,INDEX(Data!$EJ$33:$EM$82,$D39,3),IF($K$15=Data!$J$16,INDEX(Data!$EN$33:$EQ$82,$D39,3),IF($K$15=Data!$J$17,INDEX(Data!$ER$33:$EU$82,$D39,3),\"\")))),\"\")","v":0},{"$f":"IFERROR(IF($K$15=Data!$J$14,INDEX(Data!$EF$33:$EI$82,$D39,4),IF($K$15=Data!$J$15,INDEX(Data!$EJ$33:$EM$82,$D39,4),IF($K$15=Data!$J$16,INDEX(Data!$EN$33:$EQ$82,$D39,4),IF($K$15=Data!$J$17,INDEX(Data!$ER$33:$EU$82,$D39,4),\"\")))),\"\")","v":0},"","","","",0,0,0,"","",0,0,0,"","",0,0,0,0,0,"","","",""]
[null,{"$f":"'Report A'!$B43","v":"2014-07-12"},{"$f":"'Report A'!$C43","v":"Saturday"},{"$f":"'Report A'!$D43","v":12},0,{"$f":"IFERROR(IF($K$15=Data!$J$14,INDEX(Data!$EF$33:$EI$82,$D40,1),IF($K$15=Data!$J$15,INDEX(Data!$EJ$33:$EM$82,$D40,1),IF($K$15=Data!$J$16,INDEX(Data!$EN$33:$EQ$82,$D40,1),IF($K$15=Data!$J$17,INDEX(Data!$ER$33:$EU$82,$D40,1),\"\")))),\"\")","v":0},{"$f":"IFERROR(IF($K$15=Data!$J$14,INDEX(Data!$EF$33:$EI$82,$D40,2),IF($K$15=Data!$J$15,INDEX(Data!$EJ$33:$EM$82,$D40,2),IF($K$15=Data!$J$16,INDEX(Data!$EN$33:$EQ$82,$D40,2),IF($K$15=Data!$J$17,INDEX(Data!$ER$33:$EU$82,$D40,2),\"\")))),\"\")","v":0},{"$f":"IFERROR(IF($K$15=Data!$J$14,INDEX(Data!$EF$33:$EI$82,$D40,3),IF($K$15=Data!$J$15,INDEX(Data!$EJ$33:$EM$82,$D40,3),IF($K$15=Data!$J$16,INDEX(Data!$EN$33:$EQ$82,$D40,3),IF($K$15=Data!$J$17,INDEX(Data!$ER$33:$EU$82,$D40,3),\"\")))),\"\")","v":0},{"$f":"IFERROR(IF($K$15=Data!$J$14,INDEX(Data!$EF$33:$EI$82,$D40,4),IF($K$15=Data!$J$15,INDEX(Data!$EJ$33:$EM$82,$D40,4),IF($K$15=Data!$J$16,INDEX(Data!$EN$33:$EQ$82,$D40,4),IF($K$15=Data!$J$17,INDEX(Data!$ER$33:$EU$82,$D40,4),\"\")))),\"\")","v":0},"","","","",0,0,0,"","",0,0,0,"","",0,0,0,0,0,"","","",""]
[null,{"$f":"'Report A'!$B44","v":"2014-07-13"},{"$f":"'Report A'!$C44","v":"Sunday"},{"$f":"'Report A'!$D44","v":13},0,{"$f":"IFERROR(IF($K$15=Data!$J$14,INDEX(Data!$EF$33:$EI$82,$D41,1),IF($K$15=Data!$J$15,INDEX(Data!$EJ$33:$EM$82,$D41,1),IF($K$15=Data!$J$16,INDEX(Data!$EN$33:$EQ$82,$D41,1),IF($K$15=Data!$J$17,INDEX(Data!$ER$33:$EU$82,$D41,1),\"\")))),\"\")","v":0},{"$f":"IFERROR(IF($K$15=Data!$J$14,INDEX(Data!$EF$33:$EI$82,$D41,2),IF($K$15=Data!$J$15,INDEX(Data!$EJ$33:$EM$82,$D41,2),IF($K$15=Data!$J$16,INDEX(Data!$EN$33:$EQ$82,$D41,2),IF($K$15=Data!$J$17,INDEX(Data!$ER$33:$EU$82,$D41,2),\"\")))),\"\")","v":0},{"$f":"IFERROR(IF($K$15=Data!$J$14,INDEX(Data!$EF$33:$EI$82,$D41,3),IF($K$15=Data!$J$15,INDEX(Data!$EJ$33:$EM$82,$D41,3),IF($K$15=Data!$J$16,INDEX(Data!$EN$33:$EQ$82,$D41,3),IF($K$15=Data!$J$17,INDEX(Data!$ER$33:$EU$82,$D41,3),\"\")))),\"\")","v":0},{"$f":"IFERROR(IF($K$15=Data!$J$14,INDEX(Data!$EF$33:$EI$82,$D41,4),IF($K$15=Data!$J$15,INDEX(Data!$EJ$33:$EM$82,$D41,4),IF($K$15=Data!$J$16,INDEX(Data!$EN$33:$EQ$82,$D41,4),IF($K$15=Data!$J$17,INDEX(Data!$ER$33:$EU$82,$D41,4),\"\")))),\"\")","v":0},"","","","",0,0,0,"","",0,0,0,"","",0,0,0,0,0,"","","",""]
[null,{"$f":"'Report A'!$B45","v":"2014-07-14"},{"$f":"'Report A'!$C45","v":"Monday"},{"$f":"'Report A'!$D45","v":14},0,{"$f":"IFERROR(IF($K$15=Data!$J$14,INDEX(Data!$EF$33:$EI$82,$D42,1),IF($K$15=Data!$J$15,INDEX(Data!$EJ$33:$EM$82,$D42,1),IF($K$15=Data!$J$16,INDEX(Data!$EN$33:$EQ$82,$D42,1),IF($K$15=Data!$J$17,INDEX(Data!$ER$33:$EU$82,$D42,1),\"\")))),\"\")","v":0},{"$f":"IFERROR(IF($K$15=Data!$J$14,INDEX(Data!$EF$33:$EI$82,$D42,2),IF($K$15=Data!$J$15,INDEX(Data!$EJ$33:$EM$82,$D42,2),IF($K$15=Data!$J$16,INDEX(Data!$EN$33:$EQ$82,$D42,2),IF($K$15=Data!$J$17,INDEX(Data!$ER$33:$EU$82,$D42,2),\"\")))),\"\")","v":0},{"$f":"IFERROR(IF($K$15=Data!$J$14,INDEX(Data!$EF$33:$EI$82,$D42,3),IF($K$15=Data!$J$15,INDEX(Data!$EJ$33:$EM$82,$D42,3),IF($K$15=Data!$J$16,INDEX(Data!$EN$33:$EQ$82,$D42,3),IF($K$15=Data!$J$17,INDEX(Data!$ER$33:$EU$82,$D42,3),\"\")))),\"\")","v":0},{"$f":"IFERROR(IF($K$15=Data!$J$14,INDEX(Data!$EF$33:$EI$82,$D42,4),IF($K$15=Data!$J$15,INDEX(Data!$EJ$33:$EM$82,$D42,4),IF($K$15=Data!$J$16,INDEX(Data!$EN$33:$EQ$82,$D42,4),IF($K$15=Data!$J$17,INDEX(Data!$ER$33:$EU$82,$D42,4),\"\")))),\"\")","v":0},"","","","",0,0,0,"","",0,0,0,"","",0,0,0,0,0,"","","",""]
[null,{"$f":"'Report A'!$B46","v":"2014-07-15"},{"$f":"'Report A'!$C46","v":"Tuesday"},{"$f":"'Report A'!$D46","v":15},0,{"$f":"IFERROR(IF($K$15=Data!$J$14,INDEX(Data!$EF$33:$EI$82,$D43,1),IF($K$15=Data!$J$15,INDEX(Data!$EJ$33:$EM$82,$D43,1),IF($K$15=Data!$J$16,INDEX(Data!$EN$33:$EQ$82,$D43,1),IF($K$15=Data!$J$17,INDEX(Data!$ER$33:$EU$82,$D43,1),\"\")))),\"\")","v":0},{"$f":"IFERROR(IF($K$15=Data!$J$14,INDEX(Data!$EF$33:$EI$82,$D43,2),IF($K$15=Data!$J$15,INDEX(Data!$EJ$33:$EM$82,$D43,2),IF($K$15=Data!$J$16,INDEX(Data!$EN$33:$EQ$82,$D43,2),IF($K$15=Data!$J$17,INDEX(Data!$ER$33:$EU$82,$D43,2),\"\")))),\"\")","v":0},{"$f":"IFERROR(IF($K$15=Data!$J$14,INDEX(Data!$EF$33:$EI$82,$D43,3),IF($K$15=Data!$J$15,INDEX(Data!$EJ$33:$EM$82,$D43,3),IF($K$15=Data!$J$16,INDEX(Data!$EN$33:$EQ$82,$D43,3),IF($K$15=Data!$J$17,INDEX(Data!$ER$33:$EU$82,$D43,3),\"\")))),\"\")","v":0},{"$f":"IFERROR(IF($K$15=Data!$J$14,INDEX(Data!$EF$33:$EI$82,$D43,4),IF($K$15=Data!$J$15,INDEX(Data!$EJ$33:$EM$82,$D43,4),IF($K$15=Data!$J$16,INDEX(Data!$EN$33:$EQ$82,$D43,4),IF($K$15=Data!$J$17,INDEX(Data!$ER$33:$EU$82,$D43,4),\"\")))),\"\")","v":0},"","","","",0,0,0,"","",0,0,0,"","",0,0,0,0,0,"","","",""]
[null,{"$f":"'Report A'!$B47","v":"2014-07-16"},{"$f":"'Report A'!$C47","v":"Wednesday"},{"$f":"'Report A'!$D47","v":16},0,{"$f":"IFERROR(IF($K$15=Data!$J$14,INDEX(Data!$EF$33:$EI$82,$D44,1),IF($K$15=Data!$J$15,INDEX(Data!$EJ$33:$EM$82,$D44,1),IF($K$15=Data!$J$16,INDEX(Data!$EN$33:$EQ$82,$D44,1),IF($K$15=Data!$J$17,INDEX(Data!$ER$33:$EU$82,$D44,1),\"\")))),\"\")","v":0},{"$f":"IFERROR(IF($K$15=Data!$J$14,INDEX(Data!$EF$33:$EI$82,$D44,2),IF($K$15=Data!$J$15,INDEX(Data!$EJ$33:$EM$82,$D44,2),IF($K$15=Data!$J$16,INDEX(Data!$EN$33:$EQ$82,$D44,2),IF($K$15=Data!$J$17,INDEX(Data!$ER$33:$EU$82,$D44,2),\"\")))),\"\")","v":0},{"$f":"IFERROR(IF($K$15=Data!$J$14,INDEX(Data!$EF$33:$EI$82,$D44,3),IF($K$15=Data!$J$15,INDEX(Data!$EJ$33:$EM$82,$D44,3),IF($K$15=Data!$J$16,INDEX(Data!$EN$33:$EQ$82,$D44,3),IF($K$15=Data!$J$17,INDEX(Data!$ER$33:$EU$82,$D44,3),\"\")))),\"\")","v":0},{"$f":"IFERROR(IF($K$15=Data!$J$14,INDEX(Data!$EF$33:$EI$82,$D44,4),IF($K$15=Data!$J$15,INDEX(Data!$EJ$33:$EM$82,$D44,4),IF($K$15=Data!$J$16,INDEX(Data!$EN$33:$EQ$82,$D44,4),IF($K$15=Data!$J$17,INDEX(Data!$ER$33:$EU$82,$D44,4),\"\")))),\"\")","v":0},"","","","",0,0,0,"","",0,0,0,"","",0,0,0,0,0,"","","",""]
[null,{"$f":"'Report A'!$B48","v":"2014-07-17"},{"$f":"'Report A'!$C48","v":"Thursday"},{"$f":"'Report A'!$D48","v":17},0,{"$f":"IFERROR(IF($K$15=Data!$J$14,INDEX(Data!$EF$33:$EI$82,$D45,1),IF($K$15=Data!$J$15,INDEX(Data!$EJ$33:$EM$82,$D45,1),IF($K$15=Data!$J$16,INDEX(Data!$EN$33:$EQ$82,$D45,1),IF($K$15=Data!$J$17,INDEX(Data!$ER$33:$EU$82,$D45,1),\"\")))),\"\")","v":0},{"$f":"IFERROR(IF($K$15=Data!$J$14,INDEX(Data!$EF$33:$EI$82,$D45,2),IF($K$15=Data!$J$15,INDEX(Data!$EJ$33:$EM$82,$D45,2),IF($K$15=Data!$J$16,INDEX(Data!$EN$33:$EQ$82,$D45,2),IF($K$15=Data!$J$17,INDEX(Data!$ER$33:$EU$82,$D45,2),\"\")))),\"\")","v":0},{"$f":"IFERROR(IF($K$15=Data!$J$14,INDEX(Data!$EF$33:$EI$82,$D45,3),IF($K$15=Data!$J$15,INDEX(Data!$EJ$33:$EM$82,$D45,3),IF($K$15=Data!$J$16,INDEX(Data!$EN$33:$EQ$82,$D45,3),IF($K$15=Data!$J$17,INDEX(Data!$ER$33:$EU$82,$D45,3),\"\")))),\"\")","v":0},{"$f":"IFERROR(IF($K$15=Data!$J$14,INDEX(Data!$EF$33:$EI$82,$D45,4),IF($K$15=Data!$J$15,INDEX(Data!$EJ$33:$EM$82,$D45,4),IF($K$15=Data!$J$16,INDEX(Data!$EN$33:$EQ$82,$D45,4),IF($K$15=Data!$J$17,INDEX(Data!$ER$33:$EU$82,$D45,4),\"\")))),\"\")","v":0},"","","","",0,0,0,"","",0,0,0,"","",0,0,0,0,0,"","","",""]
[null,{"$f":"'Report A'!$B49","v":"2014-07-18"},{"$f":"'Report A'!$C49","v":"Friday"},{"$f":"'Report A'!$D49","v":18},0,{"$f":"IFERROR(IF($K$15=Data!$J$14,INDEX(Data!$EF$33:$EI$82,$D46,1),IF($K$15=Data!$J$15,INDEX(Data!$EJ$33:$EM$82,$D46,1),IF($K$15=Data!$J$16,INDEX(Data!$EN$33:$EQ$82,$D46,1),IF($K$15=Data!$J$17,INDEX(Data!$ER$33:$EU$82,$D46,1),\"\")))),\"\")","v":0},{"$f":"IFERROR(IF($K$15=Data!$J$14,INDEX(Data!$EF$33:$EI$82,$D46,2),IF($K$15=Data!$J$15,INDEX(Data!$EJ$33:$EM$82,$D46,2),IF($K$15=Data!$J$16,INDEX(Data!$EN$33:$EQ$82,$D46,2),IF($K$15=Data!$J$17,INDEX(Data!$ER$33:$EU$82,$D46,2),\"\")))),\"\")","v":0},{"$f":"IFERROR(IF($K$15=Data!$J$14,INDEX(Data!$EF$33:$EI$82,$D46,3),IF($K$15=Data!$J$15,INDEX(Data!$EJ$33:$EM$82,$D46,3),IF($K$15=Data!$J$16,INDEX(Data!$EN$33:$EQ$82,$D46,3),IF($K$15=Data!$J$17,INDEX(Data!$ER$33:$EU$82,$D46,3),\"\")))),\"\")","v":0},{"$f":"IFERROR(IF($K$15=Data!$J$14,INDEX(Data!$EF$33:$EI$82,$D46,4),IF($K$15=Data!$J$15,INDEX(Data!$EJ$33:$EM$82,$D46,4),IF($K$15=Data!$J$16,INDEX(Data!$EN$33:$EQ$82,$D46,4),IF($K$15=Data!$J$17,INDEX(Data!$ER$33:$EU$82,$D46,4),\"\")))),\"\")","v":0},"","","","",0,0,0,"","",0,0,0,"","",0,0,0,0,0,"","","","","CHART G3"]
[null,{"$f":"'Report A'!$B50","v":"2014-07-19"},{"$f":"'Report A'!$C50","v":"Saturday"},{"$f":"'Report A'!$D50","v":19},0,{"$f":"IFERROR(IF($K$15=Data!$J$14,INDEX(Data!$EF$33:$EI$82,$D47,1),IF($K$15=Data!$J$15,INDEX(Data!$EJ$33:$EM$82,$D47,1),IF($K$15=Data!$J$16,INDEX(Data!$EN$33:$EQ$82,$D47,1),IF($K$15=Data!$J$17,INDEX(Data!$ER$33:$EU$82,$D47,1),\"\")))),\"\")","v":0},{"$f":"IFERROR(IF($K$15=Data!$J$14,INDEX(Data!$EF$33:$EI$82,$D47,2),IF($K$15=Data!$J$15,INDEX(Data!$EJ$33:$EM$82,$D47,2),IF($K$15=Data!$J$16,INDEX(Data!$EN$33:$EQ$82,$D47,2),IF($K$15=Data!$J$17,INDEX(Data!$ER$33:$EU$82,$D47,2),\"\")))),\"\")","v":0},{"$f":"IFERROR(IF($K$15=Data!$J$14,INDEX(Data!$EF$33:$EI$82,$D47,3),IF($K$15=Data!$J$15,INDEX(Data!$EJ$33:$EM$82,$D47,3),IF($K$15=Data!$J$16,INDEX(Data!$EN$33:$EQ$82,$D47,3),IF($K$15=Data!$J$17,INDEX(Data!$ER$33:$EU$82,$D47,3),\"\")))),\"\")","v":0},{"$f":"IFERROR(IF($K$15=Data!$J$14,INDEX(Data!$EF$33:$EI$82,$D47,4),IF($K$15=Data!$J$15,INDEX(Data!$EJ$33:$EM$82,$D47,4),IF($K$15=Data!$J$16,INDEX(Data!$EN$33:$EQ$82,$D47,4),IF($K$15=Data!$J$17,INDEX(Data!$ER$33:$EU$82,$D47,4),\"\")))),\"\")","v":0},"","","","",0,0,0,"","",0,0,0,"","",0,0,0,0,0,"","","",""]
[null,{"$f":"'Report A'!$B51","v":"2014-07-20"},{"$f":"'Report A'!$C51","v":"Sunday"},{"$f":"'Report A'!$D51","v":20},0,{"$f":"IFERROR(IF($K$15=Data!$J$14,INDEX(Data!$EF$33:$EI$82,$D48,1),IF($K$15=Data!$J$15,INDEX(Data!$EJ$33:$EM$82,$D48,1),IF($K$15=Data!$J$16,INDEX(Data!$EN$33:$EQ$82,$D48,1),IF($K$15=Data!$J$17,INDEX(Data!$ER$33:$EU$82,$D48,1),\"\")))),\"\")","v":0},{"$f":"IFERROR(IF($K$15=Data!$J$14,INDEX(Data!$EF$33:$EI$82,$D48,2),IF($K$15=Data!$J$15,INDEX(Data!$EJ$33:$EM$82,$D48,2),IF($K$15=Data!$J$16,INDEX(Data!$EN$33:$EQ$82,$D48,2),IF($K$15=Data!$J$17,INDEX(Data!$ER$33:$EU$82,$D48,2),\"\")))),\"\")","v":0},{"$f":"IFERROR(IF($K$15=Data!$J$14,INDEX(Data!$EF$33:$EI$82,$D48,3),IF($K$15=Data!$J$15,INDEX(Data!$EJ$33:$EM$82,$D48,3),IF($K$15=Data!$J$16,INDEX(Data!$EN$33:$EQ$82,$D48,3),IF($K$15=Data!$J$17,INDEX(Data!$ER$33:$EU$82,$D48,3),\"\")))),\"\")","v":0},{"$f":"IFERROR(IF($K$15=Data!$J$14,INDEX(Data!$EF$33:$EI$82,$D48,4),IF($K$15=Data!$J$15,INDEX(Data!$EJ$33:$EM$82,$D48,4),IF($K$15=Data!$J$16,INDEX(Data!$EN$33:$EQ$82,$D48,4),IF($K$15=Data!$J$17,INDEX(Data!$ER$33:$EU$82,$D48,4),\"\")))),\"\")","v":0},"","","","",0,0,0,"","",0,0,0,"","",0,0,0,0,0,"","","",""]
[null,{"$f":"'Report A'!$B52","v":"2014-07-21"},{"$f":"'Report A'!$C52","v":"Monday"},{"$f":"'Report A'!$D52","v":21},0,{"$f":"IFERROR(IF($K$15=Data!$J$14,INDEX(Data!$EF$33:$EI$82,$D49,1),IF($K$15=Data!$J$15,INDEX(Data!$EJ$33:$EM$82,$D49,1),IF($K$15=Data!$J$16,INDEX(Data!$EN$33:$EQ$82,$D49,1),IF($K$15=Data!$J$17,INDEX(Data!$ER$33:$EU$82,$D49,1),\"\")))),\"\")","v":0},{"$f":"IFERROR(IF($K$15=Data!$J$14,INDEX(Data!$EF$33:$EI$82,$D49,2),IF($K$15=Data!$J$15,INDEX(Data!$EJ$33:$EM$82,$D49,2),IF($K$15=Data!$J$16,INDEX(Data!$EN$33:$EQ$82,$D49,2),IF($K$15=Data!$J$17,INDEX(Data!$ER$33:$EU$82,$D49,2),\"\")))),\"\")","v":0},{"$f":"IFERROR(IF($K$15=Data!$J$14,INDEX(Data!$EF$33:$EI$82,$D49,3),IF($K$15=Data!$J$15,INDEX(Data!$EJ$33:$EM$82,$D49,3),IF($K$15=Data!$J$16,INDEX(Data!$EN$33:$EQ$82,$D49,3),IF($K$15=Data!$J$17,INDEX(Data!$ER$33:$EU$82,$D49,3),\"\")))),\"\")","v":0},{"$f":"IFERROR(IF($K$15=Data!$J$14,INDEX(Data!$EF$33:$EI$82,$D49,4),IF($K$15=Data!$J$15,INDEX(Data!$EJ$33:$EM$82,$D49,4),IF($K$15=Data!$J$16,INDEX(Data!$EN$33:$EQ$82,$D49,4),IF($K$15=Data!$J$17,INDEX(Data!$ER$33:$EU$82,$D49,4),\"\")))),\"\")","v":0},"","","","",0,0,0,"","",0,0,0,"","",0,0,0,0,0,"","","",""]
[null,{"$f":"'Report A'!$B53","v":"2014-07-22"},{"$f":"'Report A'!$C53","v":"Tuesday"},{"$f":"'Report A'!$D53","v":22},0,{"$f":"IFERROR(IF($K$15=Data!$J$14,INDEX(Data!$EF$33:$EI$82,$D50,1),IF($K$15=Data!$J$15,INDEX(Data!$EJ$33:$EM$82,$D50,1),IF($K$15=Data!$J$16,INDEX(Data!$EN$33:$EQ$82,$D50,1),IF($K$15=Data!$J$17,INDEX(Data!$ER$33:$EU$82,$D50,1),\"\")))),\"\")","v":0},{"$f":"IFERROR(IF($K$15=Data!$J$14,INDEX(Data!$EF$33:$EI$82,$D50,2),IF($K$15=Data!$J$15,INDEX(Data!$EJ$33:$EM$82,$D50,2),IF($K$15=Data!$J$16,INDEX(Data!$EN$33:$EQ$82,$D50,2),IF($K$15=Data!$J$17,INDEX(Data!$ER$33:$EU$82,$D50,2),\"\")))),\"\")","v":0},{"$f":"IFERROR(IF($K$15=Data!$J$14,INDEX(Data!$EF$33:$EI$82,$D50,3),IF($K$15=Data!$J$15,INDEX(Data!$EJ$33:$EM$82,$D50,3),IF($K$15=Data!$J$16,INDEX(Data!$EN$33:$EQ$82,$D50,3),IF($K$15=Data!$J$17,INDEX(Data!$ER$33:$EU$82,$D50,3),\"\")))),\"\")","v":0},{"$f":"IFERROR(IF($K$15=Data!$J$14,INDEX(Data!$EF$33:$EI$82,$D50,4),IF($K$15=Data!$J$15,INDEX(Data!$EJ$33:$EM$82,$D50,4),IF($K$15=Data!$J$16,INDEX(Data!$EN$33:$EQ$82,$D50,4),IF($K$15=Data!$J$17,INDEX(Data!$ER$33:$EU$82,$D50,4),\"\")))),\"\")","v":0},"","","","",0,0,0,"","",0,0,0,"","",0,0,0,0,0,"","","",""]
[null,{"$f":"'Report A'!$B54","v":"2014-07-23"},{"$f":"'Report A'!$C54","v":"Wednesday"},{"$f":"'Report A'!$D54","v":23},0,{"$f":"IFERROR(IF($K$15=Data!$J$14,INDEX(Data!$EF$33:$EI$82,$D51,1),IF($K$15=Data!$J$15,INDEX(Data!$EJ$33:$EM$82,$D51,1),IF($K$15=Data!$J$16,INDEX(Data!$EN$33:$EQ$82,$D51,1),IF($K$15=Data!$J$17,INDEX(Data!$ER$33:$EU$82,$D51,1),\"\")))),\"\")","v":0},{"$f":"IFERROR(IF($K$15=Data!$J$14,INDEX(Data!$EF$33:$EI$82,$D51,2),IF($K$15=Data!$J$15,INDEX(Data!$EJ$33:$EM$82,$D51,2),IF($K$15=Data!$J$16,INDEX(Data!$EN$33:$EQ$82,$D51,2),IF($K$15=Data!$J$17,INDEX(Data!$ER$33:$EU$82,$D51,2),\"\")))),\"\")","v":0},{"$f":"IFERROR(IF($K$15=Data!$J$14,INDEX(Data!$EF$33:$EI$82,$D51,3),IF($K$15=Data!$J$15,INDEX(Data!$EJ$33:$EM$82,$D51,3),IF($K$15=Data!$J$16,INDEX(Data!$EN$33:$EQ$82,$D51,3),IF($K$15=Data!$J$17,INDEX(Data!$ER$33:$EU$82,$D51,3),\"\")))),\"\")","v":0},{"$f":"IFERROR(IF($K$15=Data!$J$14,INDEX(Data!$EF$33:$EI$82,$D51,4),IF($K$15=Data!$J$15,INDEX(Data!$EJ$33:$EM$82,$D51,4),IF($K$15=Data!$J$16,INDEX(Data!$EN$33:$EQ$82,$D51,4),IF($K$15=Data!$J$17,INDEX(Data!$ER$33:$EU$82,$D51,4),\"\")))),\"\")","v":0},"","","","",0,0,0,"","",0,0,0,"","",0,0,0,0,0,"","","",""]
[null,{"$f":"'Report A'!$B55","v":"2014-07-24"},{"$f":"'Report A'!$C55","v":"Thursday"},{"$f":"'Report A'!$D55","v":24},0,{"$f":"IFERROR(IF($K$15=Data!$J$14,INDEX(Data!$EF$33:$EI$82,$D52,1),IF($K$15=Data!$J$15,INDEX(Data!$EJ$33:$EM$82,$D52,1),IF($K$15=Data!$J$16,INDEX(Data!$EN$33:$EQ$82,$D52,1),IF($K$15=Data!$J$17,INDEX(Data!$ER$33:$EU$82,$D52,1),\"\")))),\"\")","v":0},{"$f":"IFERROR(IF($K$15=Data!$J$14,INDEX(Data!$EF$33:$EI$82,$D52,2),IF($K$15=Data!$J$15,INDEX(Data!$EJ$33:$EM$82,$D52,2),IF($K$15=Data!$J$16,INDEX(Data!$EN$33:$EQ$82,$D52,2),IF($K$15=Data!$J$17,INDEX(Data!$ER$33:$EU$82,$D52,2),\"\")))),\"\")","v":0},{"$f":"IFERROR(IF($K$15=Data!$J$14,INDEX(Data!$EF$33:$EI$82,$D52,3),IF($K$15=Data!$J$15,INDEX(Data!$EJ$33:$EM$82,$D52,3),IF($K$15=Data!$J$16,INDEX(Data!$EN$33:$EQ$82,$D52,3),IF($K$15=Data!$J$17,INDEX(Data!$ER$33:$EU$82,$D52,3),\"\")))),\"\")","v":0},{"$f":"IFERROR(IF($K$15=Data!$J$14,INDEX(Data!$EF$33:$EI$82,$D52,4),IF($K$15=Data!$J$15,INDEX(Data!$EJ$33:$EM$82,$D52,4),IF($K$15=Data!$J$16,INDEX(Data!$EN$33:$EQ$82,$D52,4),IF($K$15=Data!$J$17,INDEX(Data!$ER$33:$EU$82,$D52,4),\"\")))),\"\")","v":0},"","","","",0,0,0,"","",0,0,0,"","",0,0,0,0,0,"","","",""]
[null,{"$f":"'Report A'!$B56","v":"2014-07-25"},{"$f":"'Report A'!$C56","v":"Friday"},{"$f":"'Report A'!$D56","v":25},0,{"$f":"IFERROR(IF($K$15=Data!$J$14,INDEX(Data!$EF$33:$EI$82,$D53,1),IF($K$15=Data!$J$15,INDEX(Data!$EJ$33:$EM$82,$D53,1),IF($K$15=Data!$J$16,INDEX(Data!$EN$33:$EQ$82,$D53,1),IF($K$15=Data!$J$17,INDEX(Data!$ER$33:$EU$82,$D53,1),\"\")))),\"\")","v":0},{"$f":"IFERROR(IF($K$15=Data!$J$14,INDEX(Data!$EF$33:$EI$82,$D53,2),IF($K$15=Data!$J$15,INDEX(Data!$EJ$33:$EM$82,$D53,2),IF($K$15=Data!$J$16,INDEX(Data!$EN$33:$EQ$82,$D53,2),IF($K$15=Data!$J$17,INDEX(Data!$ER$33:$EU$82,$D53,2),\"\")))),\"\")","v":0},{"$f":"IFERROR(IF($K$15=Data!$J$14,INDEX(Data!$EF$33:$EI$82,$D53,3),IF($K$15=Data!$J$15,INDEX(Data!$EJ$33:$EM$82,$D53,3),IF($K$15=Data!$J$16,INDEX(Data!$EN$33:$EQ$82,$D53,3),IF($K$15=Data!$J$17,INDEX(Data!$ER$33:$EU$82,$D53,3),\"\")))),\"\")","v":0},{"$f":"IFERROR(IF($K$15=Data!$J$14,INDEX(Data!$EF$33:$EI$82,$D53,4),IF($K$15=Data!$J$15,INDEX(Data!$EJ$33:$EM$82,$D53,4),IF($K$15=Data!$J$16,INDEX(Data!$EN$33:$EQ$82,$D53,4),IF($K$15=Data!$J$17,INDEX(Data!$ER$33:$EU$82,$D53,4),\"\")))),\"\")","v":0},"","","","",0,0,0,"","",0,0,0,"","",0,0,0,0,0,"","","",""]
[null,{"$f":"'Report A'!$B57","v":"2014-07-26"},{"$f":"'Report A'!$C57","v":"Saturday"},{"$f":"'Report A'!$D57","v":26},0,{"$f":"IFERROR(IF($K$15=Data!$J$14,INDEX(Data!$EF$33:$EI$82,$D54,1),IF($K$15=Data!$J$15,INDEX(Data!$EJ$33:$EM$82,$D54,1),IF($K$15=Data!$J$16,INDEX(Data!$EN$33:$EQ$82,$D54,1),IF($K$15=Data!$J$17,INDEX(Data!$ER$33:$EU$82,$D54,1),\"\")))),\"\")","v":0},{"$f":"IFERROR(IF($K$15=Data!$J$14,INDEX(Data!$EF$33:$EI$82,$D54,2),IF($K$15=Data!$J$15,INDEX(Data!$EJ$33:$EM$82,$D54,2),IF($K$15=Data!$J$16,INDEX(Data!$EN$33:$EQ$82,$D54,2),IF($K$15=Data!$J$17,INDEX(Data!$ER$33:$EU$82,$D54,2),\"\")))),\"\")","v":0},{"$f":"IFERROR(IF($K$15=Data!$J$14,INDEX(Data!$EF$33:$EI$82,$D54,3),IF($K$15=Data!$J$15,INDEX(Data!$EJ$33:$EM$82,$D54,3),IF($K$15=Data!$J$16,INDEX(Data!$EN$33:$EQ$82,$D54,3),IF($K$15=Data!$J$17,INDEX(Data!$ER$33:$EU$82,$D54,3),\"\")))),\"\")","v":0},{"$f":"IFERROR(IF($K$15=Data!$J$14,INDEX(Data!$EF$33:$EI$82,$D54,4),IF($K$15=Data!$J$15,INDEX(Data!$EJ$33:$EM$82,$D54,4),IF($K$15=Data!$J$16,INDEX(Data!$EN$33:$EQ$82,$D54,4),IF($K$15=Data!$J$17,INDEX(Data!$ER$33:$EU$82,$D54,4),\"\")))),\"\")","v":0},"","","","",0,0,0,"","",0,0,0,"","",0,0,0,0,0,"","","",""]
[null,{"$f":"'Report A'!$B58","v":"2014-07-27"},{"$f":"'Report A'!$C58","v":"Sunday"},{"$f":"'Report A'!$D58","v":27},0,{"$f":"IFERROR(IF($K$15=Data!$J$14,INDEX(Data!$EF$33:$EI$82,$D55,1),IF($K$15=Data!$J$15,INDEX(Data!$EJ$33:$EM$82,$D55,1),IF($K$15=Data!$J$16,INDEX(Data!$EN$33:$EQ$82,$D55,1),IF($K$15=Data!$J$17,INDEX(Data!$ER$33:$EU$82,$D55,1),\"\")))),\"\")","v":0},{"$f":"IFERROR(IF($K$15=Data!$J$14,INDEX(Data!$EF$33:$EI$82,$D55,2),IF($K$15=Data!$J$15,INDEX(Data!$EJ$33:$EM$82,$D55,2),IF($K$15=Data!$J$16,INDEX(Data!$EN$33:$EQ$82,$D55,2),IF($K$15=Data!$J$17,INDEX(Data!$ER$33:$EU$82,$D55,2),\"\")))),\"\")","v":0},{"$f":"IFERROR(IF($K$15=Data!$J$14,INDEX(Data!$EF$33:$EI$82,$D55,3),IF($K$15=Data!$J$15,INDEX(Data!$EJ$33:$EM$82,$D55,3),IF($K$15=Data!$J$16,INDEX(Data!$EN$33:$EQ$82,$D55,3),IF($K$15=Data!$J$17,INDEX(Data!$ER$33:$EU$82,$D55,3),\"\")))),\"\")","v":0},{"$f":"IFERROR(IF($K$15=Data!$J$14,INDEX(Data!$EF$33:$EI$82,$D55,4),IF($K$15=Data!$J$15,INDEX(Data!$EJ$33:$EM$82,$D55,4),IF($K$15=Data!$J$16,INDEX(Data!$EN$33:$EQ$82,$D55,4),IF($K$15=Data!$J$17,INDEX(Data!$ER$33:$EU$82,$D55,4),\"\")))),\"\")","v":0},"","","","",0,0,0,"","",0,0,0,"","",0,0,0,0,0,"","","",""]
[null,{"$f":"'Report A'!$B59","v":"2014-07-28"},{"$f":"'Report A'!$C59","v":"Monday"},{"$f":"'Report A'!$D59","v":28},0,{"$f":"IFERROR(IF($K$15=Data!$J$14,INDEX(Data!$EF$33:$EI$82,$D56,1),IF($K$15=Data!$J$15,INDEX(Data!$EJ$33:$EM$82,$D56,1),IF($K$15=Data!$J$16,INDEX(Data!$EN$33:$EQ$82,$D56,1),IF($K$15=Data!$J$17,INDEX(Data!$ER$33:$EU$82,$D56,1),\"\")))),\"\")","v":0},{"$f":"IFERROR(IF($K$15=Data!$J$14,INDEX(Data!$EF$33:$EI$82,$D56,2),IF($K$15=Data!$J$15,INDEX(Data!$EJ$33:$EM$82,$D56,2),IF($K$15=Data!$J$16,INDEX(Data!$EN$33:$EQ$82,$D56,2),IF($K$15=Data!$J$17,INDEX(Data!$ER$33:$EU$82,$D56,2),\"\")))),\"\")","v":0},{"$f":"IFERROR(IF($K$15=Data!$J$14,INDEX(Data!$EF$33:$EI$82,$D56,3),IF($K$15=Data!$J$15,INDEX(Data!$EJ$33:$EM$82,$D56,3),IF($K$15=Data!$J$16,INDEX(Data!$EN$33:$EQ$82,$D56,3),IF($K$15=Data!$J$17,INDEX(Data!$ER$33:$EU$82,$D56,3),\"\")))),\"\")","v":0},{"$f":"IFERROR(IF($K$15=Data!$J$14,INDEX(Data!$EF$33:$EI$82,$D56,4),IF($K$15=Data!$J$15,INDEX(Data!$EJ$33:$EM$82,$D56,4),IF($K$15=Data!$J$16,INDEX(Data!$EN$33:$EQ$82,$D56,4),IF($K$15=Data!$J$17,INDEX(Data!$ER$33:$EU$82,$D56,4),\"\")))),\"\")","v":0},"","","","",0,0,0,"","",0,0,0,"","",0,0,0,0,0,"","","",""]
[null,{"$f":"'Report A'!$B60","v":"2014-07-29"},{"$f":"'Report A'!$C60","v":"Tuesday"},{"$f":"'Report A'!$D60","v":29},0,{"$f":"IFERROR(IF($K$15=Data!$J$14,INDEX(Data!$EF$33:$EI$82,$D57,1),IF($K$15=Data!$J$15,INDEX(Data!$EJ$33:$EM$82,$D57,1),IF($K$15=Data!$J$16,INDEX(Data!$EN$33:$EQ$82,$D57,1),IF($K$15=Data!$J$17,INDEX(Data!$ER$33:$EU$82,$D57,1),\"\")))),\"\")","v":0},{"$f":"IFERROR(IF($K$15=Data!$J$14,INDEX(Data!$EF$33:$EI$82,$D57,2),IF($K$15=Data!$J$15,INDEX(Data!$EJ$33:$EM$82,$D57,2),IF($K$15=Data!$J$16,INDEX(Data!$EN$33:$EQ$82,$D57,2),IF($K$15=Data!$J$17,INDEX(Data!$ER$33:$EU$82,$D57,2),\"\")))),\"\")","v":0},{"$f":"IFERROR(IF($K$15=Data!$J$14,INDEX(Data!$EF$33:$EI$82,$D57,3),IF($K$15=Data!$J$15,INDEX(Data!$EJ$33:$EM$82,$D57,3),IF($K$15=Data!$J$16,INDEX(Data!$EN$33:$EQ$82,$D57,3),IF($K$15=Data!$J$17,INDEX(Data!$ER$33:$EU$82,$D57,3),\"\")))),\"\")","v":0},{"$f":"IFERROR(IF($K$15=Data!$J$14,INDEX(Data!$EF$33:$EI$82,$D57,4),IF($K$15=Data!$J$15,INDEX(Data!$EJ$33:$EM$82,$D57,4),IF($K$15=Data!$J$16,INDEX(Data!$EN$33:$EQ$82,$D57,4),IF($K$15=Data!$J$17,INDEX(Data!$ER$33:$EU$82,$D57,4),\"\")))),\"\")","v":0},"","","","",0,0,0,"","",0,0,0,"","",0,0,0,0,0,"","","",""]
[null,{"$f":"'Report A'!$B61","v":"2014-07-30"},{"$f":"'Report A'!$C61","v":"Wednesday"},{"$f":"'Report A'!$D61","v":30},0,{"$f":"IFERROR(IF($K$15=Data!$J$14,INDEX(Data!$EF$33:$EI$82,$D58,1),IF($K$15=Data!$J$15,INDEX(Data!$EJ$33:$EM$82,$D58,1),IF($K$15=Data!$J$16,INDEX(Data!$EN$33:$EQ$82,$D58,1),IF($K$15=Data!$J$17,INDEX(Data!$ER$33:$EU$82,$D58,1),\"\")))),\"\")","v":0},{"$f":"IFERROR(IF($K$15=Data!$J$14,INDEX(Data!$EF$33:$EI$82,$D58,2),IF($K$15=Data!$J$15,INDEX(Data!$EJ$33:$EM$82,$D58,2),IF($K$15=Data!$J$16,INDEX(Data!$EN$33:$EQ$82,$D58,2),IF($K$15=Data!$J$17,INDEX(Data!$ER$33:$EU$82,$D58,2),\"\")))),\"\")","v":0},{"$f":"IFERROR(IF($K$15=Data!$J$14,INDEX(Data!$EF$33:$EI$82,$D58,3),IF($K$15=Data!$J$15,INDEX(Data!$EJ$33:$EM$82,$D58,3),IF($K$15=Data!$J$16,INDEX(Data!$EN$33:$EQ$82,$D58,3),IF($K$15=Data!$J$17,INDEX(Data!$ER$33:$EU$82,$D58,3),\"\")))),\"\")","v":0},{"$f":"IFERROR(IF($K$15=Data!$J$14,INDEX(Data!$EF$33:$EI$82,$D58,4),IF($K$15=Data!$J$15,INDEX(Data!$EJ$33:$EM$82,$D58,4),IF($K$15=Data!$J$16,INDEX(Data!$EN$33:$EQ$82,$D58,4),IF($K$15=Data!$J$17,INDEX(Data!$ER$33:$EU$82,$D58,4),\"\")))),\"\")","v":0},"","","","",0,0,0,"","",0,0,0,"","",0,0,0,0,0,"","","",""]
[null,{"$f":"'Report A'!$B62","v":"2014-07-31"},{"$f":"'Report A'!$C62","v":"Thursday"},{"$f":"'Report A'!$D62","v":31},0,{"$f":"IFERROR(IF($K$15=Data!$J$14,INDEX(Data!$EF$33:$EI$82,$D59,1),IF($K$15=Data!$J$15,INDEX(Data!$EJ$33:$EM$82,$D59,1),IF($K$15=Data!$J$16,INDEX(Data!$EN$33:$EQ$82,$D59,1),IF($K$15=Data!$J$17,INDEX(Data!$ER$33:$EU$82,$D59,1),\"\")))),\"\")","v":0},{"$f":"IFERROR(IF($K$15=Data!$J$14,INDEX(Data!$EF$33:$EI$82,$D59,2),IF($K$15=Data!$J$15,INDEX(Data!$EJ$33:$EM$82,$D59,2),IF($K$15=Data!$J$16,INDEX(Data!$EN$33:$EQ$82,$D59,2),IF($K$15=Data!$J$17,INDEX(Data!$ER$33:$EU$82,$D59,2),\"\")))),\"\")","v":0},{"$f":"IFERROR(IF($K$15=Data!$J$14,INDEX(Data!$EF$33:$EI$82,$D59,3),IF($K$15=Data!$J$15,INDEX(Data!$EJ$33:$EM$82,$D59,3),IF($K$15=Data!$J$16,INDEX(Data!$EN$33:$EQ$82,$D59,3),IF($K$15=Data!$J$17,INDEX(Data!$ER$33:$EU$82,$D59,3),\"\")))),\"\")","v":0},{"$f":"IFERROR(IF($K$15=Data!$J$14,INDEX(Data!$EF$33:$EI$82,$D59,4),IF($K$15=Data!$J$15,INDEX(Data!$EJ$33:$EM$82,$D59,4),IF($K$15=Data!$J$16,INDEX(Data!$EN$33:$EQ$82,$D59,4),IF($K$15=Data!$J$17,INDEX(Data!$ER$33:$EU$82,$D59,4),\"\")))),\"\")","v":0},"","","","",0,0,0,"","",0,0,0,"","",0,0,0,0,0,"","","",""]